{"text_format":"1","workbook":"xlsx","n_sheets":26,"sheets":["Menu","Links","Corn","CornReducedTill","Cotton","CoastalEstablishFarmland","CoastalEstablishNative","CoastalHay","CoastalPasture","Sorghum","Wheat","Canola","Barley","OatsGrain","SmallGrainGrazing","CornSilageDryland","CornSilageIrrigated","CowCalfImprove","CowCalfNative","StockersNative","Livestock Budget","Crop Budget","Comparative Returns - Cash Rent","Comparative Returns-Share Rent","Your Returns - Cash Rent","Your Returns-Share Rent"],"not_rendered":{"charts":0,"images":9,"macros":1,"external_links":0,"defined_names":823,"comments":20,"pivot_tables":0},"unopened":[],"bounds":{"document_bytes":16777216,"sheet_cells":100000,"rows_first":2000,"rows_last":500,"rows_between":2000,"halvings":0,"cell_chars":16384,"cell_head_chars":4096},"cells_cut":0,"cells_raw":0,"read":"whole","date_system":"1900"}

{"sheet":"Menu","index":0,"n_rows":58,"n_cols":26,"rows_kept":58,"cut":false,"hidden":false,"merged":[[5,0,5,5]]}
[null,null,null,null,null,null,null,null,null,null,null,null,null,null,null,null,null,null,null,null,null,null,null,null,null,3]
[]
[]
[null,null,null,null,null,null,null,null,null,null,null,null,null,null,null,null,null,null,null,null,null,null,null,null,null,2]
[]
["      Central Texas Extension District - 8      "]
[]
[null,null,null,"Budgets"]
[]
[]
[null,null,null,"Forage Crops"]
[]
[null,null,null,{"$f":"CoastalEstablishFarmland!A3","v":"Coastal Bermudagrass Establishment - Farmland"}]
[null,null,null,{"$f":"CoastalEstablishNative!A3","v":"Coastal Bermudagrass Establishment - Native Prairie"}]
[null,null,null,{"$f":"CoastalHay!A3","v":"Coastal Bermudagrass Hay"}]
[null,null,null,{"$f":"CoastalPasture!A3","v":"Coastal Bermudagrass Pasture"}]
[null,null,null,{"$f":"SmallGrainGrazing!A3","v":"Small Grain with Grazing"}]
[null,"Comparative Returns",null,{"$f":"CornSilageDryland!A3","v":"RR Corn Silage - Dryland"}]
[null,null,null,{"$f":"CornSilageIrrigated!A3","v":"RR Corn Silage - Irrigated"}]
[null,"Links"]
[null,null,null,"Field Crops"]
[]
[null,null,null,{"$f":"Barley!A3","v":"Malting Barley"}]
[null,null,null,{"$f":"Canola!A3","v":"Canola"}]
[null,null,null,{"$f":"+Corn!A3","v":"Herbicide Resistant Corn"}]
[null,null,null,{"$f":"CornReducedTill!A3","v":"Herbicide Resistant Corn - Reduced Tillage"}]
[null,null,null,{"$f":"Cotton!A3","v":"Stacked Cotton"}]
[null,null,null,{"$f":"OatsGrain!A3","v":"Oats for Grain"}]
[null,null,null,{"$f":"Sorghum!A3","v":"Grain Sorghum"}]
[null,null,null,{"$f":"Wheat!A3","v":"Hard Red Winter Wheat"}]
[]
[null,null,null,"Livestock"]
[]
[null,null,null,{"$f":"+CowCalfImprove!A3","v":"Cow-Calf Improved Pasture"}]
[null,null,null,{"$f":"CowCalfNative!A3","v":"Cow-Calf Native Pasture"}]
[null,null,null,{"$f":"+StockersNative!A3","v":"Stockers on Native Pasture"}]
[]
[null,null,null,"Other Budgets"]
[]
[null,null,null,{"$f":"'Livestock Budget'!A3","v":"Livestock Budget"}]
[null,null,null,{"$f":"'Crop Budget'!A3","v":"Crop Enterprise"}]
[]
[]
[]
[]
[]
[]
[]
[]
[]
[]
[]
[]
[]
[]
[]
[]
["  Developed by Jason Johnson, Associate Professor and Extension Economist, Texas A&M AgriLife Extension, 254-968-4144.  "]

{"sheet":"Links","index":1,"n_rows":26,"n_cols":7,"rows_kept":26,"cut":false,"hidden":false,"merged":[[11,1,11,2],[13,1,13,2],[15,1,15,2],[17,1,17,2],[19,1,19,2],[21,1,21,2],[1,1,1,8],[2,1,2,8],[3,1,3,8],[5,1,5,8],[7,1,7,2],[9,1,9,2]]}
[]
[null,"Texas Crop and Livestock Budgets"]
[null,"A Program of the Texas A&M AgriLife Extension Service"]
[null,"Agricultural Economics Department, The Texas A&M University System"]
[]
[null,"Developed by Texas A&M AgriLife Extension Service Economists and Other Specialists"]
[]
[null,"Contact Us",null,null,null,null,"Clickable Logos"]
[]
[null,"Resources"]
[]
[null,"Decision Aids (includes Machinery Cost Estimator)"]
[]
[null,"Custom Rate Survey"]
[]
[null,"Basis Data"]
[]
[null,"Master Marketer"]
[]
[null,"Extension Ag Economics"]
[]
[null,"Department of Agricultural Economics"]
[]
[null,"Menu Page"]
[]
[null,"Links last checked 1/25/2024"]

{"sheet":"Corn","index":2,"n_rows":106,"n_cols":18,"rows_kept":106,"cut":false,"hidden":false,"merged":[[83,3,83,8],[93,3,93,8],[105,0,105,11],[0,0,0,11],[1,0,1,11],[2,0,2,11],[3,0,3,11]]}
["Projections for Planning Purposes Only -- Not to be Used without Updating"]
["2024 Estimated Costs and Returns per Acre"]
["Herbicide Resistant Corn"]
["Enter your name for this budget in the cell above."]
["Enter  Your Values in the cells highlighed in MAROON."]
[null,null,null,null,"Your Acres",null,null,null,null,null,null,null,null,null,null,null,null,"Your"]
[null,null,"Crop Acres",500,null,null,null,null,null,null,null,"Your",null,null,null,null,"Enterprise","Enterprise"]
[null,null,null,null,"Your",null,null,"Your","Cash","Your","Landlord","Landlord",null,"Your",null,"Your","Total","Total"]
["REVENUE",null,null,"Quantity","Quantity","Units","$/Unit","$/Unit","Total","Total","Share","Share","Landlord","Landlord","Tenant","Tenant","(500 acres)",{"$f":"\"(\" & E7 & \" acres)\"","v":"( acres)"}]
[null,"Corn",null,90,null,"Bushel",5.25,null,472.5,{"$f":"E10*H10","v":0},0,null,0,{"$f":"J10*L10","v":0},472.5,{"$f":"+J10-N10","v":0},236250,{"$f":"+J10*E$7","v":0}]
[null,null,null,0,null,null,0,null,0,0,0,null,0,0,0,0,0,0]
[null,null,null,0,null,null,0,null,0,0,0,null,0,0,0,0,0,0]
["Total Revenue",null,null,null,null,null,null,null,472.5,{"$f":"SUM(J10:J12)","v":0},null,null,0,{"$f":"SUM(N10:N12)","v":0},472.5,{"$f":"SUM(P10:P12)","v":0},236250,{"$f":"SUM(R10:R12)","v":0}]
[null,null,null,null,null,null,null,null,null,null,null,null,null,null,null,null,"Enterprise","Enterprise"]
["VARIABLE COSTS",null,null,"Quantity","Quantity","Units","$/Unit","$/Unit","Total","Total","Share","Share","Landlord","Landlord","Tenant","Tenant","Total","Total"]
["Production Costs"]
[null,"Fertilizer"]
[null,"","Fertilizer - N, P, Zinc, S",1,null,"Acre",165,null,165,{"$f":"E18*H18","v":0},0,null,0,{"$f":"J18*L18","v":0},165,{"$f":"+J18-N18","v":0},82500,{"$f":"+J18*E$7","v":0}]
[null,"Herbicide"]
[null,"","Herbicide, Atrazine",2,null,"Pound",7.5,null,15,0,0,null,0,0,15,0,7500,0]
[null,"","Corn Herbicide",32,null,"Ounce",0.2,null,6.4,0,0,null,0,0,6.4,0,3200,0]
[null,"","Weed Burndown",32,null,"Ounce",0.2,null,6.4,0,0,null,0,0,6.4,0,3200,0]
[null,"Seed"]
[null,"","Herbicide Resistant Corn Seed",1,null,"Acre",140,null,140,0,0,null,0,0,140,0,70000,0]
[null,"Miscellaneous"]
[null,"","Insurance - Corn 70%",1,null,"Acre",18,null,18,0,0,null,0,0,18,0,9000,0]
[null,"","Insurance - Corn SCO",1,null,"Acre",5,null,5,0,0,null,0,0,5,0,2500,0]
[null,"Custom"]
[null,"","Liquid Fertilizer Rig",1,null,"Acre",8,null,8,0,0,null,0,0,8,0,4000,0]
[null,"","Custom Grain Haul",90,null,"Bushel",0.25,null,22.5,0,0,null,0,0,22.5,0,11250,0]
[null,"Insecticide"]
[null,"","Corn Insecticide",1,null,"Acre",18,null,18,0,0,null,0,0,18,0,9000,0]
[null,null,null,0,null,null,0,null,0,0,0,null,0,0,0,0,0,0]
[null,null,null,0,null,null,0,null,0,0,0,null,0,0,0,0,0,0]
[null,null,null,0,null,null,0,null,0,{"$f":"E35*H35","v":0},0,null,0,{"$f":"J35*L35","v":0},0,{"$f":"+J35-N35","v":0},0,{"$f":"+J35*E$7","v":0}]
[null,"Machinery Labor"]
[null,null,"Tractors/Self-Propelled",0.51,null,"Hour",12,null,6.12,{"$f":"E37*H37","v":0},0,null,0,{"$f":"J37*L37","v":0},6.12,{"$f":"+J37-N37","v":0},3060,{"$f":"+J37*E$7","v":0}]
[null,null,"Other Labor",0,null,"Hour",12,null,0,{"$f":"E38*H38","v":0},0,null,0,{"$f":"J38*L38","v":0},0,{"$f":"+J38-N38","v":0},0,{"$f":"+J38*E$7","v":0}]
[]
[null,"Diesel Fuel"]
[null,null,"Pickup/General Use Equipment",1,null,"Acre",0,null,0,{"$f":"E41*H41","v":0},0,null,0,{"$f":"J41*L41","v":0},0,{"$f":"+J41-N41","v":0},0,{"$f":"+J41*E$7","v":0}]
[null,null,"Tractors/Self-Propelled",4.72,null,"Gallon",3.6,null,16.992000000000001,{"$f":"E42*H42","v":0},0,null,0,{"$f":"J42*L42","v":0},16.992000000000001,{"$f":"+J42-N42","v":0},8496,{"$f":"+J42*E$7","v":0}]
[]
[null,"Gasoline"]
[null,null,"Pickup/General Use Equipment",1,null,"Acre",4.7249999999999996,null,4.7249999999999996,{"$f":"E45*H45","v":0},0,null,0,{"$f":"J45*L45","v":0},4.7249999999999996,{"$f":"+J45-N45","v":0},2362.5,{"$f":"+J45*E$7","v":0}]
[null,null,"Tractors/Self-Propelled",0,null,"Gallon",3.15,null,0,{"$f":"E46*H46","v":0},0,null,0,{"$f":"J46*L46","v":0},0,{"$f":"+J46-N46","v":0},0,{"$f":"+J46*E$7","v":0}]
[]
[null,"Repairs & Maintenance"]
[null,null,"Pickup/General Use Equipment",1,null,"Acre",0.67200000000000004,null,0.67200000000000004,{"$f":"E49*H49","v":0},0,null,0,{"$f":"J49*L49","v":0},0.67200000000000004,{"$f":"+J49-N49","v":0},336,{"$f":"+J49*E$7","v":0}]
[null,null,"Irrigation Equipment",1,null,"Acre",0,null,0,0,0,null,0,0,0,0,0,0]
[null,null,"Tractors/Self-Propelled",1,null,"Acre",19.328917310955106,null,19.328917310955106,0,0,null,0,0,19.328917310955106,0,9664.4586554775524,0]
[null,null,"Implements",1,null,"Acre",9.5349705854573656,null,9.5349705854573656,0,0,null,0,0,9.5349705854573656,0,4767.4852927286829,0]
[null,null,null,null,null,null,null,null,0,0,0,null,0,0,0,0,0,{"$f":"+J53*E$7","v":0}]
[null,null,null,null,null,null,null,null,0,0,0,null,0,0,0,0,0,0]
[null,"Interest on Credit Line",null,null,null,null,0.08,null,16.741482677682818,{"$f":"+SUM(J17:J54)/2*H55","v":0},null,null,0,{"$f":"+SUM(N17:N54)/2*L55","v":0},16.741482677682818,{"$f":"+SUM(P17:P54)/2*L55","v":0},8370.7413388414097,{"$f":"+J55*E$7","v":0}]
["Total Variable Costs",null,null,null,null,null,null,null,478.41437057409536,{"$f":"SUM(J18:J55)","v":0},null,null,0,{"$f":"SUM(N18:N55)","v":0},478.41437057409536,{"$f":"SUM(P18:P55)","v":0},239207.18528704764,{"$f":"SUM(R18:R55)","v":0}]
["Planned Returns Above Variable Costs:",null,null,null,null,null,null,null,-5.9143705740953578,{"$f":"+J13-J56","v":0},null,null,0,{"$f":"+N13-N56","v":0},-5.9143705740953578,{"$f":"+P13-P56","v":0},-2957.1852870476432,{"$f":"+R13-R56","v":0}]
[null,"Breakeven Price to Cover Variable Costs",null,null,null,null,5.3157152286010598,{"$f":"IF(E10=0,\"n/a\",(YVarExp-(YTotExp+YTotRet-J10))/E10)","v":"n/a"},"Bushel"]
[null,null,null,null,null,null,null,null,null,null,null,null,null,null,null,null,"Enterprise","Enterprise"]
["FIXED COSTS",null,null,"Quantity","Quantity","Units","$/Unit","$/Unit",null,"Total","Share","Share","Landlord","Landlord","Tenant","Tenant","Total","Total"]
[null,"Machinery Depreciation"]
[null,null,"Pickup/General Use Equipment",1,null,"Acre",0.69719999999999993,null,0.69719999999999993,{"$f":"E62*H62","v":0},0,null,0,{"$f":"J62*L62","v":0},0.69719999999999993,{"$f":"+J62-N62","v":0},348.59999999999997,{"$f":"+J62*E$7","v":0}]
[null,null,"Tractors/Self-Propelled",1,null,"Acre",18.472102896667494,null,18.472102896667494,0,0,null,0,{"$f":"J63*L63","v":0},18.472102896667494,0,9236.0514483337465,0]
[null,null,"Implements",1,null,"Acre",11.619860819798738,null,11.619860819798738,0,0,null,0,{"$f":"J64*L64","v":0},11.619860819798738,0,5809.9304098993689,0]
[null,"Equipment Investment"]
[null,null,"Pickup/General Use Equipment",4.9139999999999997,null,"Dollars",0.08,null,0.39311999999999997,{"$f":"E66*H66","v":0},0,null,0,{"$f":"J66*L66","v":0},0.39311999999999997,{"$f":"+J66-N66","v":0},196.55999999999997,{"$f":"+J66*E$7","v":0}]
[null,null,"Tractors/Self-Propelled",140.90269128027191,null,"Dollars",0.08,null,11.272215302421753,0,0,null,0,{"$f":"J67*L67","v":0},11.272215302421753,0,5636.1076512108766,0]
[null,null,"Implements",72.028025056255032,null,"Dollars",0.08,null,5.7622420045004024,0,0,null,0,{"$f":"J68*L68","v":0},5.7622420045004024,0,2881.1210022502014,0]
[null,"Salaried Labor",null,1,null,"Acre",0,null,0,0,0,null,0,{"$f":"J69*L69","v":0},0,{"$f":"+J69-N69","v":0},0,{"$f":"+J69*E$7","v":0}]
[null,"Management Fee, Owner/Operator Labor",null,1,null,"Acre",0,null,0,0,0,null,0,0,0,0,0,0]
[null,"Allocated Establishment Cost",null,1,null,"Acre",0,null,0,0,0,null,0,0,0,0,0,0]
[null,"Corn Land Rent",null,1,null,"Acre",50,null,50,0,0,null,0,0,50,0,25000,0]
[null,"Property Taxes",null,1,null,"Acre",0,null,0,{"$f":"E73*H73","v":0},0,null,0,0,0,0,0,{"$f":"+J73*E$7","v":0}]
[null,"Whole Farm Insurance",null,1,null,"Acre",0,null,0,0,0,null,0,0,0,0,0,0]
[null,null,null,1,null,null,0,null,0,0,0,null,0,0,0,0,0,0]
[null,null,null,1,null,null,0,null,0,0,0,null,0,0,0,0,0,0]
["Total Fixed Costs",null,null,null,null,null,null,null,98.21674102338838,{"$f":"+SUM(J62:J76)","v":0},null,null,0,{"$f":"+SUM(N62:N76)","v":0},98.21674102338838,{"$f":"+SUM(P62:P76)","v":0},49108.370511694193,{"$f":"+SUM(R62:R76)","v":0}]
["Total Specified Costs",null,null,null,null,null,null,null,576.63111159748371,{"$f":"+J56+J77","v":0},null,null,0,{"$f":"+N56+N77","v":0},576.63111159748371,{"$f":"+P56+P77","v":0},288315.55579874181,{"$f":"+R56+R77","v":0}]
[]
["Returns Above Specified Costs",null,null,null,null,null,null,null,-104.13111159748371,{"$f":"+J13-J78","v":0},null,null,0,{"$f":"+N13-N78","v":0},-104.13111159748371,{"$f":"+P13-P78","v":0},-52065.555798741814,{"$f":"+R13-R78","v":0}]
[]
["    Breakeven Price to Cover Total Costs",null,null,null,null,null,6.4070123510831527,{"$f":"IF(E10=0,\"n/a\",(YTotExp-(YTotExp+YTotRet-J10))/E10)","v":"n/a"},"Bushel"]
[]
[null,null,null,"Example Breakeven Prices"]
[null,"Example","Example","To Cover",null,null,"To Cover"]
[null,"Yield","Yield","Variable",null,null,"Total"]
[null,"Percent","Bushel","Costs",null,null,"Costs"]
[null,0.75,67.5,7.0876203048014128,null,null,8.5426831347775369]
[null,0.9,81,5.9063502540011772,null,null,7.1189026123146135]
[null,1,90,5.3157152286010598,null,null,6.4070123510831527]
[null,1.1000000000000001,99.000000000000014,4.8324683896373264,null,null,5.8245566828028652]
[null,1.25,112.5,4.252572182880848,null,null,5.1256098808665218]
[]
[null,null,null,"Your Breakeven Prices"]
[null,"Your","Your",null,"To Cover",null,null,"To Cover"]
[null,"Yield","Yield",null,"Variable",null,null,"Total"]
[null,"Percent","Bushel",null,"Costs",null,null,"Costs"]
[null,0.75,{"$f":"E10*YPER1","v":0},null,{"$f":"IF($E$10=0,0,(YVarExp-(YTotExp+YTotRet-J10))/($E$10*YPER1))","v":0},null,null,{"$f":"IF($E$10=0,0,(YTotExp-(YTotExp+YTotRet-J10))/($E$10*YPER1))","v":0}]
[null,0.9,{"$f":"E10*YPER2","v":0},null,{"$f":"IF($E$10=0,0,(YVarExp-(YTotExp+YTotRet-J10))/($E$10*YPER2))","v":0},null,null,{"$f":"IF($E$10=0,0,(YTotExp-(YTotExp+YTotRet-J10))/($E$10*YPER2))","v":0}]
[null,1,{"$f":"+E10","v":0},null,{"$f":"IF($E$10=0,0,(YVarExp-(YTotExp+YTotRet-J10))/($E$10*YPER3))","v":0},null,null,{"$f":"IF($E$10=0,0,(YTotExp-(YTotExp+YTotRet-J10))/($E$10*YPER3))","v":0}]
[null,1.1000000000000001,{"$f":"E10*YPER4","v":0},null,{"$f":"IF($E$10=0,0,(YVarExp-(YTotExp+YTotRet-J10))/($E$10*YPER4))","v":0},null,null,{"$f":"IF($E$10=0,0,(YTotExp-(YTotExp+YTotRet-J10))/($E$10*YPER4))","v":0}]
[null,1.25,{"$f":"E10*YPER5","v":0},null,{"$f":"IF($E$10=0,0,(YVarExp-(YTotExp+YTotRet-J10))/($E$10*YPER5))","v":0},null,null,{"$f":"IF($E$10=0,0,(YTotExp-(YTotExp+YTotRet-J10))/($E$10*YPER5))","v":0}]
[]
["  Developed by Jason Johnson, Associate Professor and Extension Economist, Texas A&M AgriLife Extension, 254-968-4144.  "]
[]
["Information presented is prepared solely as a general guide and not intended to recognize or predict the costs and returns from any one operation.  Brand names are mentioned only as examples and imply no endorsement."]

{"sheet":"CornReducedTill","index":3,"n_rows":106,"n_cols":18,"rows_kept":106,"cut":false,"hidden":false,"merged":[[83,3,83,8],[93,3,93,8],[105,0,105,11],[0,0,0,11],[1,0,1,11],[2,0,2,11],[3,0,3,11]]}
["Projections for Planning Purposes Only -- Not to be Used without Updating"]
["2024 Estimated Costs and Returns per Acre"]
["Herbicide Resistant Corn - Reduced Tillage"]
["Enter your name for this budget in the cell above."]
["Enter  Your Values in the cells highlighed in MAROON."]
[null,null,null,null,"Your Acres",null,null,null,null,null,null,null,null,null,null,null,null,"Your"]
[null,null,"Crop Acres",500,null,null,null,null,null,null,null,"Your",null,null,null,null,"Enterprise","Enterprise"]
[null,null,null,null,"Your",null,null,"Your","Cash","Your","Landlord","Landlord",null,"Your",null,"Your","Total","Total"]
["REVENUE",null,null,"Quantity","Quantity","Units","$/Unit","$/Unit","Total","Total","Share","Share","Landlord","Landlord","Tenant","Tenant","(500 acres)",{"$f":"\"(\" & E7 & \" acres)\"","v":"( acres)"}]
[null,"Corn",null,90,null,"Bushel",5.25,null,472.5,{"$f":"E10*H10","v":0},0,null,0,{"$f":"J10*L10","v":0},472.5,{"$f":"+J10-N10","v":0},236250,{"$f":"+J10*E$7","v":0}]
[null,null,null,0,null,null,0,null,0,0,0,null,0,0,0,{"$f":"+J11-N11","v":0},0,0]
[null,null,null,0,null,null,0,null,0,0,0,null,0,0,0,0,0,0]
["Total Revenue",null,null,null,null,null,null,null,472.5,{"$f":"SUM(J10:J12)","v":0},null,null,0,{"$f":"SUM(N10:N12)","v":0},472.5,{"$f":"SUM(P10:P12)","v":0},236250,{"$f":"SUM(R10:R12)","v":0}]
[null,null,null,null,null,null,null,null,null,null,null,null,null,null,null,null,"Enterprise","Enterprise"]
["VARIABLE COSTS",null,null,"Quantity","Quantity","Units","$/Unit","$/Unit","Total","Total","Share","Share","Landlord","Landlord","Tenant","Tenant","Total","Total"]
["Production Costs"]
[null,"Custom"]
[null,"","Liquid Fertilizer Rig",1,null,"Acre",8,null,8,{"$f":"E18*H18","v":0},0,null,0,{"$f":"J18*L18","v":0},8,{"$f":"+J18-N18","v":0},4000,{"$f":"+J18*E$7","v":0}]
[null,"","Custom Grain Haul",90,null,"Bushel",0.25,null,22.5,0,0,null,0,0,22.5,0,11250,0]
[null,"Fertilizer"]
[null,"","Fertilizer - N, P, Zinc, S",1,null,"Acre",165,null,165,0,0,null,0,0,165,0,82500,0]
[null,"Herbicide"]
[null,"","Herbicide, Atrazine",2,null,"Pound",7.5,null,15,0,0,null,0,0,15,0,7500,0]
[null,"","Corn Herbicide",32,null,"Ounce",0.2,null,6.4,0,0,null,0,0,6.4,0,3200,0]
[null,"","Weed Burndown",32,null,"Ounce",0.2,null,6.4,0,0,null,0,0,6.4,0,3200,0]
[null,"Insecticide"]
[null,"","Corn Insecticide",1,null,"Acre",18,null,18,0,0,null,0,0,18,0,9000,0]
[null,"Miscellaneous"]
[null,"","Insurance - Corn 70%",1,null,"Acre",18,null,18,0,0,null,0,0,18,0,9000,0]
[null,"","Insurance - Corn SCO",1,null,"Acre",5,null,5,0,0,null,0,0,5,0,2500,0]
[null,"Seed"]
[null,"","Herbicide Resistant Corn Seed",1,null,"Acre",140,null,140,0,0,null,0,0,140,0,70000,0]
[null,null,null,0,null,null,0,null,0,0,0,null,0,0,0,0,0,0]
[null,null,null,0,null,null,0,null,0,0,0,null,0,0,0,0,0,0]
[null,null,null,0,null,null,0,null,0,{"$f":"E35*H35","v":0},0,null,0,{"$f":"J35*L35","v":0},0,{"$f":"+J35-N35","v":0},0,{"$f":"+J35*E$7","v":0}]
[null,"Machinery Labor"]
[null,null,"Tractors/Self-Propelled",0.5,null,"Hour",12,null,6,{"$f":"E37*H37","v":0},0,null,0,{"$f":"J37*L37","v":0},6,{"$f":"+J37-N37","v":0},3000,{"$f":"+J37*E$7","v":0}]
[null,null,"Other Labor",0,null,"Hour",12,null,0,{"$f":"E38*H38","v":0},0,null,0,{"$f":"J38*L38","v":0},0,{"$f":"+J38-N38","v":0},0,{"$f":"+J38*E$7","v":0}]
[]
[null,"Diesel Fuel"]
[null,null,"Pickup/General Use Equipment",1,null,"Acre",0,null,0,{"$f":"E41*H41","v":0},0,null,0,{"$f":"J41*L41","v":0},0,{"$f":"+J41-N41","v":0},0,{"$f":"+J41*E$7","v":0}]
[null,null,"Tractors/Self-Propelled",4.63,null,"Gallon",3.6,null,16.667999999999999,{"$f":"E42*H42","v":0},0,null,0,{"$f":"J42*L42","v":0},16.667999999999999,{"$f":"+J42-N42","v":0},8334,{"$f":"+J42*E$7","v":0}]
[]
[null,"Gasoline"]
[null,null,"Pickup/General Use Equipment",1,null,"Acre",4.7249999999999996,null,4.7249999999999996,{"$f":"E45*H45","v":0},0,null,0,{"$f":"J45*L45","v":0},4.7249999999999996,{"$f":"+J45-N45","v":0},2362.5,{"$f":"+J45*E$7","v":0}]
[null,null,"Tractors/Self-Propelled",0,null,"Gallon",3.15,null,0,{"$f":"E46*H46","v":0},0,null,0,{"$f":"J46*L46","v":0},0,{"$f":"+J46-N46","v":0},0,{"$f":"+J46*E$7","v":0}]
[]
[null,"Repairs & Maintenance"]
[null,null,"Pickup/General Use Equipment",1,null,"Acre",0.67200000000000004,null,0.67200000000000004,{"$f":"E49*H49","v":0},0,null,0,{"$f":"J49*L49","v":0},0.67200000000000004,{"$f":"+J49-N49","v":0},336,{"$f":"+J49*E$7","v":0}]
[null,null,"Irrigation Equipment",1,null,"Acre",0,null,0,0,0,null,0,0,0,0,0,0]
[null,null,"Tractors/Self-Propelled",1,null,"Acre",19.065624871926754,null,19.065624871926754,0,0,null,0,0,19.065624871926754,0,9532.8124359633766,0]
[null,null,"Implements",1,null,"Acre",7.541606234709807,null,7.541606234709807,0,0,null,0,0,7.541606234709807,0,3770.8031173549034,0]
[null,null,null,null,null,null,null,null,0,0,0,null,0,0,0,0,0,0]
[null,null,null,null,null,null,null,null,0,0,0,null,0,0,0,0,0,0]
[null,"Interest on Credit Line",null,null,null,null,0.08,null,16.642658460935515,{"$f":"+SUM(J17:J54)/2*H55","v":0},null,null,0,{"$f":"+SUM(N17:N54)/2*L55","v":0},16.642658460935515,{"$f":"+SUM(P17:P54)/2*L55","v":0},8321.329230467758,{"$f":"+J55*E$7","v":0}]
["Total Variable Costs",null,null,null,null,null,null,null,475.61488956757216,{"$f":"SUM(J18:J55)","v":0},null,null,0,{"$f":"SUM(N18:N55)","v":0},475.61488956757216,{"$f":"SUM(P18:P55)","v":0},237807.44478378602,{"$f":"SUM(R18:R55)","v":0}]
["Planned Returns Above Variable Costs:",null,null,null,null,null,null,null,-3.1148895675721633,{"$f":"+J13-J56","v":0},null,null,0,{"$f":"+N13-N56","v":0},-3.1148895675721633,{"$f":"+P13-P56","v":0},-1557.4447837860207,{"$f":"+R13-R56","v":0}]
[null,"Breakeven Price to Cover Variable Costs",null,null,null,null,5.2846098840841353,{"$f":"IF(E10=0,\"n/a\",(YVarExp-(YTotExp+YTotRet-J10))/E10)","v":"n/a"},"Bushel"]
[null,null,null,null,null,null,null,null,null,null,null,null,null,null,null,null,"Enterprise","Enterprise"]
["FIXED COSTS",null,null,"Quantity","Quantity","Units","$/Unit","$/Unit","Total","Total","Share","Share","Landlord","Landlord","Tenant","Tenant","Total","Total"]
[null,"Machinery Depreciation"]
[null,null,"Pickup/General Use Equipment",1,null,"Acre",0.69719999999999993,null,0.69719999999999993,{"$f":"E62*H62","v":0},0,null,0,{"$f":"J62*L62","v":0},0.69719999999999993,{"$f":"+J62-N62","v":0},348.59999999999997,{"$f":"+J62*E$7","v":0}]
[null,null,"Tractors/Self-Propelled",1,null,"Acre",18.200034043004866,null,18.200034043004866,0,0,null,0,{"$f":"J63*L63","v":0},18.200034043004866,0,9100.0170215024336,0]
[null,null,"Implements",1,null,"Acre",10.073588730780395,null,10.073588730780395,0,0,null,0,{"$f":"J64*L64","v":0},10.073588730780395,0,5036.7943653901975,0]
[null,"Equipment Investment"]
[null,null,"Pickup/General Use Equipment",4.9139999999999997,null,"Dollars",0.08,null,0.39311999999999997,{"$f":"E66*H66","v":0},0,null,0,{"$f":"J66*L66","v":0},0.39311999999999997,{"$f":"+J66-N66","v":0},196.55999999999997,{"$f":"+J66*E$7","v":0}]
[null,null,"Tractors/Self-Propelled",138.78318714609372,null,"Dollars",0.08,null,11.102654971687498,0,0,null,0,{"$f":"J67*L67","v":0},11.102654971687498,0,5551.3274858437489,0]
[null,null,"Implements",65.413416675454343,null,"Dollars",0.08,null,5.2330733340363471,0,0,null,0,{"$f":"J68*L68","v":0},5.2330733340363471,0,2616.5366670181734,0]
[null,"Salaried Labor",null,1,null,"Acre",0,null,0,0,0,null,0,{"$f":"J69*L69","v":0},0,{"$f":"+J69-N69","v":0},0,{"$f":"+J69*E$7","v":0}]
[null,"Management Fee, Owner/Operator Labor",null,1,null,"Acre",0,null,0,0,0,null,0,0,0,0,0,0]
[null,"Allocated Establishment Cost",null,1,null,"Acre",0,null,0,0,0,null,0,0,0,0,0,0]
[null,"Corn Land Rent",null,1,null,"Acre",50,null,50,0,0,null,0,0,50,0,25000,0]
[null,"Property Taxes",null,1,null,"Acre",0,null,0,0,0,null,0,0,0,0,0,0]
[null,"Whole Farm Insurance",null,1,null,"Acre",0,null,0,0,0,null,0,0,0,0,0,0]
[null,null,null,1,null,null,0,null,0,0,0,null,0,0,0,0,0,0]
[null,null,null,1,null,null,0,null,0,{"$f":"E76*H76","v":0},0,null,0,0,0,0,0,0]
["Total Fixed Costs",null,null,null,null,null,null,null,95.699671079509102,{"$f":"+SUM(J62:J76)","v":0},null,null,0,{"$f":"+SUM(N62:N76)","v":0},95.699671079509102,{"$f":"+SUM(P62:P76)","v":0},47849.835539754553,{"$f":"+SUM(R62:R76)","v":0}]
["Total Specified Costs",null,null,null,null,null,null,null,571.31456064708129,{"$f":"+J56+J77","v":0},null,null,0,{"$f":"+N56+N77","v":0},571.31456064708129,{"$f":"+P56+P77","v":0},285657.28032354056,{"$f":"+R56+R77","v":0}]
[]
["Returns Above Specified Costs",null,null,null,null,null,null,null,-98.814560647081294,{"$f":"+J13-J78","v":0},null,null,0,{"$f":"+N13-N78","v":0},-98.814560647081294,{"$f":"+P13-P78","v":0},-49407.280323540559,{"$f":"+R13-R78","v":0}]
[]
["    Breakeven Price to Cover Total Costs",null,null,null,null,null,6.3479395627453474,{"$f":"IF(E10=0,\"n/a\",(YTotExp-(YTotExp+YTotRet-J10))/E10)","v":"n/a"},"Bushel"]
[]
[null,null,null,"Example Breakeven Prices"]
[null,"Example","Example","To Cover",null,null,"To Cover"]
[null,"Yield","Yield","Variable",null,null,"Total"]
[null,"Percent","Bushel","Costs",null,null,"Costs"]
[null,0.75,67.5,7.0461465121121805,null,null,8.4639194169937966]
[null,0.9,81,5.8717887600934837,null,null,7.0532661808281638]
[null,1,90,5.2846098840841353,null,null,6.3479395627453474]
[null,1.1000000000000001,99.000000000000014,4.8041908037128493,null,null,5.770854147950315]
[null,1.25,112.5,4.2276879072673079,null,null,5.0783516501962778]
[]
[null,null,null,"Your Breakeven Prices"]
[null,"Your","Your",null,"To Cover",null,null,"To Cover"]
[null,"Yield","Yield",null,"Variable",null,null,"Total"]
[null,"Percent","Bushel",null,"Costs",null,null,"Costs"]
[null,0.75,{"$f":"E10*YPER1","v":0},null,{"$f":"IF($E$10=0,0,(YVarExp-(YTotExp+YTotRet-J10))/($E$10*YPER1))","v":0},null,null,{"$f":"IF($E$10=0,0,(YTotExp-(YTotExp+YTotRet-J10))/($E$10*YPER1))","v":0}]
[null,0.9,{"$f":"E10*YPER2","v":0},null,{"$f":"IF($E$10=0,0,(YVarExp-(YTotExp+YTotRet-J10))/($E$10*YPER2))","v":0},null,null,{"$f":"IF($E$10=0,0,(YTotExp-(YTotExp+YTotRet-J10))/($E$10*YPER2))","v":0}]
[null,1,{"$f":"+E10","v":0},null,{"$f":"IF($E$10=0,0,(YVarExp-(YTotExp+YTotRet-J10))/($E$10*YPER3))","v":0},null,null,{"$f":"IF($E$10=0,0,(YTotExp-(YTotExp+YTotRet-J10))/($E$10*YPER3))","v":0}]
[null,1.1000000000000001,{"$f":"E10*YPER4","v":0},null,{"$f":"IF($E$10=0,0,(YVarExp-(YTotExp+YTotRet-J10))/($E$10*YPER4))","v":0},null,null,{"$f":"IF($E$10=0,0,(YTotExp-(YTotExp+YTotRet-J10))/($E$10*YPER4))","v":0}]
[null,1.25,{"$f":"E10*YPER5","v":0},null,{"$f":"IF($E$10=0,0,(YVarExp-(YTotExp+YTotRet-J10))/($E$10*YPER5))","v":0},null,null,{"$f":"IF($E$10=0,0,(YTotExp-(YTotExp+YTotRet-J10))/($E$10*YPER5))","v":0}]
[]
["  Developed by Jason Johnson, Associate Professor and Extension Economist, Texas A&M AgriLife Extension, 254-968-4144.  "]
[]
["Information presented is prepared solely as a general guide and not intended to recognize or predict the costs and returns from any one operation.  Brand names are mentioned only as examples and imply no endorsement."]

{"sheet":"Cotton","index":4,"n_rows":115,"n_cols":18,"rows_kept":115,"cut":false,"hidden":false,"merged":[[92,3,92,8],[102,3,102,8],[114,0,114,11],[0,0,0,11],[1,0,1,11],[2,0,2,11],[3,0,3,11]]}
["Projections for Planning Purposes Only -- Not to be Used without Updating"]
["2024 Estimated Costs and Returns per Acre"]
["Stacked Cotton"]
["Enter your name for this budget in the cell above."]
["Enter  Your Values in the cells highlighed in MAROON."]
[null,null,null,null,"Your Acres",null,null,null,null,null,null,null,null,null,null,null,null,"Your"]
[null,null,"Crop Acres",500,null,null,null,null,null,null,null,"Your",null,null,null,null,"Enterprise","Enterprise"]
[null,null,null,null,"Your",null,null,"Your","Cash","Your","Landlord","Landlord",null,"Your",null,"Your","Total","Total"]
["REVENUE",null,null,"Quantity","Quantity","Units","$/Unit","$/Unit","Total","Total","Share","Share","Landlord","Landlord","Tenant","Tenant","(500 acres)",{"$f":"\"(\" & E7 & \" acres)\"","v":"( acres)"}]
[null,"Cotton Lint",null,500,null,"Pound",0.77,null,385,{"$f":"E10*H10","v":0},0,null,0,{"$f":"J10*L10","v":0},385,{"$f":"+J10-N10","v":0},192500,{"$f":"+J10*E$7","v":0}]
[null,"Cottonseed",null,0.33,null,"Ton",230,null,75.900000000000006,0,0,null,0,0,75.900000000000006,{"$f":"+J11-N11","v":0},37950,0]
[null,null,null,0,null,null,0,null,0,0,0,null,0,0,0,0,0,0]
[null,null,null,0,null,null,0,null,0,0,0,null,0,0,0,0,0,0]
["Total Revenue",null,null,null,null,null,null,null,460.9,{"$f":"SUM(J10:J13)","v":0},null,null,0,{"$f":"SUM(N10:N13)","v":0},460.9,{"$f":"SUM(P10:P13)","v":0},230450,{"$f":"SUM(R10:R13)","v":0}]
[null,null,null,null,null,null,null,null,null,null,null,null,null,null,null,null,"Enterprise","Enterprise"]
["VARIABLE COSTS",null,null,"Quantity","Quantity","Units","$/Unit","$/Unit","Total","Total","Share","Share","Landlord","Landlord","Tenant","Tenant","Total","Total"]
["Production Costs"]
[null,"Fertilizer"]
[null,"","Fertilizer - N, P, K",1,null,"Acre",110,null,110,{"$f":"E19*H19","v":0},0,null,0,{"$f":"J19*L19","v":0},110,{"$f":"+J19-N19","v":0},55000,{"$f":"+J19*E$7","v":0}]
[null,"Herbicide"]
[null,"","Yellow Herbicide",1,null,"Acre",12,null,12,0,0,null,0,0,12,0,6000,0]
[null,"","Planting Burndown",32,null,"Ounce",0.3,null,9.6,0,0,null,0,0,9.6,0,4800,0]
[null,"","Herbicide 1st Application",32,null,"Ounce",0.3,null,9.6,0,0,null,0,0,9.6,0,4800,0]
[null,"","Herbicide 2nd Application",32,null,"Ounce",0.3,null,9.6,0,0,null,0,0,9.6,0,4800,0]
[null,"Seed"]
[null,"","Stacked Cotton Seed",1,null,"Acre",45,null,45,0,0,null,0,0,45,0,22500,0]
[null,"","Herbicide Tech Fee",1,null,"Acre",18,null,18,0,0,null,0,0,18,0,9000,0]
[null,"","bt Tech Fee",1,null,"Acre",9,null,9,0,0,null,0,0,9,0,4500,0]
[null,"Miscellaneous"]
[null,"","Insurance - Cotton",1,null,"Acre",18,null,18,0,0,null,0,0,18,0,9000,0]
[null,"","Insurance - Cotton SCO/STAX",1,null,"Acre",5,null,5,0,0,null,0,0,5,0,2500,0]
[null,"Insecticide"]
[null,"","Insecticide 1st Application",1,null,"Acre",3,null,3,0,0,null,0,0,3,0,1500,0]
[null,"","Insecticide 2nd Application",1,null,"Acre",3,null,3,0,0,null,0,0,3,0,1500,0]
[null,"","Boll Weevil Eradication",1,null,"Acre",2,null,2,0,0,null,0,0,2,0,1000,0]
[null,"Other Chemicals"]
[null,"","Defoliant",1,null,"Acre",14,null,14,0,0,null,0,0,14,0,7000,0]
[null,"","Dessicant",1,null,"Acre",12,null,12,0,0,null,0,0,12,0,6000,0]
[null,"Custom"]
[null,"","Stripping",500,null,"Pound",0.1,null,50,0,0,null,0,0,50,0,25000,0]
[null,"","Ginning",500,null,"Pound",0.12,null,60,0,0,null,0,0,60,0,30000,0]
[null,null,null,0,null,null,0,null,0,0,0,null,0,0,0,0,0,0]
[null,null,null,0,null,null,0,null,0,0,0,null,0,0,0,0,0,0]
[null,null,null,0,null,null,0,null,0,{"$f":"E44*H44","v":0},0,null,0,{"$f":"J44*L44","v":0},0,{"$f":"+J44-N44","v":0},0,{"$f":"+J44*E$7","v":0}]
[null,"Machinery Labor"]
[null,null,"Tractors/Self-Propelled",0.42,null,"Hour",12,null,5.04,{"$f":"E46*H46","v":0},0,null,0,{"$f":"J46*L46","v":0},5.04,{"$f":"+J46-N46","v":0},2520,{"$f":"+J46*E$7","v":0}]
[null,null,"Other Labor",0,null,"Hour",12,null,0,{"$f":"E47*H47","v":0},0,null,0,{"$f":"J47*L47","v":0},0,{"$f":"+J47-N47","v":0},0,{"$f":"+J47*E$7","v":0}]
[]
[null,"Diesel Fuel"]
[null,null,"Pickup/General Use Equipment",1,null,"Acre",0,null,0,{"$f":"E50*H50","v":0},0,null,0,{"$f":"J50*L50","v":0},0,{"$f":"+J50-N50","v":0},0,{"$f":"+J50*E$7","v":0}]
[null,null,"Tractors/Self-Propelled",3.33,null,"Gallon",3.6,null,11.988000000000001,{"$f":"E51*H51","v":0},0,null,0,{"$f":"J51*L51","v":0},11.988000000000001,{"$f":"+J51-N51","v":0},5994.0000000000009,{"$f":"+J51*E$7","v":0}]
[]
[null,"Gasoline"]
[null,null,"Pickup/General Use Equipment",1,null,"Acre",4.7249999999999996,null,4.7249999999999996,{"$f":"E54*H54","v":0},0,null,0,{"$f":"J54*L54","v":0},4.7249999999999996,{"$f":"+J54-N54","v":0},2362.5,{"$f":"+J54*E$7","v":0}]
[null,null,"Tractors/Self-Propelled",0,null,"Gallon",3.15,null,0,{"$f":"E55*H55","v":0},0,null,0,{"$f":"J55*L55","v":0},0,{"$f":"+J55-N55","v":0},0,{"$f":"+J55*E$7","v":0}]
[]
[null,"Repairs & Maintenance"]
[null,null,"Pickup/General Use Equipment",1,null,"Acre",0.67200000000000004,null,0.67200000000000004,{"$f":"E58*H58","v":0},0,null,0,{"$f":"J58*L58","v":0},0.67200000000000004,{"$f":"+J58-N58","v":0},336,{"$f":"+J58*E$7","v":0}]
[null,null,"Irrigation Equipment",1,null,"Acre",0,null,0,0,0,null,0,0,0,0,0,0]
[null,null,"Tractors/Self-Propelled",1,null,"Acre",8.997514307604062,null,8.997514307604062,0,0,null,0,0,8.997514307604062,0,4498.7571538020311,0]
[null,null,"Implements",1,null,"Acre",8.034678188502598,null,8.034678188502598,0,0,null,0,0,8.034678188502598,0,4017.3390942512988,0]
[null,null,null,null,null,null,null,null,0,0,0,null,0,0,0,0,0,0]
[null,null,null,null,null,null,null,null,0,0,0,null,0,0,0,0,0,0]
[null,"Interest on Credit Line",null,null,null,null,0.08,null,12.030978197154983,{"$f":"+SUM(J18:J63)/2*H64","v":0},null,null,0,{"$f":"+SUM(N18:N63)/2*L64","v":0},12.030978197154983,{"$f":"+SUM(P18:P63)/2*L64","v":0},6015.4890985774919,{"$f":"+J64*E$7","v":0}]
["Total Variable Costs",null,null,null,null,null,null,null,441.28817069326163,{"$f":"SUM(J19:J64)","v":0},null,null,0,{"$f":"SUM(N19:N64)","v":0},441.28817069326163,{"$f":"SUM(P19:P64)","v":0},220644.08534663083,{"$f":"SUM(R19:R64)","v":0}]
["Planned Returns Above Variable Costs:",null,null,null,null,null,null,null,19.611829306738343,{"$f":"+J14-J65","v":0},null,null,0,{"$f":"+N14-N65","v":0},19.611829306738343,{"$f":"+P14-P65","v":0},9805.9146533691674,{"$f":"+R14-R65","v":0}]
[null,"Breakeven Price to Cover Variable Costs",null,null,null,null,0.73077634138652325,{"$f":"IF(E10=0,\"n/a\",(YVarExp-(YTotExp+YTotRet-J10))/E10)","v":"n/a"},"Pound"]
[null,null,null,null,null,null,null,null,null,null,null,null,null,null,null,null,"Enterprise","Enterprise"]
["FIXED COSTS",null,null,"Quantity","Quantity","Units","$/Unit","$/Unit","Total","Total","Share","Share","Landlord","Landlord","Tenant","Tenant","Total","Total"]
[null,"Machinery Depreciation"]
[null,null,"Pickup/General Use Equipment",1,null,"Acre",0.69719999999999993,null,0.69719999999999993,{"$f":"E71*H71","v":0},0,null,0,{"$f":"J71*L71","v":0},0.69719999999999993,{"$f":"+J71-N71","v":0},348.59999999999997,{"$f":"+J71*E$7","v":0}]
[null,null,"Tractors/Self-Propelled",1,null,"Acre",9.2974314511908656,null,9.2974314511908656,0,0,null,0,{"$f":"J72*L72","v":0},9.2974314511908656,0,4648.7157255954326,0]
[null,null,"Implements",1,null,"Acre",10.695241726689391,null,10.695241726689391,0,0,null,0,{"$f":"J73*L73","v":0},10.695241726689391,0,5347.620863344695,0]
[null,"Equipment Investment"]
[null,null,"Pickup/General Use Equipment",4.9139999999999997,null,"Dollars",0.08,null,0.39311999999999997,{"$f":"E75*H75","v":0},0,null,0,{"$f":"J75*L75","v":0},0.39311999999999997,{"$f":"+J75-N75","v":0},196.55999999999997,{"$f":"+J75*E$7","v":0}]
[null,null,"Tractors/Self-Propelled",72.429990176212712,null,"Dollars",0.08,null,5.7943992140970169,0,0,null,0,{"$f":"J76*L76","v":0},5.7943992140970169,0,2897.1996070485084,0]
[null,null,"Implements",45.751867386393513,null,"Dollars",0.08,null,3.6601493909114811,0,0,null,0,{"$f":"J77*L77","v":0},3.6601493909114811,0,1830.0746954557405,0]
[null,"Salaried Labor",null,1,null,"Acre",0,null,0,0,0,null,0,{"$f":"J78*L78","v":0},0,{"$f":"+J78-N78","v":0},0,{"$f":"+J78*E$7","v":0}]
[null,"Management Fee, Owner/Operator Labor",null,1,null,"Acre",0,null,0,0,0,null,0,0,0,0,0,0]
[null,"Allocated Establishment Cost",null,1,null,"Acre",0,null,0,0,0,null,0,0,0,0,0,0]
[null,"Cotton Land Rent",null,1,null,"Acre",50,null,50,0,0,null,0,0,50,0,25000,0]
[null,"Property Taxes",null,1,null,"Acre",0,null,0,0,0,null,0,0,0,0,0,0]
[null,"Whole Farm Insurance",null,1,null,"Acre",0,null,0,0,0,null,0,0,0,0,0,0]
[null,null,null,1,null,null,0,null,0,0,0,null,0,0,0,0,0,0]
[null,null,null,1,null,null,0,null,0,{"$f":"E85*H85","v":0},0,null,0,0,0,0,0,0]
["Total Fixed Costs",null,null,null,null,null,null,null,80.537541782888752,{"$f":"+SUM(J71:J85)","v":0},null,null,0,{"$f":"+SUM(N71:N85)","v":0},80.537541782888752,{"$f":"+SUM(P71:P85)","v":0},40268.770891444379,{"$f":"+SUM(R71:R85)","v":0}]
["Total Specified Costs",null,null,null,null,null,null,null,521.82571247615033,{"$f":"+J65+J86","v":0},null,null,0,{"$f":"+N65+N86","v":0},521.82571247615033,{"$f":"+P65+P86","v":0},260912.85623807521,{"$f":"+R65+R86","v":0}]
[]
["Returns Above Specified Costs",null,null,null,null,null,null,null,-60.925712476150352,{"$f":"+J14-J87","v":0},null,null,0,{"$f":"+N14-N87","v":0},-60.925712476150352,{"$f":"+P14-P87","v":0},-30462.856238075212,{"$f":"+R14-R87","v":0}]
[]
["    Breakeven Price to Cover Total Costs",null,null,null,null,null,0.89185142495230074,{"$f":"IF(E10=0,\"n/a\",(YTotExp-(YTotExp+YTotRet-J10))/E10)","v":"n/a"},"Pound"]
[]
[null,null,null,"Example Breakeven Prices"]
[null,"Example","Example","To Cover",null,null,"To Cover"]
[null,"Yield","Yield","Variable",null,null,"Total"]
[null,"Percent","Pound","Costs",null,null,"Costs"]
[null,0.75,375,0.97436845518203097,null,null,1.1891352332697342]
[null,0.9,450,0.81197371265169249,null,null,0.99094602772477858]
[null,1,500,0.73077634138652325,null,null,0.89185142495230074]
[null,1.1000000000000001,550,0.66434212853320296,null,null,0.81077402268390975]
[null,1.25,625,0.58462107310921851,null,null,0.71348113996184059]
[]
[null,null,null,"Your Breakeven Prices"]
[null,"Your","Your",null,"To Cover",null,null,"To Cover"]
[null,"Yield","Yield",null,"Variable",null,null,"Total"]
[null,"Percent","Pound",null,"Costs",null,null,"Costs"]
[null,0.75,{"$f":"E10*YPER1","v":0},null,{"$f":"IF($E$10=0,0,(YVarExp-(YTotExp+YTotRet-J10))/($E$10*YPER1))","v":0},null,null,{"$f":"IF($E$10=0,0,(YTotExp-(YTotExp+YTotRet-J10))/($E$10*YPER1))","v":0}]
[null,0.9,{"$f":"E10*YPER2","v":0},null,{"$f":"IF($E$10=0,0,(YVarExp-(YTotExp+YTotRet-J10))/($E$10*YPER2))","v":0},null,null,{"$f":"IF($E$10=0,0,(YTotExp-(YTotExp+YTotRet-J10))/($E$10*YPER2))","v":0}]
[null,1,{"$f":"+E10","v":0},null,{"$f":"IF($E$10=0,0,(YVarExp-(YTotExp+YTotRet-J10))/($E$10*YPER3))","v":0},null,null,{"$f":"IF($E$10=0,0,(YTotExp-(YTotExp+YTotRet-J10))/($E$10*YPER3))","v":0}]
[null,1.1000000000000001,{"$f":"E10*YPER4","v":0},null,{"$f":"IF($E$10=0,0,(YVarExp-(YTotExp+YTotRet-J10))/($E$10*YPER4))","v":0},null,null,{"$f":"IF($E$10=0,0,(YTotExp-(YTotExp+YTotRet-J10))/($E$10*YPER4))","v":0}]
[null,1.25,{"$f":"E10*YPER5","v":0},null,{"$f":"IF($E$10=0,0,(YVarExp-(YTotExp+YTotRet-J10))/($E$10*YPER5))","v":0},null,null,{"$f":"IF($E$10=0,0,(YTotExp-(YTotExp+YTotRet-J10))/($E$10*YPER5))","v":0}]
[]
["  Developed by Jason Johnson, Associate Professor and Extension Economist, Texas A&M AgriLife Extension, 254-968-4144.  "]
[]
["Information presented is prepared solely as a general guide and not intended to recognize or predict the costs and returns from any one operation.  Brand names are mentioned only as examples and imply no endorsement."]

{"sheet":"CoastalEstablishFarmland","index":5,"n_rows":95,"n_cols":18,"rows_kept":95,"cut":false,"hidden":false,"merged":[[72,3,72,8],[82,3,82,8],[94,0,94,11],[0,0,0,11],[1,0,1,11],[2,0,2,11],[3,0,3,11]]}
["Projections for Planning Purposes Only -- Not to be Used without Updating"]
["2024 Estimated Costs and Returns per Acre"]
["Coastal Bermudagrass Establishment - Farmland"]
["Enter your name for this budget in the cell above."]
["Enter  Your Values in the cells highlighed in MAROON."]
[null,null,null,null,"Your Acres",null,null,null,null,null,null,null,null,null,null,null,null,"Your"]
[null,null,"Crop Acres",100,null,null,null,null,null,null,null,"Your",null,null,null,null,"Enterprise","Enterprise"]
[null,null,null,null,"Your",null,null,"Your","Cash","Your","Landlord","Landlord",null,"Your",null,"Your","Total","Total"]
["REVENUE",null,null,"Quantity","Quantity","Units","$/Unit","$/Unit","Total","Total","Share","Share","Landlord","Landlord","Tenant","Tenant","(100 acres)",{"$f":"\"(\" & E7 & \" acres)\"","v":"( acres)"}]
[null,0,null,0,null,"",0,null,0,{"$f":"E10*H10","v":0},0,null,0,{"$f":"J10*L10","v":0},0,{"$f":"+J10-N10","v":0},0,{"$f":"+J10*E$7","v":0}]
[null,null,null,0,null,null,0,null,0,0,0,null,0,0,0,{"$f":"+J11-N11","v":0},0,0]
[null,null,null,0,null,null,0,null,0,0,0,null,0,0,0,0,0,0]
["Total Revenue",null,null,null,null,null,null,null,0,{"$f":"SUM(J10:J12)","v":0},null,null,0,{"$f":"SUM(N10:N12)","v":0},0,{"$f":"SUM(P10:P12)","v":0},0,{"$f":"SUM(R10:R12)","v":0}]
[null,null,null,null,null,null,null,null,null,null,null,null,null,null,null,null,"Enterprise","Enterprise"]
["VARIABLE COSTS",null,null,"Quantity","Quantity","Units","$/Unit","$/Unit","Total","Total","Share","Share","Landlord","Landlord","Tenant","Tenant","Total","Total"]
["Production Costs"]
[null,"Custom"]
[null,"","Custom Sprig",1,null,"Acre",120,null,120,{"$f":"E18*H18","v":0},0,null,0,{"$f":"J18*L18","v":0},120,{"$f":"+J18-N18","v":0},12000,{"$f":"+J18*E$7","v":0}]
[null,"Fertilizer"]
[null,"","18-46-0 ",100,null,"Pound",0.6,null,60,0,0,null,0,0,60,0,6000,0]
[null,"","46-0-0",100,null,"Pound",0.55000000000000004,null,55.000000000000007,0,0,null,0,0,55.000000000000007,0,5500.0000000000009,0]
[null,"Seed"]
[null,"","Bermuda Sprigs",30,null,"Bushel",2.25,null,67.5,0,0,null,0,0,67.5,0,6750,0]
[null,null,null,0,null,null,0,null,0,0,0,null,0,0,0,0,0,0]
[null,null,null,0,null,null,0,null,0,0,0,null,0,0,0,0,0,0]
[null,null,null,0,null,null,0,null,0,{"$f":"E26*H26","v":0},0,null,0,{"$f":"J26*L26","v":0},0,{"$f":"+J26-N26","v":0},0,{"$f":"+J26*E$7","v":0}]
[null,"Machinery Labor"]
[null,null,"Tractors/Self-Propelled",0.77,null,"Hour",12,null,9.24,{"$f":"E28*H28","v":0},0,null,0,{"$f":"J28*L28","v":0},9.24,{"$f":"+J28-N28","v":0},924,{"$f":"+J28*E$7","v":0}]
[null,null,"Other Labor",0,null,"Hour",12,null,0,{"$f":"E29*H29","v":0},0,null,0,{"$f":"J29*L29","v":0},0,{"$f":"+J29-N29","v":0},0,{"$f":"+J29*E$7","v":0}]
[]
[null,"Diesel Fuel"]
[null,null,"Pickup/General Use Equipment",1,null,"Acre",0,null,0,{"$f":"E32*H32","v":0},0,null,0,{"$f":"J32*L32","v":0},0,{"$f":"+J32-N32","v":0},0,{"$f":"+J32*E$7","v":0}]
[null,null,"Tractors/Self-Propelled",2.93,null,"Gallon",3.6,null,10.548,{"$f":"E33*H33","v":0},0,null,0,{"$f":"J33*L33","v":0},10.548,{"$f":"+J33-N33","v":0},1054.8,{"$f":"+J33*E$7","v":0}]
[]
[null,"Gasoline"]
[null,null,"Pickup/General Use Equipment",1,null,"Acre",0,null,0,{"$f":"E36*H36","v":0},0,null,0,{"$f":"J36*L36","v":0},0,{"$f":"+J36-N36","v":0},0,{"$f":"+J36*E$7","v":0}]
[null,null,"Tractors/Self-Propelled",0,null,"Gallon",3.15,null,0,{"$f":"E37*H37","v":0},0,null,0,{"$f":"J37*L37","v":0},0,{"$f":"+J37-N37","v":0},0,{"$f":"+J37*E$7","v":0}]
[]
[null,"Repairs & Maintenance"]
[null,null,"Pickup/General Use Equipment",1,null,"Acre",0,null,0,{"$f":"E40*H40","v":0},0,null,0,{"$f":"J40*L40","v":0},0,{"$f":"+J40-N40","v":0},0,{"$f":"+J40*E$7","v":0}]
[null,null,"Irrigation Equipment",1,null,"Acre",0,null,0,0,0,null,0,0,0,0,0,0]
[null,null,"Tractors/Self-Propelled",1,null,"Acre",3.5121343023757423,null,3.5121343023757423,0,0,null,0,0,3.5121343023757423,0,351.21343023757424,0]
[null,null,"Implements",1,null,"Acre",2.6231421639605075,null,2.6231421639605075,0,0,null,0,0,2.6231421639605075,0,262.31421639605077,0]
[null,null,null,null,null,null,null,null,0,0,0,null,0,0,0,0,0,0]
[null,null,null,null,null,null,null,null,0,0,0,null,0,0,0,0,0,0]
[null,"Interest on Credit Line",null,null,null,null,0.08,null,11.952042693052615,{"$f":"+SUM(J17:J45)/2*H46","v":0},null,null,0,{"$f":"+SUM(N17:N45)/2*L46","v":0},11.952042693052615,{"$f":"+SUM(P17:P45)/2*L46","v":0},1195.2042693052615,{"$f":"+J46*E$7","v":0}]
["Total Variable Costs",null,null,null,null,null,null,null,340.37531915938882,{"$f":"SUM(J18:J46)","v":0},null,null,0,{"$f":"SUM(N18:N46)","v":0},340.37531915938882,{"$f":"SUM(P18:P46)","v":0},34037.531915938889,{"$f":"SUM(R18:R46)","v":0}]
["Planned Returns Above Variable Costs:",null,null,null,null,null,null,null,-340.37531915938882,{"$f":"+J13-J47","v":0},null,null,0,{"$f":"+N13-N47","v":0},-340.37531915938882,{"$f":"+P13-P47","v":0},-34037.531915938889,{"$f":"+R13-R47","v":0}]
[null,"Breakeven Price to Cover Variable Costs",null,null,null,null,"n/a",{"$f":"IF(E10=0,\"n/a\",(YVarExp-(YTotExp+YTotRet-J10))/E10)","v":"n/a"},""]
[null,null,null,null,null,null,null,null,null,null,null,null,null,null,null,null,"Enterprise","Enterprise"]
["FIXED COSTS",null,null,"Quantity","Quantity","Units","$/Unit","$/Unit","Total","Total","Share","Share","Landlord","Landlord","Tenant","Tenant","Total","Total"]
[null,"Machinery Depreciation"]
[null,null,"Tractors/Self-Propelled",1,null,"Acre",2.9033643566306138,null,2.9033643566306138,{"$f":"E53*H53","v":0},0,null,0,{"$f":"J53*L53","v":0},2.9033643566306138,{"$f":"+J53-N53","v":0},290.33643566306137,{"$f":"+J53*E$7","v":0}]
[null,null,"Implements",1,null,"Acre",3.4100095364332583,null,3.4100095364332583,0,0,null,0,{"$f":"J54*L54","v":0},3.4100095364332583,0,341.00095364332583,0]
[null,"Equipment Investment"]
[null,null,"Tractors/Self-Propelled",22.618144907299779,null,"Dollars",0.08,null,1.8094515925839825,{"$f":"E56*H56","v":0},0,null,0,{"$f":"J56*L56","v":0},1.8094515925839825,{"$f":"+J56-N56","v":0},180.94515925839823,{"$f":"+J56*E$7","v":0}]
[null,null,"Implements",14.953990794742275,null,"Dollars",0.08,null,1.196319263579382,0,0,null,0,{"$f":"J57*L57","v":0},1.196319263579382,0,119.6319263579382,0]
[null,"Salaried Labor",null,1,null,"Acre",0,null,0,0,0,null,0,{"$f":"J58*L58","v":0},0,{"$f":"+J58-N58","v":0},0,{"$f":"+J58*E$7","v":0}]
[null,"Management Fee, Owner/Operator Labor",null,1,null,"Acre",0,null,0,0,0,null,0,0,0,0,0,0]
[null,"Allocated Establishment Cost",null,1,null,"Acre",0,null,0,0,0,null,0,0,0,0,0,0]
[null,"None",null,1,null,"Acre",0,null,0,0,0,null,0,0,0,0,0,0]
[null,"Property Taxes",null,1,null,"Acre",0,null,0,0,0,null,0,0,0,0,0,0]
[null,"Whole Farm Insurance",null,1,null,"Acre",0,null,0,0,0,null,0,0,0,0,0,0]
[null,null,null,1,null,null,0,null,0,0,0,null,0,0,0,0,0,0]
[null,null,null,1,null,null,0,null,0,{"$f":"E65*H65","v":0},0,null,0,0,0,0,0,0]
["Total Fixed Costs",null,null,null,null,null,null,null,9.3191447492272363,{"$f":"+SUM(J53:J65)","v":0},null,null,0,{"$f":"+SUM(N53:N65)","v":0},9.3191447492272363,{"$f":"+SUM(P53:P65)","v":0},931.91447492272368,{"$f":"+SUM(R53:R65)","v":0}]
["Total Specified Costs",null,null,null,null,null,null,null,349.69446390861606,{"$f":"+J47+J66","v":0},null,null,0,{"$f":"+N47+N66","v":0},349.69446390861606,{"$f":"+P47+P66","v":0},34969.446390861616,{"$f":"+R47+R66","v":0}]
[]
["Returns Above Specified Costs",null,null,null,null,null,null,null,-349.69446390861606,{"$f":"+J13-J67","v":0},null,null,0,{"$f":"+N13-N67","v":0},-349.69446390861606,{"$f":"+P13-P67","v":0},-34969.446390861616,{"$f":"+R13-R67","v":0}]
[]
["    Breakeven Price to Cover Total Costs",null,null,null,null,null,"n/a",{"$f":"IF(E10=0,\"n/a\",(YTotExp-(YTotExp+YTotRet-J10))/E10)","v":"n/a"},""]
[]
[null,null,null,"Example Breakeven Prices"]
[null,"Example","Example","To Cover",null,null,"To Cover"]
[null,"Yield","Yield","Variable",null,null,"Total"]
[null,"Percent","","Costs",null,null,"Costs"]
[null,0.75,0,0,null,null,0]
[null,0.9,0,0,null,null,0]
[null,1,0,0,null,null,0]
[null,1.1000000000000001,0,0,null,null,0]
[null,1.25,0,0,null,null,0]
[]
[null,null,null,"Your Breakeven Prices"]
[null,"Your","Your",null,"To Cover",null,null,"To Cover"]
[null,"Yield","Yield",null,"Variable",null,null,"Total"]
[null,"Percent","",null,"Costs",null,null,"Costs"]
[null,0.75,{"$f":"E10*YPER1","v":0},null,{"$f":"IF($E$10=0,0,(YVarExp-(YTotExp+YTotRet-J10))/($E$10*YPER1))","v":0},null,null,{"$f":"IF($E$10=0,0,(YTotExp-(YTotExp+YTotRet-J10))/($E$10*YPER1))","v":0}]
[null,0.9,{"$f":"E10*YPER2","v":0},null,{"$f":"IF($E$10=0,0,(YVarExp-(YTotExp+YTotRet-J10))/($E$10*YPER2))","v":0},null,null,{"$f":"IF($E$10=0,0,(YTotExp-(YTotExp+YTotRet-J10))/($E$10*YPER2))","v":0}]
[null,1,{"$f":"+E10","v":0},null,{"$f":"IF($E$10=0,0,(YVarExp-(YTotExp+YTotRet-J10))/($E$10*YPER3))","v":0},null,null,{"$f":"IF($E$10=0,0,(YTotExp-(YTotExp+YTotRet-J10))/($E$10*YPER3))","v":0}]
[null,1.1000000000000001,{"$f":"E10*YPER4","v":0},null,{"$f":"IF($E$10=0,0,(YVarExp-(YTotExp+YTotRet-J10))/($E$10*YPER4))","v":0},null,null,{"$f":"IF($E$10=0,0,(YTotExp-(YTotExp+YTotRet-J10))/($E$10*YPER4))","v":0}]
[null,1.25,{"$f":"E10*YPER5","v":0},null,{"$f":"IF($E$10=0,0,(YVarExp-(YTotExp+YTotRet-J10))/($E$10*YPER5))","v":0},null,null,{"$f":"IF($E$10=0,0,(YTotExp-(YTotExp+YTotRet-J10))/($E$10*YPER5))","v":0}]
[]
["  Developed by Jason Johnson, Associate Professor and Extension Economist, Texas A&M AgriLife Extension, 254-968-4144.  "]
[]
["Information presented is prepared solely as a general guide and not intended to recognize or predict the costs and returns from any one operation.  Brand names are mentioned only as examples and imply no endorsement."]

{"sheet":"CoastalEstablishNative","index":6,"n_rows":96,"n_cols":18,"rows_kept":96,"cut":false,"hidden":false,"merged":[[73,3,73,8],[83,3,83,8],[95,0,95,11],[0,0,0,11],[1,0,1,11],[2,0,2,11],[3,0,3,11]]}
["Projections for Planning Purposes Only -- Not to be Used without Updating"]
["2024 Estimated Costs and Returns per Acre"]
["Coastal Bermudagrass Establishment - Native Prairie"]
["Enter your name for this budget in the cell above."]
["Enter  Your Values in the cells highlighed in MAROON."]
[null,null,null,null,"Your Acres",null,null,null,null,null,null,null,null,null,null,null,null,"Your"]
[null,null,"Crop Acres",100,null,null,null,null,null,null,null,"Your",null,null,null,null,"Enterprise","Enterprise"]
[null,null,null,null,"Your",null,null,"Your","Cash","Your","Landlord","Landlord",null,"Your",null,"Your","Total","Total"]
["REVENUE",null,null,"Quantity","Quantity","Units","$/Unit","$/Unit","Total","Total","Share","Share","Landlord","Landlord","Tenant","Tenant","(100 acres)",{"$f":"\"(\" & E7 & \" acres)\"","v":"( acres)"}]
[null,0,null,0,null,"",0,null,0,{"$f":"E10*H10","v":0},0,null,0,{"$f":"J10*L10","v":0},0,{"$f":"+J10-N10","v":0},0,{"$f":"+J10*E$7","v":0}]
[null,null,null,0,null,null,0,null,0,0,0,null,0,0,0,{"$f":"+J11-N11","v":0},0,0]
[null,null,null,0,null,null,0,null,0,0,0,null,0,0,0,0,0,0]
["Total Revenue",null,null,null,null,null,null,null,0,{"$f":"SUM(J10:J12)","v":0},null,null,0,{"$f":"SUM(N10:N12)","v":0},0,{"$f":"SUM(P10:P12)","v":0},0,{"$f":"SUM(R10:R12)","v":0}]
[null,null,null,null,null,null,null,null,null,null,null,null,null,null,null,null,"Enterprise","Enterprise"]
["VARIABLE COSTS",null,null,"Quantity","Quantity","Units","$/Unit","$/Unit","Total","Total","Share","Share","Landlord","Landlord","Tenant","Tenant","Total","Total"]
["Production Costs"]
[null,"Custom"]
[null,"","Tree & Brush Removal",1,null,"Acre",150,null,150,{"$f":"E18*H18","v":0},0,null,0,{"$f":"J18*L18","v":0},150,{"$f":"+J18-N18","v":0},15000,{"$f":"+J18*E$7","v":0}]
[null,"","Custom Sprig",1,null,"Acre",120,null,120,0,0,null,0,0,120,0,12000,0]
[null,"Fertilizer"]
[null,"","18-46-0 ",100,null,"Pound",0.6,null,60,0,0,null,0,0,60,0,6000,0]
[null,"","46-0-0",100,null,"Pound",0.55000000000000004,null,55.000000000000007,0,0,null,0,0,55.000000000000007,0,5500.0000000000009,0]
[null,"Seed"]
[null,"","Bermuda Sprigs",30,null,"Bushel",2.25,null,67.5,0,0,null,0,0,67.5,0,6750,0]
[null,null,null,0,null,null,0,null,0,0,0,null,0,0,0,0,0,0]
[null,null,null,0,null,null,0,null,0,0,0,null,0,0,0,0,0,0]
[null,null,null,0,null,null,0,null,0,{"$f":"E27*H27","v":0},0,null,0,{"$f":"J27*L27","v":0},0,{"$f":"+J27-N27","v":0},0,{"$f":"+J27*E$7","v":0}]
[null,"Machinery Labor"]
[null,null,"Tractors/Self-Propelled",1,null,"Hour",12,null,12,{"$f":"E29*H29","v":0},0,null,0,{"$f":"J29*L29","v":0},12,{"$f":"+J29-N29","v":0},1200,{"$f":"+J29*E$7","v":0}]
[null,null,"Other Labor",0,null,"Hour",12,null,0,{"$f":"E30*H30","v":0},0,null,0,{"$f":"J30*L30","v":0},0,{"$f":"+J30-N30","v":0},0,{"$f":"+J30*E$7","v":0}]
[]
[null,"Diesel Fuel"]
[null,null,"Pickup/General Use Equipment",1,null,"Acre",0,null,0,{"$f":"E33*H33","v":0},0,null,0,{"$f":"J33*L33","v":0},0,{"$f":"+J33-N33","v":0},0,{"$f":"+J33*E$7","v":0}]
[null,null,"Tractors/Self-Propelled",3.82,null,"Gallon",3.6,null,13.751999999999999,{"$f":"E34*H34","v":0},0,null,0,{"$f":"J34*L34","v":0},13.751999999999999,{"$f":"+J34-N34","v":0},1375.1999999999998,{"$f":"+J34*E$7","v":0}]
[]
[null,"Gasoline"]
[null,null,"Pickup/General Use Equipment",1,null,"Acre",0,null,0,{"$f":"E37*H37","v":0},0,null,0,{"$f":"J37*L37","v":0},0,{"$f":"+J37-N37","v":0},0,{"$f":"+J37*E$7","v":0}]
[null,null,"Tractors/Self-Propelled",0,null,"Gallon",3.15,null,0,{"$f":"E38*H38","v":0},0,null,0,{"$f":"J38*L38","v":0},0,{"$f":"+J38-N38","v":0},0,{"$f":"+J38*E$7","v":0}]
[]
[null,"Repairs & Maintenance"]
[null,null,"Pickup/General Use Equipment",1,null,"Acre",0,null,0,{"$f":"E41*H41","v":0},0,null,0,{"$f":"J41*L41","v":0},0,{"$f":"+J41-N41","v":0},0,{"$f":"+J41*E$7","v":0}]
[null,null,"Irrigation Equipment",1,null,"Acre",0,null,0,0,0,null,0,0,0,0,0,0]
[null,null,"Tractors/Self-Propelled",1,null,"Acre",4.5780472153933776,null,4.5780472153933776,0,0,null,0,0,4.5780472153933776,0,457.80472153933778,0]
[null,null,"Implements",1,null,"Acre",4.8619877559308984,null,4.8619877559308984,0,0,null,0,0,4.8619877559308984,0,486.19877559308986,0]
[null,null,null,null,null,null,null,null,0,0,0,null,0,0,0,0,0,0]
[null,null,null,null,null,null,null,null,0,0,0,null,0,0,0,0,0,0]
[null,"Interest on Credit Line",null,null,null,null,0.08,null,25.358442757309696,{"$f":"+SUM(J17:J46)/2*H47","v":0},null,null,0,{"$f":"+SUM(N17:N46)/2*L47","v":0},25.358442757309696,{"$f":"+SUM(P17:P46)/2*L47","v":0},2535.8442757309695,{"$f":"+J47*E$7","v":0}]
["Total Variable Costs",null,null,null,null,null,null,null,513.05047772863395,{"$f":"SUM(J18:J47)","v":0},null,null,0,{"$f":"SUM(N18:N47)","v":0},513.05047772863395,{"$f":"SUM(P18:P47)","v":0},51305.047772863392,{"$f":"SUM(R18:R47)","v":0}]
["Planned Returns Above Variable Costs:",null,null,null,null,null,null,null,-513.05047772863395,{"$f":"+J13-J48","v":0},null,null,0,{"$f":"+N13-N48","v":0},-513.05047772863395,{"$f":"+P13-P48","v":0},-51305.047772863392,{"$f":"+R13-R48","v":0}]
[null,"Breakeven Price to Cover Variable Costs",null,null,null,null,"n/a",{"$f":"IF(E10=0,\"n/a\",(YVarExp-(YTotExp+YTotRet-J10))/E10)","v":"n/a"},""]
[null,null,null,null,null,null,null,null,null,null,null,null,null,null,null,null,"Enterprise","Enterprise"]
["FIXED COSTS",null,null,"Quantity","Quantity","Units","$/Unit","$/Unit","Total","Total","Share","Share","Landlord","Landlord","Tenant","Tenant","Total","Total"]
[null,"Machinery Depreciation"]
[null,null,"Tractors/Self-Propelled",1,null,"Acre",3.7845190313918584,null,3.7845190313918584,{"$f":"E54*H54","v":0},0,null,0,{"$f":"J54*L54","v":0},3.7845190313918584,{"$f":"+J54-N54","v":0},378.45190313918584,{"$f":"+J54*E$7","v":0}]
[null,null,"Implements",1,null,"Acre",6.0688081921387536,null,6.0688081921387536,0,0,null,0,{"$f":"J55*L55","v":0},6.0688081921387536,0,606.88081921387538,0]
[null,"Equipment Investment"]
[null,null,"Tractors/Self-Propelled",29.482624067133347,null,"Dollars",0.08,null,2.358609925370668,{"$f":"E57*H57","v":0},0,null,0,{"$f":"J57*L57","v":0},2.358609925370668,{"$f":"+J57-N57","v":0},235.86099253706681,{"$f":"+J57*E$7","v":0}]
[null,null,"Implements",26.327740599704676,null,"Dollars",0.08,null,2.1062192479763739,0,0,null,0,{"$f":"J58*L58","v":0},2.1062192479763739,0,210.6219247976374,0]
[null,"Salaried Labor",null,1,null,"Acre",0,null,0,0,0,null,0,{"$f":"J59*L59","v":0},0,{"$f":"+J59-N59","v":0},0,{"$f":"+J59*E$7","v":0}]
[null,"Management Fee, Owner/Operator Labor",null,1,null,"Acre",0,null,0,0,0,null,0,0,0,0,0,0]
[null,"Allocated Establishment Cost",null,1,null,"Acre",0,null,0,0,0,null,0,0,0,0,0,0]
[null,"None",null,1,null,"Acre",0,null,0,0,0,null,0,0,0,0,0,0]
[null,"Property Taxes",null,1,null,"Acre",0,null,0,0,0,null,0,0,0,0,0,0]
[null,"Whole Farm Insurance",null,1,null,"Acre",0,null,0,0,0,null,0,0,0,0,0,0]
[null,null,null,1,null,null,0,null,0,0,0,null,0,0,0,0,0,0]
[null,null,null,1,null,null,0,null,0,{"$f":"E66*H66","v":0},0,null,0,0,0,0,0,0]
["Total Fixed Costs",null,null,null,null,null,null,null,14.318156396877654,{"$f":"+SUM(J54:J66)","v":0},null,null,0,{"$f":"+SUM(N54:N66)","v":0},14.318156396877654,{"$f":"+SUM(P54:P66)","v":0},1431.8156396877653,{"$f":"+SUM(R54:R66)","v":0}]
["Total Specified Costs",null,null,null,null,null,null,null,527.36863412551156,{"$f":"+J48+J67","v":0},null,null,0,{"$f":"+N48+N67","v":0},527.36863412551156,{"$f":"+P48+P67","v":0},52736.86341255116,{"$f":"+R48+R67","v":0}]
[]
["Returns Above Specified Costs",null,null,null,null,null,null,null,-527.36863412551156,{"$f":"+J13-J68","v":0},null,null,0,{"$f":"+N13-N68","v":0},-527.36863412551156,{"$f":"+P13-P68","v":0},-52736.86341255116,{"$f":"+R13-R68","v":0}]
[]
["    Breakeven Price to Cover Total Costs",null,null,null,null,null,"n/a",{"$f":"IF(E10=0,\"n/a\",(YTotExp-(YTotExp+YTotRet-J10))/E10)","v":"n/a"},""]
[]
[null,null,null,"Example Breakeven Prices"]
[null,"Example","Example","To Cover",null,null,"To Cover"]
[null,"Yield","Yield","Variable",null,null,"Total"]
[null,"Percent","","Costs",null,null,"Costs"]
[null,0.75,0,0,null,null,0]
[null,0.9,0,0,null,null,0]
[null,1,0,0,null,null,0]
[null,1.1000000000000001,0,0,null,null,0]
[null,1.25,0,0,null,null,0]
[]
[null,null,null,"Your Breakeven Prices"]
[null,"Your","Your",null,"To Cover",null,null,"To Cover"]
[null,"Yield","Yield",null,"Variable",null,null,"Total"]
[null,"Percent","",null,"Costs",null,null,"Costs"]
[null,0.75,{"$f":"E10*YPER1","v":0},null,{"$f":"IF($E$10=0,0,(YVarExp-(YTotExp+YTotRet-J10))/($E$10*YPER1))","v":0},null,null,{"$f":"IF($E$10=0,0,(YTotExp-(YTotExp+YTotRet-J10))/($E$10*YPER1))","v":0}]
[null,0.9,{"$f":"E10*YPER2","v":0},null,{"$f":"IF($E$10=0,0,(YVarExp-(YTotExp+YTotRet-J10))/($E$10*YPER2))","v":0},null,null,{"$f":"IF($E$10=0,0,(YTotExp-(YTotExp+YTotRet-J10))/($E$10*YPER2))","v":0}]
[null,1,{"$f":"+E10","v":0},null,{"$f":"IF($E$10=0,0,(YVarExp-(YTotExp+YTotRet-J10))/($E$10*YPER3))","v":0},null,null,{"$f":"IF($E$10=0,0,(YTotExp-(YTotExp+YTotRet-J10))/($E$10*YPER3))","v":0}]
[null,1.1000000000000001,{"$f":"E10*YPER4","v":0},null,{"$f":"IF($E$10=0,0,(YVarExp-(YTotExp+YTotRet-J10))/($E$10*YPER4))","v":0},null,null,{"$f":"IF($E$10=0,0,(YTotExp-(YTotExp+YTotRet-J10))/($E$10*YPER4))","v":0}]
[null,1.25,{"$f":"E10*YPER5","v":0},null,{"$f":"IF($E$10=0,0,(YVarExp-(YTotExp+YTotRet-J10))/($E$10*YPER5))","v":0},null,null,{"$f":"IF($E$10=0,0,(YTotExp-(YTotExp+YTotRet-J10))/($E$10*YPER5))","v":0}]
[]
["  Developed by Jason Johnson, Associate Professor and Extension Economist, Texas A&M AgriLife Extension, 254-968-4144.  "]
[]
["Information presented is prepared solely as a general guide and not intended to recognize or predict the costs and returns from any one operation.  Brand names are mentioned only as examples and imply no endorsement."]

{"sheet":"CoastalHay","index":7,"n_rows":97,"n_cols":18,"rows_kept":97,"cut":false,"hidden":false,"merged":[[74,3,74,8],[84,3,84,8],[96,0,96,11],[0,0,0,11],[1,0,1,11],[2,0,2,11],[3,0,3,11]]}
["Projections for Planning Purposes Only -- Not to be Used without Updating"]
["2024 Estimated Costs and Returns per Acre"]
["Coastal Bermudagrass Hay"]
["Enter your name for this budget in the cell above."]
["Enter  Your Values in the cells highlighed in MAROON."]
[null,null,null,null,"Your Acres",null,null,null,null,null,null,null,null,null,null,null,null,"Your"]
[null,null,"Crop Acres",100,null,null,null,null,null,null,null,"Your",null,null,null,null,"Enterprise","Enterprise"]
[null,null,null,null,"Your",null,null,"Your","Cash","Your","Landlord","Landlord",null,"Your",null,"Your","Total","Total"]
["REVENUE",null,null,"Quantity","Quantity","Units","$/Unit","$/Unit","Total","Total","Share","Share","Landlord","Landlord","Tenant","Tenant","(100 acres)",{"$f":"\"(\" & E7 & \" acres)\"","v":"( acres)"}]
[null,"Bermuda Hay",null,6,null,"Roll",120,null,720,{"$f":"E10*H10","v":0},0,null,0,{"$f":"J10*L10","v":0},720,{"$f":"+J10-N10","v":0},72000,{"$f":"+J10*E$7","v":0}]
[null,null,null,0,null,null,0,null,0,0,0,null,0,0,0,{"$f":"+J11-N11","v":0},0,0]
[null,null,null,0,null,null,0,null,0,0,0,null,0,0,0,0,0,0]
["Total Revenue",null,null,null,null,null,null,null,720,{"$f":"SUM(J10:J12)","v":0},null,null,0,{"$f":"SUM(N10:N12)","v":0},720,{"$f":"SUM(P10:P12)","v":0},72000,{"$f":"SUM(R10:R12)","v":0}]
[null,null,null,null,null,null,null,null,null,null,null,null,null,null,null,null,"Enterprise","Enterprise"]
["VARIABLE COSTS",null,null,"Quantity","Quantity","Units","$/Unit","$/Unit","Total","Total","Share","Share","Landlord","Landlord","Tenant","Tenant","Total","Total"]
["Production Costs"]
[null,"Custom"]
[null,"","Land Renovation",1,null,"Acre",15,null,15,{"$f":"E18*H18","v":0},0,null,0,{"$f":"J18*L18","v":0},15,{"$f":"+J18-N18","v":0},1500,{"$f":"+J18*E$7","v":0}]
[null,"","Custom Spray",3,null,"Acre",8,null,24,0,0,null,0,0,24,0,2400,0]
[null,"","Cut and Bale",3,null,"Acre",30,null,90,0,0,null,0,0,90,0,9000,0]
[null,"Fertilizer"]
[null,"","24-6-12",300,null,"Pound",0.65,null,195,0,0,null,0,0,195,0,19500,0]
[null,"","34-0-0",300,null,"Pound",0.8,null,240,0,0,null,0,0,240,0,24000,0]
[null,"Herbicide"]
[null,"","Hay Pre and Post Herbicide",1,null,"Acre",10,null,10,0,0,null,0,0,10,0,1000,0]
[null,null,null,0,null,null,0,null,0,0,0,null,0,0,0,0,0,0]
[null,null,null,0,null,null,0,null,0,0,0,null,0,0,0,0,0,0]
[null,null,null,0,null,null,0,null,0,{"$f":"E28*H28","v":0},0,null,0,{"$f":"J28*L28","v":0},0,{"$f":"+J28-N28","v":0},0,{"$f":"+J28*E$7","v":0}]
[null,"Machinery Labor"]
[null,null,"Tractors/Self-Propelled",1.49,null,"Hour",12,null,17.88,{"$f":"E30*H30","v":0},0,null,0,{"$f":"J30*L30","v":0},17.88,{"$f":"+J30-N30","v":0},1788,{"$f":"+J30*E$7","v":0}]
[null,null,"Other Labor",0,null,"Hour",12,null,0,{"$f":"E31*H31","v":0},0,null,0,{"$f":"J31*L31","v":0},0,{"$f":"+J31-N31","v":0},0,{"$f":"+J31*E$7","v":0}]
[]
[null,"Diesel Fuel"]
[null,null,"Pickup/General Use Equipment",1,null,"Acre",0,null,0,{"$f":"E34*H34","v":0},0,null,0,{"$f":"J34*L34","v":0},0,{"$f":"+J34-N34","v":0},0,{"$f":"+J34*E$7","v":0}]
[null,null,"Tractors/Self-Propelled",5.68,null,"Gallon",3.6,null,20.448,{"$f":"E35*H35","v":0},0,null,0,{"$f":"J35*L35","v":0},20.448,{"$f":"+J35-N35","v":0},2044.8,{"$f":"+J35*E$7","v":0}]
[]
[null,"Gasoline"]
[null,null,"Pickup/General Use Equipment",1,null,"Acre",0,null,0,{"$f":"E38*H38","v":0},0,null,0,{"$f":"J38*L38","v":0},0,{"$f":"+J38-N38","v":0},0,{"$f":"+J38*E$7","v":0}]
[null,null,"Tractors/Self-Propelled",0,null,"Gallon",3.15,null,0,{"$f":"E39*H39","v":0},0,null,0,{"$f":"J39*L39","v":0},0,{"$f":"+J39-N39","v":0},0,{"$f":"+J39*E$7","v":0}]
[]
[null,"Repairs & Maintenance"]
[null,null,"Pickup/General Use Equipment",1,null,"Acre",0,null,0,{"$f":"E42*H42","v":0},0,null,0,{"$f":"J42*L42","v":0},0,{"$f":"+J42-N42","v":0},0,{"$f":"+J42*E$7","v":0}]
[null,null,"Irrigation Equipment",1,null,"Acre",0,null,0,0,0,null,0,0,0,0,0,0]
[null,null,"Tractors/Self-Propelled",1,null,"Acre",6.8144738703547283,null,6.8144738703547283,0,0,null,0,0,6.8144738703547283,0,681.44738703547284,0]
[null,null,"Implements",1,null,"Acre",0.30817173313492069,null,0.30817173313492069,0,0,null,0,0,0.30817173313492069,0,30.81717331349207,0]
[null,null,null,null,null,null,null,null,0,0,0,null,0,0,0,0,0,0]
[null,null,null,null,null,null,null,null,0,0,0,null,0,0,0,0,0,0]
[null,"Interest on Credit Line",null,null,null,null,0.08,null,13.040867194002596,{"$f":"+SUM(J17:J47)/2*H48","v":0},null,null,0,{"$f":"+SUM(N17:N47)/2*L48","v":0},13.040867194002596,{"$f":"+SUM(P17:P47)/2*L48","v":0},1304.0867194002597,{"$f":"+J48*E$7","v":0}]
["Total Variable Costs",null,null,null,null,null,null,null,632.49151279749219,{"$f":"SUM(J18:J48)","v":0},null,null,0,{"$f":"SUM(N18:N48)","v":0},632.49151279749219,{"$f":"SUM(P18:P48)","v":0},63249.151279749225,{"$f":"SUM(R18:R48)","v":0}]
["Planned Returns Above Variable Costs:",null,null,null,null,null,null,null,87.508487202507808,{"$f":"+J13-J49","v":0},null,null,0,{"$f":"+N13-N49","v":0},87.508487202507808,{"$f":"+P13-P49","v":0},8750.8487202507749,{"$f":"+R13-R49","v":0}]
[null,"Breakeven Price to Cover Variable Costs",null,null,null,null,105.41525213291537,{"$f":"IF(E10=0,\"n/a\",(YVarExp-(YTotExp+YTotRet-J10))/E10)","v":"n/a"},"Roll"]
[null,null,null,null,null,null,null,null,null,null,null,null,null,null,null,null,"Enterprise","Enterprise"]
["FIXED COSTS",null,null,"Quantity","Quantity","Units","$/Unit","$/Unit","Total","Total","Share","Share","Landlord","Landlord","Tenant","Tenant","Total","Total"]
[null,"Machinery Depreciation"]
[null,null,"Tractors/Self-Propelled",1,null,"Acre",5.633298399493242,null,5.633298399493242,{"$f":"E55*H55","v":0},0,null,0,{"$f":"J55*L55","v":0},5.633298399493242,{"$f":"+J55-N55","v":0},563.3298399493242,{"$f":"+J55*E$7","v":0}]
[null,null,"Implements",1,null,"Acre",0.63665819642857147,null,0.63665819642857147,0,0,null,0,{"$f":"J56*L56","v":0},0.63665819642857147,0,63.665819642857144,0]
[null,"Equipment Investment"]
[null,null,"Tractors/Self-Propelled",43.885211725084446,null,"Dollars",0.08,null,3.5108169380067555,{"$f":"E58*H58","v":0},0,null,0,{"$f":"J58*L58","v":0},3.5108169380067555,{"$f":"+J58-N58","v":0},351.08169380067557,{"$f":"+J58*E$7","v":0}]
[null,null,"Implements",4.0200260069444447,null,"Dollars",0.08,null,0.32160208055555556,0,0,null,0,{"$f":"J59*L59","v":0},0.32160208055555556,0,32.160208055555557,0]
[null,"Salaried Labor",null,1,null,"Acre",0,null,0,0,0,null,0,{"$f":"J60*L60","v":0},0,{"$f":"+J60-N60","v":0},0,{"$f":"+J60*E$7","v":0}]
[null,"Management Fee, Owner/Operator Labor",null,1,null,"Acre",0,null,0,0,0,null,0,0,0,0,0,0]
[null,"Allocated Establishment Cost",null,1,null,"Acre",0,null,0,0,0,null,0,0,0,0,0,0]
[null,"None",null,1,null,"Acre",0,null,0,0,0,null,0,0,0,0,0,0]
[null,"Property Taxes",null,1,null,"Acre",0,null,0,0,0,null,0,0,0,0,0,0]
[null,"Whole Farm Insurance",null,1,null,"Acre",0,null,0,0,0,null,0,0,0,0,0,0]
[null,null,null,1,null,null,0,null,0,0,0,null,0,0,0,0,0,0]
[null,null,null,1,null,null,0,null,0,{"$f":"E67*H67","v":0},0,null,0,0,0,0,0,0]
["Total Fixed Costs",null,null,null,null,null,null,null,10.102375614484124,{"$f":"+SUM(J55:J67)","v":0},null,null,0,{"$f":"+SUM(N55:N67)","v":0},10.102375614484124,{"$f":"+SUM(P55:P67)","v":0},1010.2375614484125,{"$f":"+SUM(R55:R67)","v":0}]
["Total Specified Costs",null,null,null,null,null,null,null,642.59388841197631,{"$f":"+J49+J68","v":0},null,null,0,{"$f":"+N49+N68","v":0},642.59388841197631,{"$f":"+P49+P68","v":0},64259.388841197637,{"$f":"+R49+R68","v":0}]
[]
["Returns Above Specified Costs",null,null,null,null,null,null,null,77.406111588023691,{"$f":"+J13-J69","v":0},null,null,0,{"$f":"+N13-N69","v":0},77.406111588023691,{"$f":"+P13-P69","v":0},7740.6111588023632,{"$f":"+R13-R69","v":0}]
[]
["    Breakeven Price to Cover Total Costs",null,null,null,null,null,107.09898140199606,{"$f":"IF(E10=0,\"n/a\",(YTotExp-(YTotExp+YTotRet-J10))/E10)","v":"n/a"},"Roll"]
[]
[null,null,null,"Example Breakeven Prices"]
[null,"Example","Example","To Cover",null,null,"To Cover"]
[null,"Yield","Yield","Variable",null,null,"Total"]
[null,"Percent","Roll","Costs",null,null,"Costs"]
[null,0.75,4.5,140.55366951055382,null,null,142.79864186932807]
[null,0.9,5.4,117.1280579254615,null,null,118.99886822444005]
[null,1,6,105.41525213291537,null,null,107.09898140199606]
[null,1.1000000000000001,6.6000000000000005,95.832047393559421,null,null,97.362710365450951]
[null,1.25,7.5,84.332201706332299,null,null,85.679185121596845]
[]
[null,null,null,"Your Breakeven Prices"]
[null,"Your","Your",null,"To Cover",null,null,"To Cover"]
[null,"Yield","Yield",null,"Variable",null,null,"Total"]
[null,"Percent","Roll",null,"Costs",null,null,"Costs"]
[null,0.75,{"$f":"E10*YPER1","v":0},null,{"$f":"IF($E$10=0,0,(YVarExp-(YTotExp+YTotRet-J10))/($E$10*YPER1))","v":0},null,null,{"$f":"IF($E$10=0,0,(YTotExp-(YTotExp+YTotRet-J10))/($E$10*YPER1))","v":0}]
[null,0.9,{"$f":"E10*YPER2","v":0},null,{"$f":"IF($E$10=0,0,(YVarExp-(YTotExp+YTotRet-J10))/($E$10*YPER2))","v":0},null,null,{"$f":"IF($E$10=0,0,(YTotExp-(YTotExp+YTotRet-J10))/($E$10*YPER2))","v":0}]
[null,1,{"$f":"+E10","v":0},null,{"$f":"IF($E$10=0,0,(YVarExp-(YTotExp+YTotRet-J10))/($E$10*YPER3))","v":0},null,null,{"$f":"IF($E$10=0,0,(YTotExp-(YTotExp+YTotRet-J10))/($E$10*YPER3))","v":0}]
[null,1.1000000000000001,{"$f":"E10*YPER4","v":0},null,{"$f":"IF($E$10=0,0,(YVarExp-(YTotExp+YTotRet-J10))/($E$10*YPER4))","v":0},null,null,{"$f":"IF($E$10=0,0,(YTotExp-(YTotExp+YTotRet-J10))/($E$10*YPER4))","v":0}]
[null,1.25,{"$f":"E10*YPER5","v":0},null,{"$f":"IF($E$10=0,0,(YVarExp-(YTotExp+YTotRet-J10))/($E$10*YPER5))","v":0},null,null,{"$f":"IF($E$10=0,0,(YTotExp-(YTotExp+YTotRet-J10))/($E$10*YPER5))","v":0}]
[]
["  Developed by Jason Johnson, Associate Professor and Extension Economist, Texas A&M AgriLife Extension, 254-968-4144.  "]
[]
["Information presented is prepared solely as a general guide and not intended to recognize or predict the costs and returns from any one operation.  Brand names are mentioned only as examples and imply no endorsement."]

{"sheet":"CoastalPasture","index":8,"n_rows":88,"n_cols":18,"rows_kept":88,"cut":false,"hidden":false,"merged":[[65,3,65,8],[75,3,75,8],[87,0,87,11],[0,0,0,11],[1,0,1,11],[2,0,2,11],[3,0,3,11]]}
["Projections for Planning Purposes Only -- Not to be Used without Updating"]
["2024 Estimated Costs and Returns per Acre"]
["Coastal Bermudagrass Pasture"]
["Enter your name for this budget in the cell above."]
["Enter  Your Values in the cells highlighed in MAROON."]
[null,null,null,null,"Your Acres",null,null,null,null,null,null,null,null,null,null,null,null,"Your"]
[null,null,"Crop Acres",100,null,null,null,null,null,null,null,"Your",null,null,null,null,"Enterprise","Enterprise"]
[null,null,null,null,"Your",null,null,"Your","Cash","Your","Landlord","Landlord",null,"Your",null,"Your","Total","Total"]
["REVENUE",null,null,"Quantity","Quantity","Units","$/Unit","$/Unit","Total","Total","Share","Share","Landlord","Landlord","Tenant","Tenant","(100 acres)",{"$f":"\"(\" & E7 & \" acres)\"","v":"( acres)"}]
[null,"Livestock Grazing",null,5,null,"AUM",26,null,130,{"$f":"E10*H10","v":0},0,null,0,{"$f":"J10*L10","v":0},130,{"$f":"+J10-N10","v":0},13000,{"$f":"+J10*E$7","v":0}]
[null,null,null,0,null,null,0,null,0,0,0,null,0,0,0,{"$f":"+J11-N11","v":0},0,0]
[null,null,null,0,null,null,0,null,0,0,0,null,0,0,0,0,0,0]
["Total Revenue",null,null,null,null,null,null,null,130,{"$f":"SUM(J10:J12)","v":0},null,null,0,{"$f":"SUM(N10:N12)","v":0},130,{"$f":"SUM(P10:P12)","v":0},13000,{"$f":"SUM(R10:R12)","v":0}]
[null,null,null,null,null,null,null,null,null,null,null,null,null,null,null,null,"Enterprise","Enterprise"]
["VARIABLE COSTS",null,null,"Quantity","Quantity","Units","$/Unit","$/Unit","Total","Total","Share","Share","Landlord","Landlord","Tenant","Tenant","Total","Total"]
["Production Costs"]
[null,"Custom"]
[null,"","Custom Spray",2,null,"Acre",8,null,16,{"$f":"E18*H18","v":0},0,null,0,{"$f":"J18*L18","v":0},16,{"$f":"+J18-N18","v":0},1600,{"$f":"+J18*E$7","v":0}]
[null,"Fertilizer"]
[null,"","24-6-12",200,null,"Pound",0.65,null,130,0,0,null,0,0,130,0,13000,0]
[null,"Herbicide"]
[null,"","Herbicide, Pasture",1,null,"Acre",10,null,10,0,0,null,0,0,10,0,1000,0]
[null,null,null,0,null,null,0,null,0,0,0,null,0,0,0,0,0,0]
[null,null,null,0,null,null,0,null,0,0,0,null,0,0,0,0,0,0]
[null,null,null,0,null,null,0,null,0,{"$f":"E25*H25","v":0},0,null,0,{"$f":"J25*L25","v":0},0,{"$f":"+J25-N25","v":0},0,{"$f":"+J25*E$7","v":0}]
[null,"Machinery Labor"]
[null,null,"Tractors/Self-Propelled",0,null,"Hour",12,null,0,{"$f":"E27*H27","v":0},0,null,0,{"$f":"J27*L27","v":0},0,{"$f":"+J27-N27","v":0},0,{"$f":"+J27*E$7","v":0}]
[null,null,"Other Labor",0,null,"Hour",12,null,0,{"$f":"E28*H28","v":0},0,null,0,{"$f":"J28*L28","v":0},0,{"$f":"+J28-N28","v":0},0,{"$f":"+J28*E$7","v":0}]
[]
[null,"Diesel Fuel"]
[null,null,"Pickup/General Use Equipment",1,null,"Acre",0,null,0,{"$f":"E31*H31","v":0},0,null,0,{"$f":"J31*L31","v":0},0,{"$f":"+J31-N31","v":0},0,{"$f":"+J31*E$7","v":0}]
[null,null,"Tractors/Self-Propelled",0,null,"Gallon",3.6,null,0,{"$f":"E32*H32","v":0},0,null,0,{"$f":"J32*L32","v":0},0,{"$f":"+J32-N32","v":0},0,{"$f":"+J32*E$7","v":0}]
[]
[null,"Gasoline"]
[null,null,"Pickup/General Use Equipment",1,null,"Acre",0,null,0,{"$f":"E35*H35","v":0},0,null,0,{"$f":"J35*L35","v":0},0,{"$f":"+J35-N35","v":0},0,{"$f":"+J35*E$7","v":0}]
[null,null,"Tractors/Self-Propelled",0,null,"Gallon",3.15,null,0,{"$f":"E36*H36","v":0},0,null,0,{"$f":"J36*L36","v":0},0,{"$f":"+J36-N36","v":0},0,{"$f":"+J36*E$7","v":0}]
[]
[null,"Repairs & Maintenance"]
[null,null,"Pickup/General Use Equipment",1,null,"Acre",0,null,0,{"$f":"E39*H39","v":0},0,null,0,{"$f":"J39*L39","v":0},0,{"$f":"+J39-N39","v":0},0,{"$f":"+J39*E$7","v":0}]
[null,null,"Irrigation Equipment",1,null,"Acre",0,null,0,0,0,null,0,0,0,0,0,0]
[null,null,"Tractors/Self-Propelled",1,null,"Acre",0,null,0,0,0,null,0,0,0,0,0,0]
[null,null,"Implements",1,null,"Acre",0,null,0,0,0,null,0,0,0,0,0,0]
[null,null,null,null,null,null,null,null,0,0,0,null,0,0,0,0,0,0]
[null,null,null,null,null,null,null,null,0,0,0,null,0,0,0,0,0,0]
[null,"Interest on Credit Line",null,null,null,null,0.08,null,3.9642739726027401,{"$f":"+SUM(J17:J44)/2*H45","v":0},null,null,0,{"$f":"+SUM(N17:N44)/2*L45","v":0},3.9642739726027401,{"$f":"+SUM(P17:P44)/2*L45","v":0},396.42739726027401,{"$f":"+J45*E$7","v":0}]
["Total Variable Costs",null,null,null,null,null,null,null,159.96427397260274,{"$f":"SUM(J18:J45)","v":0},null,null,0,{"$f":"SUM(N18:N45)","v":0},159.96427397260274,{"$f":"SUM(P18:P45)","v":0},15996.427397260273,{"$f":"SUM(R18:R45)","v":0}]
["Planned Returns Above Variable Costs:",null,null,null,null,null,null,null,-29.96427397260274,{"$f":"+J13-J46","v":0},null,null,0,{"$f":"+N13-N46","v":0},-29.96427397260274,{"$f":"+P13-P46","v":0},-2996.4273972602732,{"$f":"+R13-R46","v":0}]
[null,"Breakeven Price to Cover Variable Costs",null,null,null,null,31.992854794520547,{"$f":"IF(E10=0,\"n/a\",(YVarExp-(YTotExp+YTotRet-J10))/E10)","v":"n/a"},"AUM"]
[null,null,null,null,null,null,null,null,null,null,null,null,null,null,null,null,"Enterprise","Enterprise"]
["FIXED COSTS",null,null,"Quantity","Quantity","Units","$/Unit","$/Unit","Total","Total","Share","Share","Landlord","Landlord","Tenant","Tenant","Total","Total"]
[null,"Salaried Labor",null,1,null,"Acre",0,null,0,{"$f":"E51*H51","v":0},0,null,0,{"$f":"J51*L51","v":0},0,{"$f":"+J51-N51","v":0},0,{"$f":"+J51*E$7","v":0}]
[null,"Management Fee, Owner/Operator Labor",null,1,null,"Acre",0,null,0,0,0,null,0,0,0,0,0,0]
[null,"Allocated Establishment Cost",null,1,null,"Acre",0,null,0,0,0,null,0,0,0,0,0,0]
[null,"None",null,1,null,"Acre",0,null,0,0,0,null,0,0,0,0,0,0]
[null,"Property Taxes",null,1,null,"Acre",0,null,0,0,0,null,0,0,0,0,0,0]
[null,"Whole Farm Insurance",null,1,null,"Acre",0,null,0,0,0,null,0,0,0,0,0,0]
[null,null,null,1,null,null,0,null,0,0,0,null,0,0,0,0,0,0]
[null,null,null,1,null,null,0,null,0,{"$f":"E58*H58","v":0},0,null,0,0,0,0,0,0]
["Total Fixed Costs",null,null,null,null,null,null,null,0,{"$f":"+SUM(J51:J58)","v":0},null,null,0,{"$f":"+SUM(N51:N58)","v":0},0,{"$f":"+SUM(P51:P58)","v":0},0,{"$f":"+SUM(R51:R58)","v":0}]
["Total Specified Costs",null,null,null,null,null,null,null,159.96427397260274,{"$f":"+J46+J59","v":0},null,null,0,{"$f":"+N46+N59","v":0},159.96427397260274,{"$f":"+P46+P59","v":0},15996.427397260273,{"$f":"+R46+R59","v":0}]
[]
["Returns Above Specified Costs",null,null,null,null,null,null,null,-29.96427397260274,{"$f":"+J13-J60","v":0},null,null,0,{"$f":"+N13-N60","v":0},-29.96427397260274,{"$f":"+P13-P60","v":0},-2996.4273972602732,{"$f":"+R13-R60","v":0}]
[]
["    Breakeven Price to Cover Total Costs",null,null,null,null,null,31.992854794520547,{"$f":"IF(E10=0,\"n/a\",(YTotExp-(YTotExp+YTotRet-J10))/E10)","v":"n/a"},"AUM"]
[]
[null,null,null,"Example Breakeven Prices"]
[null,"Example","Example","To Cover",null,null,"To Cover"]
[null,"Yield","Yield","Variable",null,null,"Total"]
[null,"Percent","AUM","Costs",null,null,"Costs"]
[null,0.75,3.75,42.657139726027395,null,null,42.657139726027395]
[null,0.9,4.5,35.547616438356165,null,null,35.547616438356165]
[null,1,5,31.992854794520547,null,null,31.992854794520547]
[null,1.1000000000000001,5.5,29.084413449564135,null,null,29.084413449564135]
[null,1.25,6.25,25.594283835616437,null,null,25.594283835616437]
[]
[null,null,null,"Your Breakeven Prices"]
[null,"Your","Your",null,"To Cover",null,null,"To Cover"]
[null,"Yield","Yield",null,"Variable",null,null,"Total"]
[null,"Percent","AUM",null,"Costs",null,null,"Costs"]
[null,0.75,{"$f":"E10*YPER1","v":0},null,{"$f":"IF($E$10=0,0,(YVarExp-(YTotExp+YTotRet-J10))/($E$10*YPER1))","v":0},null,null,{"$f":"IF($E$10=0,0,(YTotExp-(YTotExp+YTotRet-J10))/($E$10*YPER1))","v":0}]
[null,0.9,{"$f":"E10*YPER2","v":0},null,{"$f":"IF($E$10=0,0,(YVarExp-(YTotExp+YTotRet-J10))/($E$10*YPER2))","v":0},null,null,{"$f":"IF($E$10=0,0,(YTotExp-(YTotExp+YTotRet-J10))/($E$10*YPER2))","v":0}]
[null,1,{"$f":"+E10","v":0},null,{"$f":"IF($E$10=0,0,(YVarExp-(YTotExp+YTotRet-J10))/($E$10*YPER3))","v":0},null,null,{"$f":"IF($E$10=0,0,(YTotExp-(YTotExp+YTotRet-J10))/($E$10*YPER3))","v":0}]
[null,1.1000000000000001,{"$f":"E10*YPER4","v":0},null,{"$f":"IF($E$10=0,0,(YVarExp-(YTotExp+YTotRet-J10))/($E$10*YPER4))","v":0},null,null,{"$f":"IF($E$10=0,0,(YTotExp-(YTotExp+YTotRet-J10))/($E$10*YPER4))","v":0}]
[null,1.25,{"$f":"E10*YPER5","v":0},null,{"$f":"IF($E$10=0,0,(YVarExp-(YTotExp+YTotRet-J10))/($E$10*YPER5))","v":0},null,null,{"$f":"IF($E$10=0,0,(YTotExp-(YTotExp+YTotRet-J10))/($E$10*YPER5))","v":0}]
[]
["  Developed by Jason Johnson, Associate Professor and Extension Economist, Texas A&M AgriLife Extension, 254-968-4144.  "]
[]
["Information presented is prepared solely as a general guide and not intended to recognize or predict the costs and returns from any one operation.  Brand names are mentioned only as examples and imply no endorsement."]

{"sheet":"Sorghum","index":9,"n_rows":103,"n_cols":18,"rows_kept":103,"cut":false,"hidden":false,"merged":[[80,3,80,8],[90,3,90,8],[102,0,102,11],[0,0,0,11],[1,0,1,11],[2,0,2,11],[3,0,3,11]]}
["Projections for Planning Purposes Only -- Not to be Used without Updating"]
["2024 Estimated Costs and Returns per Acre"]
["Grain Sorghum"]
["Enter your name for this budget in the cell above."]
["Enter  Your Values in the cells highlighed in MAROON."]
[null,null,null,null,"Your Acres",null,null,null,null,null,null,null,null,null,null,null,null,"Your"]
[null,null,"Crop Acres",500,null,null,null,null,null,null,null,"Your",null,null,null,null,"Enterprise","Enterprise"]
[null,null,null,null,"Your",null,null,"Your","Cash","Your","Landlord","Landlord",null,"Your",null,"Your","Total","Total"]
["REVENUE",null,null,"Quantity","Quantity","Units","$/Unit","$/Unit","Total","Total","Share","Share","Landlord","Landlord","Tenant","Tenant","(500 acres)",{"$f":"\"(\" & E7 & \" acres)\"","v":"( acres)"}]
[null,"Grain Sorghum",null,45,null,"CWT",8.5,null,382.5,{"$f":"E10*H10","v":0},0,null,0,{"$f":"J10*L10","v":0},382.5,{"$f":"+J10-N10","v":0},191250,{"$f":"+J10*E$7","v":0}]
[null,null,null,0,null,null,0,null,0,0,0,null,0,0,0,{"$f":"+J11-N11","v":0},0,0]
[null,null,null,0,null,null,0,null,0,0,0,null,0,0,0,0,0,0]
["Total Revenue",null,null,null,null,null,null,null,382.5,{"$f":"SUM(J10:J12)","v":0},null,null,0,{"$f":"SUM(N10:N12)","v":0},382.5,{"$f":"SUM(P10:P12)","v":0},191250,{"$f":"SUM(R10:R12)","v":0}]
[null,null,null,null,null,null,null,null,null,null,null,null,null,null,null,null,"Enterprise","Enterprise"]
["VARIABLE COSTS",null,null,"Quantity","Quantity","Units","$/Unit","$/Unit","Total","Total","Share","Share","Landlord","Landlord","Tenant","Tenant","Total","Total"]
["Production Costs"]
[null,"Custom"]
[null,"","Dry Fertilizer Rig",1,null,"Acre",8,null,8,{"$f":"E18*H18","v":0},0,null,0,{"$f":"J18*L18","v":0},8,{"$f":"+J18-N18","v":0},4000,{"$f":"+J18*E$7","v":0}]
[null,"","Custom Combine",1,null,"Acre",35,null,35,0,0,null,0,0,35,0,17500,0]
[null,"","Custom Hauling Sorghum",45,null,"CWT",0.25,null,11.25,0,0,null,0,0,11.25,0,5625,0]
[null,"Fertilizer"]
[null,"","18-46-0 ",100,null,"Pound",0.6,null,60,0,0,null,0,0,60,0,30000,0]
[null,"","46-0-0",80,null,"Pound",0.55000000000000004,null,44,0,0,null,0,0,44,0,22000,0]
[null,"Herbicide"]
[null,"","Pre-emerge sorghum",1.5,null,"Quart",19,null,28.5,0,0,null,0,0,28.5,0,14250,0]
[null,"Seed"]
[null,"","Treated Sorghum Seed",5,null,"Pound",2.6,null,13,0,0,null,0,0,13,0,6500,0]
[null,"Miscellaneous"]
[null,"","Insurance - Sorghum",1,null,"Acre",14,null,14,0,0,null,0,0,14,0,7000,0]
[null,"Insecticide"]
[null,"","Insecticide - Midge",1,null,"Acre",3,null,3,0,0,null,0,0,3,0,1500,0]
[null,null,null,0,null,null,0,null,0,0,0,null,0,0,0,0,0,0]
[null,null,null,0,null,null,0,null,0,0,0,null,0,0,0,0,0,0]
[null,null,null,0,null,null,0,null,0,{"$f":"E34*H34","v":0},0,null,0,{"$f":"J34*L34","v":0},0,{"$f":"+J34-N34","v":0},0,{"$f":"+J34*E$7","v":0}]
[null,"Machinery Labor"]
[null,null,"Tractors/Self-Propelled",0.23,null,"Hour",12,null,2.7600000000000002,{"$f":"E36*H36","v":0},0,null,0,{"$f":"J36*L36","v":0},2.7600000000000002,{"$f":"+J36-N36","v":0},1380.0000000000002,{"$f":"+J36*E$7","v":0}]
[null,null,"Other Labor",0,null,"Hour",12,null,0,{"$f":"E37*H37","v":0},0,null,0,{"$f":"J37*L37","v":0},0,{"$f":"+J37-N37","v":0},0,{"$f":"+J37*E$7","v":0}]
[]
[null,"Diesel Fuel"]
[null,null,"Pickup/General Use Equipment",1,null,"Acre",0,null,0,{"$f":"E40*H40","v":0},0,null,0,{"$f":"J40*L40","v":0},0,{"$f":"+J40-N40","v":0},0,{"$f":"+J40*E$7","v":0}]
[null,null,"Tractors/Self-Propelled",2.15,null,"Gallon",3.6,null,7.74,{"$f":"E41*H41","v":0},0,null,0,{"$f":"J41*L41","v":0},7.74,{"$f":"+J41-N41","v":0},3870,{"$f":"+J41*E$7","v":0}]
[]
[null,"Gasoline"]
[null,null,"Pickup/General Use Equipment",1,null,"Acre",0,null,0,{"$f":"E44*H44","v":0},0,null,0,{"$f":"J44*L44","v":0},0,{"$f":"+J44-N44","v":0},0,{"$f":"+J44*E$7","v":0}]
[null,null,"Tractors/Self-Propelled",0,null,"Gallon",3.15,null,0,{"$f":"E45*H45","v":0},0,null,0,{"$f":"J45*L45","v":0},0,{"$f":"+J45-N45","v":0},0,{"$f":"+J45*E$7","v":0}]
[]
[null,"Repairs & Maintenance"]
[null,null,"Pickup/General Use Equipment",1,null,"Acre",0,null,0,{"$f":"E48*H48","v":0},0,null,0,{"$f":"J48*L48","v":0},0,{"$f":"+J48-N48","v":0},0,{"$f":"+J48*E$7","v":0}]
[null,null,"Irrigation Equipment",1,null,"Acre",0,null,0,0,0,null,0,0,0,0,0,0]
[null,null,"Tractors/Self-Propelled",1,null,"Acre",5.862144552009263,null,5.862144552009263,0,0,null,0,0,5.862144552009263,0,2931.0722760046315,0]
[null,null,"Implements",1,null,"Acre",6.3693491391425647,null,6.3693491391425647,0,0,null,0,0,6.3693491391425647,0,3184.6745695712825,0]
[null,null,null,null,null,null,null,null,0,0,0,null,0,0,0,0,0,0]
[null,null,null,null,null,null,null,null,0,0,0,null,0,0,0,0,0,0]
[null,"Interest on Credit Line",null,null,null,null,0.08,null,8.3433402990879912,{"$f":"+SUM(J17:J53)/2*H54","v":0},null,null,0,{"$f":"+SUM(N17:N53)/2*L54","v":0},8.3433402990879912,{"$f":"+SUM(P17:P53)/2*L54","v":0},4171.6701495439956,{"$f":"+J54*E$7","v":0}]
["Total Variable Costs",null,null,null,null,null,null,null,247.82483399023982,{"$f":"SUM(J18:J54)","v":0},null,null,0,{"$f":"SUM(N18:N54)","v":0},247.82483399023982,{"$f":"SUM(P18:P54)","v":0},123912.41699511991,{"$f":"SUM(R18:R54)","v":0}]
["Planned Returns Above Variable Costs:",null,null,null,null,null,null,null,134.67516600976018,{"$f":"+J13-J55","v":0},null,null,0,{"$f":"+N13-N55","v":0},134.67516600976018,{"$f":"+P13-P55","v":0},67337.583004880085,{"$f":"+R13-R55","v":0}]
[null,"Breakeven Price to Cover Variable Costs",null,null,null,null,5.5072185331164407,{"$f":"IF(E10=0,\"n/a\",(YVarExp-(YTotExp+YTotRet-J10))/E10)","v":"n/a"},"CWT"]
[null,null,null,null,null,null,null,null,null,null,null,null,null,null,null,null,"Enterprise","Enterprise"]
["FIXED COSTS",null,null,"Quantity","Quantity","Units","$/Unit","$/Unit","Total","Total","Share","Share","Landlord","Landlord","Tenant","Tenant","Total","Total"]
[null,"Machinery Depreciation"]
[null,null,"Tractors/Self-Propelled",1,null,"Acre",6.5673871811070512,null,6.5673871811070512,{"$f":"E61*H61","v":0},0,null,0,{"$f":"J61*L61","v":0},6.5673871811070512,{"$f":"+J61-N61","v":0},3283.6935905535256,{"$f":"+J61*E$7","v":0}]
[null,null,"Implements",1,null,"Acre",8.7319596906397479,null,8.7319596906397479,0,0,null,0,{"$f":"J62*L62","v":0},8.7319596906397479,0,4365.9798453198737,0]
[null,"Equipment Investment"]
[null,null,"Tractors/Self-Propelled",50.925176412866648,null,"Dollars",0.08,null,4.0740141130293317,{"$f":"E64*H64","v":0},0,null,0,{"$f":"J64*L64","v":0},4.0740141130293317,{"$f":"+J64-N64","v":0},2037.0070565146659,{"$f":"+J64*E$7","v":0}]
[null,null,"Implements",37.353383121070031,null,"Dollars",0.08,null,2.9882706496856026,0,0,null,0,{"$f":"J65*L65","v":0},2.9882706496856026,0,1494.1353248428013,0]
[null,"Salaried Labor",null,1,null,"Acre",0,null,0,0,0,null,0,{"$f":"J66*L66","v":0},0,{"$f":"+J66-N66","v":0},0,{"$f":"+J66*E$7","v":0}]
[null,"Management Fee, Owner/Operator Labor",null,1,null,"Acre",0,null,0,0,0,null,0,0,0,0,0,0]
[null,"Allocated Establishment Cost",null,1,null,"Acre",0,null,0,0,0,null,0,0,0,0,0,0]
[null,"Dryland Crop Rent",null,1,null,"Acre",30,null,30,0,0,null,0,0,30,0,15000,0]
[null,"Property Taxes",null,1,null,"Acre",0,null,0,0,0,null,0,0,0,0,0,0]
[null,"Whole Farm Insurance",null,1,null,"Acre",0,null,0,0,0,null,0,0,0,0,0,0]
[null,null,null,1,null,null,0,null,0,0,0,null,0,0,0,0,0,0]
[null,null,null,1,null,null,0,null,0,{"$f":"E73*H73","v":0},0,null,0,0,0,0,0,0]
["Total Fixed Costs",null,null,null,null,null,null,null,52.36163163446173,{"$f":"+SUM(J61:J73)","v":0},null,null,0,{"$f":"+SUM(N61:N73)","v":0},52.36163163446173,{"$f":"+SUM(P61:P73)","v":0},26180.815817230865,{"$f":"+SUM(R61:R73)","v":0}]
["Total Specified Costs",null,null,null,null,null,null,null,300.18646562470155,{"$f":"+J55+J74","v":0},null,null,0,{"$f":"+N55+N74","v":0},300.18646562470155,{"$f":"+P55+P74","v":0},150093.23281235079,{"$f":"+R55+R74","v":0}]
[]
["Returns Above Specified Costs",null,null,null,null,null,null,null,82.313534375298445,{"$f":"+J13-J75","v":0},null,null,0,{"$f":"+N13-N75","v":0},82.313534375298445,{"$f":"+P13-P75","v":0},41156.76718764921,{"$f":"+R13-R75","v":0}]
[]
["    Breakeven Price to Cover Total Costs",null,null,null,null,null,6.67081034721559,{"$f":"IF(E10=0,\"n/a\",(YTotExp-(YTotExp+YTotRet-J10))/E10)","v":"n/a"},"CWT"]
[]
[null,null,null,"Example Breakeven Prices"]
[null,"Example","Example","To Cover",null,null,"To Cover"]
[null,"Yield","Yield","Variable",null,null,"Total"]
[null,"Percent","CWT","Costs",null,null,"Costs"]
[null,0.75,33.75,7.342958044155254,null,null,8.8944137962874539]
[null,0.9,40.5,6.1191317034627115,null,null,7.412011496906211]
[null,1,45,5.5072185331164407,null,null,6.67081034721559]
[null,1.1000000000000001,49.500000000000007,5.0065623028331272,null,null,6.064373042923263]
[null,1.25,56.25,4.4057748264931522,null,null,5.336648277772472]
[]
[null,null,null,"Your Breakeven Prices"]
[null,"Your","Your",null,"To Cover",null,null,"To Cover"]
[null,"Yield","Yield",null,"Variable",null,null,"Total"]
[null,"Percent","CWT",null,"Costs",null,null,"Costs"]
[null,0.75,{"$f":"E10*YPER1","v":0},null,{"$f":"IF($E$10=0,0,(YVarExp-(YTotExp+YTotRet-J10))/($E$10*YPER1))","v":0},null,null,{"$f":"IF($E$10=0,0,(YTotExp-(YTotExp+YTotRet-J10))/($E$10*YPER1))","v":0}]
[null,0.9,{"$f":"E10*YPER2","v":0},null,{"$f":"IF($E$10=0,0,(YVarExp-(YTotExp+YTotRet-J10))/($E$10*YPER2))","v":0},null,null,{"$f":"IF($E$10=0,0,(YTotExp-(YTotExp+YTotRet-J10))/($E$10*YPER2))","v":0}]
[null,1,{"$f":"+E10","v":0},null,{"$f":"IF($E$10=0,0,(YVarExp-(YTotExp+YTotRet-J10))/($E$10*YPER3))","v":0},null,null,{"$f":"IF($E$10=0,0,(YTotExp-(YTotExp+YTotRet-J10))/($E$10*YPER3))","v":0}]
[null,1.1000000000000001,{"$f":"E10*YPER4","v":0},null,{"$f":"IF($E$10=0,0,(YVarExp-(YTotExp+YTotRet-J10))/($E$10*YPER4))","v":0},null,null,{"$f":"IF($E$10=0,0,(YTotExp-(YTotExp+YTotRet-J10))/($E$10*YPER4))","v":0}]
[null,1.25,{"$f":"E10*YPER5","v":0},null,{"$f":"IF($E$10=0,0,(YVarExp-(YTotExp+YTotRet-J10))/($E$10*YPER5))","v":0},null,null,{"$f":"IF($E$10=0,0,(YTotExp-(YTotExp+YTotRet-J10))/($E$10*YPER5))","v":0}]
[]
["  Developed by Jason Johnson, Associate Professor and Extension Economist, Texas A&M AgriLife Extension, 254-968-4144.  "]
[]
["Information presented is prepared solely as a general guide and not intended to recognize or predict the costs and returns from any one operation.  Brand names are mentioned only as examples and imply no endorsement."]

{"sheet":"Wheat","index":10,"n_rows":106,"n_cols":18,"rows_kept":106,"cut":false,"hidden":false,"merged":[[83,3,83,8],[93,3,93,8],[105,0,105,11],[0,0,0,11],[1,0,1,11],[2,0,2,11],[3,0,3,11]]}
["Projections for Planning Purposes Only -- Not to be Used without Updating"]
["2024 Estimated Costs and Returns per Acre"]
["Hard Red Winter Wheat"]
["Enter your name for this budget in the cell above."]
["Enter  Your Values in the cells highlighed in MAROON."]
[null,null,null,null,"Your Acres",null,null,null,null,null,null,null,null,null,null,null,null,"Your"]
[null,null,"Crop Acres",200,null,null,null,null,null,null,null,"Your",null,null,null,null,"Enterprise","Enterprise"]
[null,null,null,null,"Your",null,null,"Your","Cash","Your","Landlord","Landlord",null,"Your",null,"Your","Total","Total"]
["REVENUE",null,null,"Quantity","Quantity","Units","$/Unit","$/Unit","Total","Total","Share","Share","Landlord","Landlord","Tenant","Tenant","(200 acres)",{"$f":"\"(\" & E7 & \" acres)\"","v":"( acres)"}]
[null,"Wheat",null,48,null,"Bushel",6.6,null,316.79999999999995,{"$f":"E10*H10","v":0},0,null,0,{"$f":"J10*L10","v":0},316.79999999999995,{"$f":"+J10-N10","v":0},63359.999999999993,{"$f":"+J10*E$7","v":0}]
[null,null,null,0,null,null,0,null,0,0,0,null,0,0,0,{"$f":"+J11-N11","v":0},0,0]
[null,null,null,0,null,null,0,null,0,0,0,null,0,0,0,0,0,0]
["Total Revenue",null,null,null,null,null,null,null,316.79999999999995,{"$f":"SUM(J10:J12)","v":0},null,null,0,{"$f":"SUM(N10:N12)","v":0},316.79999999999995,{"$f":"SUM(P10:P12)","v":0},63359.999999999993,{"$f":"SUM(R10:R12)","v":0}]
[null,null,null,null,null,null,null,null,null,null,null,null,null,null,null,null,"Enterprise","Enterprise"]
["VARIABLE COSTS",null,null,"Quantity","Quantity","Units","$/Unit","$/Unit","Total","Total","Share","Share","Landlord","Landlord","Tenant","Tenant","Total","Total"]
["Production Costs"]
[null,"Herbicide"]
[null,"","Weed Burndown",32,null,"Ounce",0.2,null,6.4,{"$f":"E18*H18","v":0},0,null,0,{"$f":"J18*L18","v":0},6.4,{"$f":"+J18-N18","v":0},1280,{"$f":"+J18*E$7","v":0}]
[null,"","Peak",1,null,"Ounce",15,null,15,0,0,null,0,0,15,0,3000,0]
[null,"Seed"]
[null,"","Wheat Seed",90,null,"Pound",0.54,null,48.6,0,0,null,0,0,48.6,0,9720,0]
[null,"Custom"]
[null,"","Custom Combine",1,null,"Acre",35,null,35,0,0,null,0,0,35,0,7000,0]
[null,"","Custom Hauling Wheat",45,null,"Bushel",0.3,null,13.5,0,0,null,0,0,13.5,0,2700,0]
[null,"Miscellaneous"]
[null,"","Insurance - Wheat 65% ",1,null,"Acre",14,null,14,0,0,null,0,0,14,0,2800,0]
[null,"","Insurance - Wheat SCO ",1,null,"Acre",2,null,2,0,0,null,0,0,2,0,400,0]
[null,"Fertilizer"]
[null,"","46-0-0",128,null,"Pound",0.55000000000000004,null,70.400000000000006,0,0,null,0,0,70.400000000000006,0,14080.000000000002,0]
[null,"","18-46-0 ",50,null,"Pound",0.6,null,30,0,0,null,0,0,30,0,6000,0]
[null,"Insecticide"]
[null,"","Insecticide Greenbug",1,null,"Acre",7.5,null,7.5,0,0,null,0,0,7.5,0,1500,0]
[null,"Fungicides"]
[null,"","Tebuconazole",4,null,"Ounce",1,null,4,0,0,null,0,0,4,0,800,0]
[null,null,null,0,null,null,0,null,0,0,0,null,0,0,0,0,0,0]
[null,null,null,0,null,null,0,null,0,0,0,null,0,0,0,0,0,0]
[null,null,null,0,null,null,0,null,0,{"$f":"E37*H37","v":0},0,null,0,{"$f":"J37*L37","v":0},0,{"$f":"+J37-N37","v":0},0,{"$f":"+J37*E$7","v":0}]
[null,"Machinery Labor"]
[null,null,"Tractors/Self-Propelled",0.5,null,"Hour",12,null,6,{"$f":"E39*H39","v":0},0,null,0,{"$f":"J39*L39","v":0},6,{"$f":"+J39-N39","v":0},1200,{"$f":"+J39*E$7","v":0}]
[null,null,"Other Labor",0,null,"Hour",12,null,0,{"$f":"E40*H40","v":0},0,null,0,{"$f":"J40*L40","v":0},0,{"$f":"+J40-N40","v":0},0,{"$f":"+J40*E$7","v":0}]
[]
[null,"Diesel Fuel"]
[null,null,"Pickup/General Use Equipment",1,null,"Acre",0,null,0,{"$f":"E43*H43","v":0},0,null,0,{"$f":"J43*L43","v":0},0,{"$f":"+J43-N43","v":0},0,{"$f":"+J43*E$7","v":0}]
[null,null,"Tractors/Self-Propelled",3.07,null,"Gallon",3.6,null,11.052,{"$f":"E44*H44","v":0},0,null,0,{"$f":"J44*L44","v":0},11.052,{"$f":"+J44-N44","v":0},2210.4,{"$f":"+J44*E$7","v":0}]
[]
[null,"Gasoline"]
[null,null,"Pickup/General Use Equipment",1,null,"Acre",0,null,0,{"$f":"E47*H47","v":0},0,null,0,{"$f":"J47*L47","v":0},0,{"$f":"+J47-N47","v":0},0,{"$f":"+J47*E$7","v":0}]
[null,null,"Tractors/Self-Propelled",0,null,"Gallon",3.15,null,0,{"$f":"E48*H48","v":0},0,null,0,{"$f":"J48*L48","v":0},0,{"$f":"+J48-N48","v":0},0,{"$f":"+J48*E$7","v":0}]
[]
[null,"Repairs & Maintenance"]
[null,null,"Pickup/General Use Equipment",1,null,"Acre",0,null,0,{"$f":"E51*H51","v":0},0,null,0,{"$f":"J51*L51","v":0},0,{"$f":"+J51-N51","v":0},0,{"$f":"+J51*E$7","v":0}]
[null,null,"Irrigation Equipment",1,null,"Acre",0,null,0,0,0,null,0,0,0,0,0,0]
[null,null,"Tractors/Self-Propelled",1,null,"Acre",6.3637597429462085,null,6.3637597429462085,0,0,null,0,0,6.3637597429462085,0,1272.7519485892417,0]
[null,null,"Implements",1,null,"Acre",6.2206368824591243,null,6.2206368824591243,0,0,null,0,0,6.2206368824591243,0,1244.1273764918249,0]
[null,null,null,null,null,null,null,null,0,0,0,null,0,0,0,0,0,0]
[null,null,null,null,null,null,null,null,0,0,0,null,0,0,0,0,0,0]
[null,"Interest on Credit Line",null,null,null,null,0.08,null,3.3460894971050008,{"$f":"+SUM(J17:J56)/2*H57","v":0},null,null,0,{"$f":"+SUM(N17:N56)/2*L57","v":0},3.3460894971050008,{"$f":"+SUM(P17:P56)/2*L57","v":0},669.2178994210002,{"$f":"+J57*E$7","v":0}]
["Total Variable Costs",null,null,null,null,null,null,null,279.38248612251039,{"$f":"SUM(J18:J57)","v":0},null,null,0,{"$f":"SUM(N18:N57)","v":0},279.38248612251039,{"$f":"SUM(P18:P57)","v":0},55876.497224502062,{"$f":"SUM(R18:R57)","v":0}]
["Planned Returns Above Variable Costs:",null,null,null,null,null,null,null,37.417513877489569,{"$f":"+J13-J58","v":0},null,null,0,{"$f":"+N13-N58","v":0},37.417513877489569,{"$f":"+P13-P58","v":0},7483.502775497931,{"$f":"+R13-R58","v":0}]
[null,"Breakeven Price to Cover Variable Costs",null,null,null,null,5.8204684608856327,{"$f":"IF(E10=0,\"n/a\",(YVarExp-(YTotExp+YTotRet-J10))/E10)","v":"n/a"},"Bushel"]
[null,null,null,null,null,null,null,null,null,null,null,null,null,null,null,null,"Enterprise","Enterprise"]
["FIXED COSTS",null,null,"Quantity","Quantity","Units","$/Unit","$/Unit","Total","Total","Share","Share","Landlord","Landlord","Tenant","Tenant","Total","Total"]
[null,"Machinery Depreciation"]
[null,null,"Tractors/Self-Propelled",1,null,"Acre",6.5758850677110834,null,6.5758850677110834,{"$f":"E64*H64","v":0},0,null,0,{"$f":"J64*L64","v":0},6.5758850677110834,{"$f":"+J64-N64","v":0},1315.1770135422166,{"$f":"+J64*E$7","v":0}]
[null,null,"Implements",1,null,"Acre",7.4201846711253996,null,7.4201846711253996,0,0,null,0,{"$f":"J65*L65","v":0},7.4201846711253996,0,1484.0369342250799,0]
[null,"Equipment Investment"]
[null,null,"Tractors/Self-Propelled",51.228265930716972,null,"Dollars",0.08,null,4.0982612744573581,{"$f":"E67*H67","v":0},0,null,0,{"$f":"J67*L67","v":0},4.0982612744573581,{"$f":"+J67-N67","v":0},819.65225489147167,{"$f":"+J67*E$7","v":0}]
[null,null,"Implements",31.925264982036435,null,"Dollars",0.08,null,2.5540211985629147,0,0,null,0,{"$f":"J68*L68","v":0},2.5540211985629147,0,510.80423971258296,0]
[null,"Salaried Labor",null,1,null,"Acre",0,null,0,0,0,null,0,{"$f":"J69*L69","v":0},0,{"$f":"+J69-N69","v":0},0,{"$f":"+J69*E$7","v":0}]
[null,"Management Fee, Owner/Operator Labor",null,1,null,"Acre",0,null,0,0,0,null,0,0,0,0,0,0]
[null,"Allocated Establishment Cost",null,1,null,"Acre",0,null,0,0,0,null,0,0,0,0,0,0]
[null,"Dryland Crop Rent",null,1,null,"Acre",30,null,30,0,0,null,0,0,30,0,6000,0]
[null,"Property Taxes",null,1,null,"Acre",0,null,0,0,0,null,0,0,0,0,0,0]
[null,"Whole Farm Insurance",null,1,null,"Acre",0,null,0,0,0,null,0,0,0,0,0,0]
[null,null,null,1,null,null,0,null,0,0,0,null,0,0,0,0,0,0]
[null,null,null,1,null,null,0,null,0,{"$f":"E76*H76","v":0},0,null,0,0,0,0,0,0]
["Total Fixed Costs",null,null,null,null,null,null,null,50.648352211856754,{"$f":"+SUM(J64:J76)","v":0},null,null,0,{"$f":"+SUM(N64:N76)","v":0},50.648352211856754,{"$f":"+SUM(P64:P76)","v":0},10129.670442371351,{"$f":"+SUM(R64:R76)","v":0}]
["Total Specified Costs",null,null,null,null,null,null,null,330.03083833436716,{"$f":"+J58+J77","v":0},null,null,0,{"$f":"+N58+N77","v":0},330.03083833436716,{"$f":"+P58+P77","v":0},66006.167666873414,{"$f":"+R58+R77","v":0}]
[]
["Returns Above Specified Costs",null,null,null,null,null,null,null,-13.230838334367206,{"$f":"+J13-J78","v":0},null,null,0,{"$f":"+N13-N78","v":0},-13.230838334367206,{"$f":"+P13-P78","v":0},-2646.1676668734217,{"$f":"+R13-R78","v":0}]
[]
["    Breakeven Price to Cover Total Costs",null,null,null,null,null,6.8756424652993156,{"$f":"IF(E10=0,\"n/a\",(YTotExp-(YTotExp+YTotRet-J10))/E10)","v":"n/a"},"Bushel"]
[]
[null,null,null,"Example Breakeven Prices"]
[null,"Example","Example","To Cover",null,null,"To Cover"]
[null,"Yield","Yield","Variable",null,null,"Total"]
[null,"Percent","Bushel","Costs",null,null,"Costs"]
[null,0.75,36,7.7606246145141773,null,null,9.1675232870657553]
[null,0.9,43.2,6.4671871787618143,null,null,7.6396027392214618]
[null,1,48,5.8204684608856327,null,null,6.8756424652993156]
[null,1.1000000000000001,52.800000000000004,5.291334964441484,null,null,6.250584059363014]
[null,1.25,60,4.6563747687085062,null,null,5.5005139722394523]
[]
[null,null,null,"Your Breakeven Prices"]
[null,"Your","Your",null,"To Cover",null,null,"To Cover"]
[null,"Yield","Yield",null,"Variable",null,null,"Total"]
[null,"Percent","Bushel",null,"Costs",null,null,"Costs"]
[null,0.75,{"$f":"E10*YPER1","v":0},null,{"$f":"IF($E$10=0,0,(YVarExp-(YTotExp+YTotRet-J10))/($E$10*YPER1))","v":0},null,null,{"$f":"IF($E$10=0,0,(YTotExp-(YTotExp+YTotRet-J10))/($E$10*YPER1))","v":0}]
[null,0.9,{"$f":"E10*YPER2","v":0},null,{"$f":"IF($E$10=0,0,(YVarExp-(YTotExp+YTotRet-J10))/($E$10*YPER2))","v":0},null,null,{"$f":"IF($E$10=0,0,(YTotExp-(YTotExp+YTotRet-J10))/($E$10*YPER2))","v":0}]
[null,1,{"$f":"+E10","v":0},null,{"$f":"IF($E$10=0,0,(YVarExp-(YTotExp+YTotRet-J10))/($E$10*YPER3))","v":0},null,null,{"$f":"IF($E$10=0,0,(YTotExp-(YTotExp+YTotRet-J10))/($E$10*YPER3))","v":0}]
[null,1.1000000000000001,{"$f":"E10*YPER4","v":0},null,{"$f":"IF($E$10=0,0,(YVarExp-(YTotExp+YTotRet-J10))/($E$10*YPER4))","v":0},null,null,{"$f":"IF($E$10=0,0,(YTotExp-(YTotExp+YTotRet-J10))/($E$10*YPER4))","v":0}]
[null,1.25,{"$f":"E10*YPER5","v":0},null,{"$f":"IF($E$10=0,0,(YVarExp-(YTotExp+YTotRet-J10))/($E$10*YPER5))","v":0},null,null,{"$f":"IF($E$10=0,0,(YTotExp-(YTotExp+YTotRet-J10))/($E$10*YPER5))","v":0}]
[]
["  Developed by Jason Johnson, Associate Professor and Extension Economist, Texas A&M AgriLife Extension, 254-968-4144.  "]
[]
["Information presented is prepared solely as a general guide and not intended to recognize or predict the costs and returns from any one operation.  Brand names are mentioned only as examples and imply no endorsement."]

{"sheet":"Canola","index":11,"n_rows":103,"n_cols":18,"rows_kept":103,"cut":false,"hidden":false,"merged":[[80,3,80,8],[90,3,90,8],[102,0,102,11],[0,0,0,11],[1,0,1,11],[2,0,2,11],[3,0,3,11]]}
["Projections for Planning Purposes Only -- Not to be Used without Updating"]
["2024 Estimated Costs and Returns per Acre"]
["Canola"]
["Enter your name for this budget in the cell above."]
["Enter  Your Values in the cells highlighed in MAROON."]
[null,null,null,null,"Your Acres",null,null,null,null,null,null,null,null,null,null,null,null,"Your"]
[null,null,"Crop Acres",200,null,null,null,null,null,null,null,"Your",null,null,null,null,"Enterprise","Enterprise"]
[null,null,null,null,"Your",null,null,"Your","Cash","Your","Landlord","Landlord",null,"Your",null,"Your","Total","Total"]
["REVENUE",null,null,"Quantity","Quantity","Units","$/Unit","$/Unit","Total","Total","Share","Share","Landlord","Landlord","Tenant","Tenant","(200 acres)",{"$f":"\"(\" & E7 & \" acres)\"","v":"( acres)"}]
[null,"Canola",null,13,null,"CWT",18,null,234,{"$f":"E10*H10","v":0},0,null,0,{"$f":"J10*L10","v":0},234,{"$f":"+J10-N10","v":0},46800,{"$f":"+J10*E$7","v":0}]
[null,null,null,0,null,null,0,null,0,0,0,null,0,0,0,{"$f":"+J11-N11","v":0},0,0]
[null,null,null,0,null,null,0,null,0,0,0,null,0,0,0,0,0,0]
["Total Revenue",null,null,null,null,null,null,null,234,{"$f":"SUM(J10:J12)","v":0},null,null,0,{"$f":"SUM(N10:N12)","v":0},234,{"$f":"SUM(P10:P12)","v":0},46800,{"$f":"SUM(R10:R12)","v":0}]
[null,null,null,null,null,null,null,null,null,null,null,null,null,null,null,null,"Enterprise","Enterprise"]
["VARIABLE COSTS",null,null,"Quantity","Quantity","Units","$/Unit","$/Unit","Total","Total","Share","Share","Landlord","Landlord","Tenant","Tenant","Total","Total"]
["Production Costs"]
[null,"Seed"]
[null,"","Canola Seed",3,null,"Pound",6.5,null,19.5,{"$f":"E18*H18","v":0},0,null,0,{"$f":"J18*L18","v":0},19.5,{"$f":"+J18-N18","v":0},3900,{"$f":"+J18*E$7","v":0}]
[null,"","Helix Xtra Seed Treatment",1,null,"Acre",0.30753562686680402,null,0.30753562686680402,0,0,null,0,0,0.30753562686680402,0,61.507125373360807,0]
[null,"Fertilizer"]
[null,"","46-0-0",128,null,"Pound",0.55000000000000004,null,70.400000000000006,0,0,null,0,0,70.400000000000006,0,14080.000000000002,0]
[null,"","18-46-0 ",87,null,"Pound",0.6,null,52.199999999999996,0,0,null,0,0,52.199999999999996,0,10440,0]
[null,"","Sulfur",15,null,"Pound",0.4,null,6,0,0,null,0,0,6,0,1200,0]
[null,"Custom"]
[null,"","Custom Combine",1,null,"Acre",35,null,35,0,0,null,0,0,35,0,7000,0]
[null,"","Custom Hauling Canola",15,null,"CWT",0.5,null,7.5,0,0,null,0,0,7.5,0,1500,0]
[null,"Herbicide"]
[null,"","Trifluralin",1.5,null,"Pint",4.5,null,6.75,0,0,null,0,0,6.75,0,1350,0]
[null,"","Glyphosate",2,null,"Pint",4,null,8,0,0,null,0,0,8,0,1600,0]
[null,"Insecticide"]
[null,"","Insecticide Aphids",1,null,"Acre",4,null,4,0,0,null,0,0,4,0,800,0]
[null,null,null,0,null,null,0,null,0,0,0,null,0,0,0,0,0,0]
[null,null,null,0,null,null,0,null,0,0,0,null,0,0,0,0,0,0]
[null,null,null,0,null,null,0,null,0,{"$f":"E34*H34","v":0},0,null,0,{"$f":"J34*L34","v":0},0,{"$f":"+J34-N34","v":0},0,{"$f":"+J34*E$7","v":0}]
[null,"Machinery Labor"]
[null,null,"Tractors/Self-Propelled",0.63,null,"Hour",12,null,7.5600000000000005,{"$f":"E36*H36","v":0},0,null,0,{"$f":"J36*L36","v":0},7.5600000000000005,{"$f":"+J36-N36","v":0},1512,{"$f":"+J36*E$7","v":0}]
[null,null,"Other Labor",0,null,"Hour",12,null,0,{"$f":"E37*H37","v":0},0,null,0,{"$f":"J37*L37","v":0},0,{"$f":"+J37-N37","v":0},0,{"$f":"+J37*E$7","v":0}]
[]
[null,"Diesel Fuel"]
[null,null,"Pickup/General Use Equipment",1,null,"Acre",0,null,0,{"$f":"E40*H40","v":0},0,null,0,{"$f":"J40*L40","v":0},0,{"$f":"+J40-N40","v":0},0,{"$f":"+J40*E$7","v":0}]
[null,null,"Tractors/Self-Propelled",3.71,null,"Gallon",3.6,null,13.356,{"$f":"E41*H41","v":0},0,null,0,{"$f":"J41*L41","v":0},13.356,{"$f":"+J41-N41","v":0},2671.2,{"$f":"+J41*E$7","v":0}]
[]
[null,"Gasoline"]
[null,null,"Pickup/General Use Equipment",1,null,"Acre",0,null,0,{"$f":"E44*H44","v":0},0,null,0,{"$f":"J44*L44","v":0},0,{"$f":"+J44-N44","v":0},0,{"$f":"+J44*E$7","v":0}]
[null,null,"Tractors/Self-Propelled",0,null,"Gallon",3.15,null,0,{"$f":"E45*H45","v":0},0,null,0,{"$f":"J45*L45","v":0},0,{"$f":"+J45-N45","v":0},0,{"$f":"+J45*E$7","v":0}]
[]
[null,"Repairs & Maintenance"]
[null,null,"Pickup/General Use Equipment",1,null,"Acre",0,null,0,{"$f":"E48*H48","v":0},0,null,0,{"$f":"J48*L48","v":0},0,{"$f":"+J48-N48","v":0},0,{"$f":"+J48*E$7","v":0}]
[null,null,"Irrigation Equipment",1,null,"Acre",0,null,0,0,0,null,0,0,0,0,0,0]
[null,null,"Tractors/Self-Propelled",1,null,"Acre",7.3755778605057323,null,7.3755778605057323,0,0,null,0,0,7.3755778605057323,0,1475.1155721011464,0]
[null,null,"Implements",1,null,"Acre",6.2589468378162678,null,6.2589468378162678,0,0,null,0,0,6.2589468378162678,0,1251.7893675632536,0]
[null,null,null,null,null,null,null,null,0,0,0,null,0,0,0,0,0,0]
[null,null,null,null,null,null,null,null,0,0,0,null,0,0,0,0,0,0]
[null,"Interest on Credit Line",null,null,null,null,0.08,null,8.5287160210351143,{"$f":"+SUM(J17:J53)/2*H54","v":0},null,null,0,{"$f":"+SUM(N17:N53)/2*L54","v":0},8.5287160210351143,{"$f":"+SUM(P17:P53)/2*L54","v":0},1705.7432042070229,{"$f":"+J54*E$7","v":0}]
["Total Variable Costs",null,null,null,null,null,null,null,252.73677634622391,{"$f":"SUM(J18:J54)","v":0},null,null,0,{"$f":"SUM(N18:N54)","v":0},252.73677634622391,{"$f":"SUM(P18:P54)","v":0},50547.355269244777,{"$f":"SUM(R18:R54)","v":0}]
["Planned Returns Above Variable Costs:",null,null,null,null,null,null,null,-18.736776346223905,{"$f":"+J13-J55","v":0},null,null,0,{"$f":"+N13-N55","v":0},-18.736776346223905,{"$f":"+P13-P55","v":0},-3747.3552692447774,{"$f":"+R13-R55","v":0}]
[null,"Breakeven Price to Cover Variable Costs",null,null,null,null,19.44129048817107,{"$f":"IF(E10=0,\"n/a\",(YVarExp-(YTotExp+YTotRet-J10))/E10)","v":"n/a"},"CWT"]
[null,null,null,null,null,null,null,null,null,null,null,null,null,null,null,null,"Enterprise","Enterprise"]
["FIXED COSTS",null,null,"Quantity","Quantity","Units","$/Unit","$/Unit","Total","Total","Share","Share","Landlord","Landlord","Tenant","Tenant","Total","Total"]
[null,"Machinery Depreciation"]
[null,null,"Tractors/Self-Propelled",1,null,"Acre",7.6214304558559229,null,7.6214304558559229,{"$f":"E61*H61","v":0},0,null,0,{"$f":"J61*L61","v":0},7.6214304558559229,{"$f":"+J61-N61","v":0},1524.2860911711846,{"$f":"+J61*E$7","v":0}]
[null,null,"Implements",1,null,"Acre",7.4496538675539705,null,7.4496538675539705,0,0,null,0,{"$f":"J62*L62","v":0},7.4496538675539705,0,1489.9307735107941,0]
[null,"Equipment Investment"]
[null,null,"Tractors/Self-Propelled",59.373401777071138,null,"Dollars",0.08,null,4.7498721421656915,{"$f":"E64*H64","v":0},0,null,0,{"$f":"J64*L64","v":0},4.7498721421656915,{"$f":"+J64-N64","v":0},949.97442843313831,{"$f":"+J64*E$7","v":0}]
[null,null,"Implements",32.234691544536439,null,"Dollars",0.08,null,2.5787753235629149,0,0,null,0,{"$f":"J65*L65","v":0},2.5787753235629149,0,515.75506471258302,0]
[null,"Salaried Labor",null,1,null,"Acre",0,null,0,0,0,null,0,{"$f":"J66*L66","v":0},0,{"$f":"+J66-N66","v":0},0,{"$f":"+J66*E$7","v":0}]
[null,"Management Fee, Owner/Operator Labor",null,1,null,"Acre",0,null,0,0,0,null,0,0,0,0,0,0]
[null,"Allocated Establishment Cost",null,1,null,"Acre",0,null,0,0,0,null,0,0,0,0,0,0]
[null,"Dryland Crop Rent",null,1,null,"Acre",30,null,30,0,0,null,0,0,30,0,6000,0]
[null,"Property Taxes",null,1,null,"Acre",0,null,0,0,0,null,0,0,0,0,0,0]
[null,"Whole Farm Insurance",null,1,null,"Acre",0,null,0,0,0,null,0,0,0,0,0,0]
[null,null,null,1,null,null,0,null,0,0,0,null,0,0,0,0,0,0]
[null,null,null,1,null,null,0,null,0,{"$f":"E73*H73","v":0},0,null,0,0,0,0,0,0]
["Total Fixed Costs",null,null,null,null,null,null,null,52.399731789138499,{"$f":"+SUM(J61:J73)","v":0},null,null,0,{"$f":"+SUM(N61:N73)","v":0},52.399731789138499,{"$f":"+SUM(P61:P73)","v":0},10479.946357827699,{"$f":"+SUM(R61:R73)","v":0}]
["Total Specified Costs",null,null,null,null,null,null,null,305.13650813536242,{"$f":"+J55+J74","v":0},null,null,0,{"$f":"+N55+N74","v":0},305.13650813536242,{"$f":"+P55+P74","v":0},61027.301627072477,{"$f":"+R55+R74","v":0}]
[]
["Returns Above Specified Costs",null,null,null,null,null,null,null,-71.136508135362419,{"$f":"+J13-J75","v":0},null,null,0,{"$f":"+N13-N75","v":0},-71.136508135362419,{"$f":"+P13-P75","v":0},-14227.301627072477,{"$f":"+R13-R75","v":0}]
[]
["    Breakeven Price to Cover Total Costs",null,null,null,null,null,23.47203908733557,{"$f":"IF(E10=0,\"n/a\",(YTotExp-(YTotExp+YTotRet-J10))/E10)","v":"n/a"},"CWT"]
[]
[null,null,null,"Example Breakeven Prices"]
[null,"Example","Example","To Cover",null,null,"To Cover"]
[null,"Yield","Yield","Variable",null,null,"Total"]
[null,"Percent","CWT","Costs",null,null,"Costs"]
[null,0.75,9.75,25.921720650894759,null,null,31.296052116447427]
[null,0.9,11.700000000000001,21.601433875745631,null,null,26.080043430372854]
[null,1,13,19.44129048817107,null,null,23.47203908733557]
[null,1.1000000000000001,14.3,17.673900443791879,null,null,21.338217352123245]
[null,1.25,16.25,15.553032390536856,null,null,18.777631269868458]
[]
[null,null,null,"Your Breakeven Prices"]
[null,"Your","Your",null,"To Cover",null,null,"To Cover"]
[null,"Yield","Yield",null,"Variable",null,null,"Total"]
[null,"Percent","CWT",null,"Costs",null,null,"Costs"]
[null,0.75,{"$f":"E10*YPER1","v":0},null,{"$f":"IF($E$10=0,0,(YVarExp-(YTotExp+YTotRet-J10))/($E$10*YPER1))","v":0},null,null,{"$f":"IF($E$10=0,0,(YTotExp-(YTotExp+YTotRet-J10))/($E$10*YPER1))","v":0}]
[null,0.9,{"$f":"E10*YPER2","v":0},null,{"$f":"IF($E$10=0,0,(YVarExp-(YTotExp+YTotRet-J10))/($E$10*YPER2))","v":0},null,null,{"$f":"IF($E$10=0,0,(YTotExp-(YTotExp+YTotRet-J10))/($E$10*YPER2))","v":0}]
[null,1,{"$f":"+E10","v":0},null,{"$f":"IF($E$10=0,0,(YVarExp-(YTotExp+YTotRet-J10))/($E$10*YPER3))","v":0},null,null,{"$f":"IF($E$10=0,0,(YTotExp-(YTotExp+YTotRet-J10))/($E$10*YPER3))","v":0}]
[null,1.1000000000000001,{"$f":"E10*YPER4","v":0},null,{"$f":"IF($E$10=0,0,(YVarExp-(YTotExp+YTotRet-J10))/($E$10*YPER4))","v":0},null,null,{"$f":"IF($E$10=0,0,(YTotExp-(YTotExp+YTotRet-J10))/($E$10*YPER4))","v":0}]
[null,1.25,{"$f":"E10*YPER5","v":0},null,{"$f":"IF($E$10=0,0,(YVarExp-(YTotExp+YTotRet-J10))/($E$10*YPER5))","v":0},null,null,{"$f":"IF($E$10=0,0,(YTotExp-(YTotExp+YTotRet-J10))/($E$10*YPER5))","v":0}]
[]
["  Developed by Jason Johnson, Associate Professor and Extension Economist, Texas A&M AgriLife Extension, 254-968-4144.  "]
[]
["Information presented is prepared solely as a general guide and not intended to recognize or predict the costs and returns from any one operation.  Brand names are mentioned only as examples and imply no endorsement."]

{"sheet":"Barley","index":12,"n_rows":103,"n_cols":18,"rows_kept":103,"cut":false,"hidden":false,"merged":[[80,3,80,8],[90,3,90,8],[102,0,102,11],[0,0,0,11],[1,0,1,11],[2,0,2,11],[3,0,3,11]]}
["Projections for Planning Purposes Only -- Not to be Used without Updating"]
["2024 Estimated Costs and Returns per Acre"]
["Malting Barley"]
["Enter your name for this budget in the cell above."]
["Enter  Your Values in the cells highlighed in MAROON."]
[null,null,null,null,"Your Acres",null,null,null,null,null,null,null,null,null,null,null,null,"Your"]
[null,null,"Crop Acres",200,null,null,null,null,null,null,null,"Your",null,null,null,null,"Enterprise","Enterprise"]
[null,null,null,null,"Your",null,null,"Your","Cash","Your","Landlord","Landlord",null,"Your",null,"Your","Total","Total"]
["REVENUE",null,null,"Quantity","Quantity","Units","$/Unit","$/Unit","Total","Total","Share","Share","Landlord","Landlord","Tenant","Tenant","(200 acres)",{"$f":"\"(\" & E7 & \" acres)\"","v":"( acres)"}]
[null,"Malting Barley",null,60,null,"Bushel",5,null,300,{"$f":"E10*H10","v":0},0,null,0,{"$f":"J10*L10","v":0},300,{"$f":"+J10-N10","v":0},60000,{"$f":"+J10*E$7","v":0}]
[null,null,null,0,null,null,0,null,0,0,0,null,0,0,0,{"$f":"+J11-N11","v":0},0,0]
[null,null,null,0,null,null,0,null,0,0,0,null,0,0,0,0,0,0]
["Total Revenue",null,null,null,null,null,null,null,300,{"$f":"SUM(J10:J12)","v":0},null,null,0,{"$f":"SUM(N10:N12)","v":0},300,{"$f":"SUM(P10:P12)","v":0},60000,{"$f":"SUM(R10:R12)","v":0}]
[null,null,null,null,null,null,null,null,null,null,null,null,null,null,null,null,"Enterprise","Enterprise"]
["VARIABLE COSTS",null,null,"Quantity","Quantity","Units","$/Unit","$/Unit","Total","Total","Share","Share","Landlord","Landlord","Tenant","Tenant","Total","Total"]
["Production Costs"]
[null,"Fertilizer"]
[null,"","46-0-0",106,null,"Pound",0.55000000000000004,null,58.300000000000004,{"$f":"E18*H18","v":0},0,null,0,{"$f":"J18*L18","v":0},58.300000000000004,{"$f":"+J18-N18","v":0},11660,{"$f":"+J18*E$7","v":0}]
[null,"","18-46-0 ",50,null,"Pound",0.6,null,30,0,0,null,0,0,30,0,6000,0]
[null,"Seed"]
[null,"","Barley Seed",50,null,"Pound",0.53,null,26.5,0,0,null,0,0,26.5,0,5300,0]
[null,"Herbicide"]
[null,"","Weed Burndown",32,null,"Ounce",0.2,null,6.4,0,0,null,0,0,6.4,0,1280,0]
[null,"","Peak",0.45,null,"Ounce",15,null,6.75,0,0,null,0,0,6.75,0,1350,0]
[null,"Miscellaneous"]
[null,"","Insurance - Barley 65% ",1,null,"Acre",7,null,7,0,0,null,0,0,7,0,1400,0]
[null,"Insecticide"]
[null,"","Insecticide Greenbug",1,null,"Acre",7.5,null,7.5,0,0,null,0,0,7.5,0,1500,0]
[null,"Custom"]
[null,"","Custom Combine",1,null,"Acre",35,null,35,0,0,null,0,0,35,0,7000,0]
[null,"","Custom Hauling Barley",60,null,"Bushel",0.24,null,14.399999999999999,0,0,null,0,0,14.399999999999999,0,2879.9999999999995,0]
[null,null,null,0,null,null,0,null,0,0,0,null,0,0,0,0,0,0]
[null,null,null,0,null,null,0,null,0,0,0,null,0,0,0,0,0,0]
[null,null,null,0,null,null,0,null,0,{"$f":"E34*H34","v":0},0,null,0,{"$f":"J34*L34","v":0},0,{"$f":"+J34-N34","v":0},0,{"$f":"+J34*E$7","v":0}]
[null,"Machinery Labor"]
[null,null,"Tractors/Self-Propelled",0.63,null,"Hour",12,null,7.5600000000000005,{"$f":"E36*H36","v":0},0,null,0,{"$f":"J36*L36","v":0},7.5600000000000005,{"$f":"+J36-N36","v":0},1512,{"$f":"+J36*E$7","v":0}]
[null,null,"Other Labor",0,null,"Hour",12,null,0,{"$f":"E37*H37","v":0},0,null,0,{"$f":"J37*L37","v":0},0,{"$f":"+J37-N37","v":0},0,{"$f":"+J37*E$7","v":0}]
[]
[null,"Diesel Fuel"]
[null,null,"Pickup/General Use Equipment",1,null,"Acre",0,null,0,{"$f":"E40*H40","v":0},0,null,0,{"$f":"J40*L40","v":0},0,{"$f":"+J40-N40","v":0},0,{"$f":"+J40*E$7","v":0}]
[null,null,"Tractors/Self-Propelled",3.71,null,"Gallon",3.6,null,13.356,{"$f":"E41*H41","v":0},0,null,0,{"$f":"J41*L41","v":0},13.356,{"$f":"+J41-N41","v":0},2671.2,{"$f":"+J41*E$7","v":0}]
[]
[null,"Gasoline"]
[null,null,"Pickup/General Use Equipment",1,null,"Acre",0,null,0,{"$f":"E44*H44","v":0},0,null,0,{"$f":"J44*L44","v":0},0,{"$f":"+J44-N44","v":0},0,{"$f":"+J44*E$7","v":0}]
[null,null,"Tractors/Self-Propelled",0,null,"Gallon",3.15,null,0,{"$f":"E45*H45","v":0},0,null,0,{"$f":"J45*L45","v":0},0,{"$f":"+J45-N45","v":0},0,{"$f":"+J45*E$7","v":0}]
[]
[null,"Repairs & Maintenance"]
[null,null,"Pickup/General Use Equipment",1,null,"Acre",0,null,0,{"$f":"E48*H48","v":0},0,null,0,{"$f":"J48*L48","v":0},0,{"$f":"+J48-N48","v":0},0,{"$f":"+J48*E$7","v":0}]
[null,null,"Irrigation Equipment",1,null,"Acre",0,null,0,0,0,null,0,0,0,0,0,0]
[null,null,"Tractors/Self-Propelled",1,null,"Acre",7.3755778605057323,null,7.3755778605057323,0,0,null,0,0,7.3755778605057323,0,1475.1155721011464,0]
[null,null,"Implements",1,null,"Acre",6.2589468378162678,null,6.2589468378162678,0,0,null,0,0,6.2589468378162678,0,1251.7893675632536,0]
[null,null,null,null,null,null,null,null,0,0,0,null,0,0,0,0,0,0]
[null,null,null,null,null,null,null,null,0,0,0,null,0,0,0,0,0,0]
[null,"Interest on Credit Line",null,null,null,null,0.08,null,7.2558491482465914,{"$f":"+SUM(J17:J53)/2*H54","v":0},null,null,0,{"$f":"+SUM(N17:N53)/2*L54","v":0},7.2558491482465914,{"$f":"+SUM(P17:P53)/2*L54","v":0},1451.1698296493182,{"$f":"+J54*E$7","v":0}]
["Total Variable Costs",null,null,null,null,null,null,null,233.65637384656861,{"$f":"SUM(J18:J54)","v":0},null,null,0,{"$f":"SUM(N18:N54)","v":0},233.65637384656861,{"$f":"SUM(P18:P54)","v":0},46731.274769313713,{"$f":"SUM(R18:R54)","v":0}]
["Planned Returns Above Variable Costs:",null,null,null,null,null,null,null,66.343626153431387,{"$f":"+J13-J55","v":0},null,null,0,{"$f":"+N13-N55","v":0},66.343626153431387,{"$f":"+P13-P55","v":0},13268.725230686287,{"$f":"+R13-R55","v":0}]
[null,"Breakeven Price to Cover Variable Costs",null,null,null,null,3.8942728974428102,{"$f":"IF(E10=0,\"n/a\",(YVarExp-(YTotExp+YTotRet-J10))/E10)","v":"n/a"},"Bushel"]
[null,null,null,null,null,null,null,null,null,null,null,null,null,null,null,null,"Enterprise","Enterprise"]
["FIXED COSTS",null,null,"Quantity","Quantity","Units","$/Unit","$/Unit","Total","Total","Share","Share","Landlord","Landlord","Tenant","Tenant","Total","Total"]
[null,"Machinery Depreciation"]
[null,null,"Tractors/Self-Propelled",1,null,"Acre",7.6214304558559229,null,7.6214304558559229,{"$f":"E61*H61","v":0},0,null,0,{"$f":"J61*L61","v":0},7.6214304558559229,{"$f":"+J61-N61","v":0},1524.2860911711846,{"$f":"+J61*E$7","v":0}]
[null,null,"Implements",1,null,"Acre",7.4496538675539705,null,7.4496538675539705,0,0,null,0,{"$f":"J62*L62","v":0},7.4496538675539705,0,1489.9307735107941,0]
[null,"Equipment Investment"]
[null,null,"Tractors/Self-Propelled",59.373401777071138,null,"Dollars",0.08,null,4.7498721421656915,{"$f":"E64*H64","v":0},0,null,0,{"$f":"J64*L64","v":0},4.7498721421656915,{"$f":"+J64-N64","v":0},949.97442843313831,{"$f":"+J64*E$7","v":0}]
[null,null,"Implements",32.234691544536439,null,"Dollars",0.08,null,2.5787753235629149,0,0,null,0,{"$f":"J65*L65","v":0},2.5787753235629149,0,515.75506471258302,0]
[null,"Salaried Labor",null,1,null,"Acre",0,null,0,0,0,null,0,{"$f":"J66*L66","v":0},0,{"$f":"+J66-N66","v":0},0,{"$f":"+J66*E$7","v":0}]
[null,"Management Fee, Owner/Operator Labor",null,1,null,"Acre",0,null,0,0,0,null,0,0,0,0,0,0]
[null,"Allocated Establishment Cost",null,1,null,"Acre",0,null,0,0,0,null,0,0,0,0,0,0]
[null,"Dryland Crop Rent",null,1,null,"Acre",30,null,30,0,0,null,0,0,30,0,6000,0]
[null,"Property Taxes",null,1,null,"Acre",0,null,0,0,0,null,0,0,0,0,0,0]
[null,"Whole Farm Insurance",null,1,null,"Acre",0,null,0,0,0,null,0,0,0,0,0,0]
[null,null,null,1,null,null,0,null,0,0,0,null,0,0,0,0,0,0]
[null,null,null,1,null,null,0,null,0,{"$f":"E73*H73","v":0},0,null,0,0,0,0,0,0]
["Total Fixed Costs",null,null,null,null,null,null,null,52.399731789138499,{"$f":"+SUM(J61:J73)","v":0},null,null,0,{"$f":"+SUM(N61:N73)","v":0},52.399731789138499,{"$f":"+SUM(P61:P73)","v":0},10479.946357827699,{"$f":"+SUM(R61:R73)","v":0}]
["Total Specified Costs",null,null,null,null,null,null,null,286.05610563570713,{"$f":"+J55+J74","v":0},null,null,0,{"$f":"+N55+N74","v":0},286.05610563570713,{"$f":"+P55+P74","v":0},57211.221127141413,{"$f":"+R55+R74","v":0}]
[]
["Returns Above Specified Costs",null,null,null,null,null,null,null,13.943894364292873,{"$f":"+J13-J75","v":0},null,null,0,{"$f":"+N13-N75","v":0},13.943894364292873,{"$f":"+P13-P75","v":0},2788.7788728585874,{"$f":"+R13-R75","v":0}]
[]
["    Breakeven Price to Cover Total Costs",null,null,null,null,null,4.7676017605951184,{"$f":"IF(E10=0,\"n/a\",(YTotExp-(YTotExp+YTotRet-J10))/E10)","v":"n/a"},"Bushel"]
[]
[null,null,null,"Example Breakeven Prices"]
[null,"Example","Example","To Cover",null,null,"To Cover"]
[null,"Yield","Yield","Variable",null,null,"Total"]
[null,"Percent","Bushel","Costs",null,null,"Costs"]
[null,0.75,45,5.1923638632570803,null,null,6.3568023474601585]
[null,0.9,54,4.3269698860475669,null,null,5.2973352895501318]
[null,1,60,3.8942728974428102,null,null,4.7676017605951184]
[null,1.1000000000000001,66,3.5402480885843728,null,null,4.3341834187228354]
[null,1.25,75,3.1154183179542483,null,null,3.814081408476095]
[]
[null,null,null,"Your Breakeven Prices"]
[null,"Your","Your",null,"To Cover",null,null,"To Cover"]
[null,"Yield","Yield",null,"Variable",null,null,"Total"]
[null,"Percent","Bushel",null,"Costs",null,null,"Costs"]
[null,0.75,{"$f":"E10*YPER1","v":0},null,{"$f":"IF($E$10=0,0,(YVarExp-(YTotExp+YTotRet-J10))/($E$10*YPER1))","v":0},null,null,{"$f":"IF($E$10=0,0,(YTotExp-(YTotExp+YTotRet-J10))/($E$10*YPER1))","v":0}]
[null,0.9,{"$f":"E10*YPER2","v":0},null,{"$f":"IF($E$10=0,0,(YVarExp-(YTotExp+YTotRet-J10))/($E$10*YPER2))","v":0},null,null,{"$f":"IF($E$10=0,0,(YTotExp-(YTotExp+YTotRet-J10))/($E$10*YPER2))","v":0}]
[null,1,{"$f":"+E10","v":0},null,{"$f":"IF($E$10=0,0,(YVarExp-(YTotExp+YTotRet-J10))/($E$10*YPER3))","v":0},null,null,{"$f":"IF($E$10=0,0,(YTotExp-(YTotExp+YTotRet-J10))/($E$10*YPER3))","v":0}]
[null,1.1000000000000001,{"$f":"E10*YPER4","v":0},null,{"$f":"IF($E$10=0,0,(YVarExp-(YTotExp+YTotRet-J10))/($E$10*YPER4))","v":0},null,null,{"$f":"IF($E$10=0,0,(YTotExp-(YTotExp+YTotRet-J10))/($E$10*YPER4))","v":0}]
[null,1.25,{"$f":"E10*YPER5","v":0},null,{"$f":"IF($E$10=0,0,(YVarExp-(YTotExp+YTotRet-J10))/($E$10*YPER5))","v":0},null,null,{"$f":"IF($E$10=0,0,(YTotExp-(YTotExp+YTotRet-J10))/($E$10*YPER5))","v":0}]
[]
["  Developed by Jason Johnson, Associate Professor and Extension Economist, Texas A&M AgriLife Extension, 254-968-4144.  "]
[]
["Information presented is prepared solely as a general guide and not intended to recognize or predict the costs and returns from any one operation.  Brand names are mentioned only as examples and imply no endorsement."]

{"sheet":"OatsGrain","index":13,"n_rows":105,"n_cols":18,"rows_kept":105,"cut":false,"hidden":false,"merged":[[82,3,82,8],[92,3,92,8],[104,0,104,11],[0,0,0,11],[1,0,1,11],[2,0,2,11],[3,0,3,11]]}
["Projections for Planning Purposes Only -- Not to be Used without Updating"]
["2024 Estimated Costs and Returns per Acre"]
["Oats for Grain"]
["Enter your name for this budget in the cell above."]
["Enter  Your Values in the cells highlighed in MAROON."]
[null,null,null,null,"Your Acres",null,null,null,null,null,null,null,null,null,null,null,null,"Your"]
[null,null,"Crop Acres",200,null,null,null,null,null,null,null,"Your",null,null,null,null,"Enterprise","Enterprise"]
[null,null,null,null,"Your",null,null,"Your","Cash","Your","Landlord","Landlord",null,"Your",null,"Your","Total","Total"]
["REVENUE",null,null,"Quantity","Quantity","Units","$/Unit","$/Unit","Total","Total","Share","Share","Landlord","Landlord","Tenant","Tenant","(200 acres)",{"$f":"\"(\" & E7 & \" acres)\"","v":"( acres)"}]
[null,"Oats",null,100,null,"Bushel",3.75,null,375,{"$f":"E10*H10","v":0},0,null,0,{"$f":"J10*L10","v":0},375,{"$f":"+J10-N10","v":0},75000,{"$f":"+J10*E$7","v":0}]
[null,null,null,0,null,null,0,null,0,0,0,null,0,0,0,{"$f":"+J11-N11","v":0},0,0]
[null,null,null,0,null,null,0,null,0,0,0,null,0,0,0,0,0,0]
["Total Revenue",null,null,null,null,null,null,null,375,{"$f":"SUM(J10:J12)","v":0},null,null,0,{"$f":"SUM(N10:N12)","v":0},375,{"$f":"SUM(P10:P12)","v":0},75000,{"$f":"SUM(R10:R12)","v":0}]
[null,null,null,null,null,null,null,null,null,null,null,null,null,null,null,null,"Enterprise","Enterprise"]
["VARIABLE COSTS",null,null,"Quantity","Quantity","Units","$/Unit","$/Unit","Total","Total","Share","Share","Landlord","Landlord","Tenant","Tenant","Total","Total"]
["Production Costs"]
[null,"Seed"]
[null,"","Oat Seed",100,null,"Pound",0.52,null,52,{"$f":"E18*H18","v":0},0,null,0,{"$f":"J18*L18","v":0},52,{"$f":"+J18-N18","v":0},10400,{"$f":"+J18*E$7","v":0}]
[null,"Fertilizer"]
[null,"","18-46-0 ",50,null,"Pound",0.6,null,30,0,0,null,0,0,30,0,6000,0]
[null,"","46-0-0",140,null,"Pound",0.55000000000000004,null,77,0,0,null,0,0,77,0,15400,0]
[null,"Custom"]
[null,"","Custom Combine",1,null,"Acre",35,null,35,0,0,null,0,0,35,0,7000,0]
[null,"","Custom Hauling Oats",100,null,"Bushel",0.16,null,16,0,0,null,0,0,16,0,3200,0]
[null,"Miscellaneous"]
[null,"","Insurance - Oats 65% ",1,null,"Acre",12,null,12,0,0,null,0,0,12,0,2400,0]
[null,"","Insurance - Oats SCO ",1,null,"Acre",2,null,2,0,0,null,0,0,2,0,400,0]
[null,"Herbicide"]
[null,"","Weed Burndown",32,null,"Ounce",0.2,null,6.4,0,0,null,0,0,6.4,0,1280,0]
[null,"Insecticide"]
[null,"","Insecticide Greenbug",1,null,"Acre",7.5,null,7.5,0,0,null,0,0,7.5,0,1500,0]
[null,"Fungicides"]
[null,"","Tebuconazole",4,null,"Ounce",1,null,4,0,0,null,0,0,4,0,800,0]
[null,null,null,0,null,null,0,null,0,0,0,null,0,0,0,0,0,0]
[null,null,null,0,null,null,0,null,0,0,0,null,0,0,0,0,0,0]
[null,null,null,0,null,null,0,null,0,{"$f":"E36*H36","v":0},0,null,0,{"$f":"J36*L36","v":0},0,{"$f":"+J36-N36","v":0},0,{"$f":"+J36*E$7","v":0}]
[null,"Machinery Labor"]
[null,null,"Tractors/Self-Propelled",0.56000000000000005,null,"Hour",12,null,6.7200000000000006,{"$f":"E38*H38","v":0},0,null,0,{"$f":"J38*L38","v":0},6.7200000000000006,{"$f":"+J38-N38","v":0},1344.0000000000002,{"$f":"+J38*E$7","v":0}]
[null,null,"Other Labor",0,null,"Hour",12,null,0,{"$f":"E39*H39","v":0},0,null,0,{"$f":"J39*L39","v":0},0,{"$f":"+J39-N39","v":0},0,{"$f":"+J39*E$7","v":0}]
[]
[null,"Diesel Fuel"]
[null,null,"Pickup/General Use Equipment",1,null,"Acre",0,null,0,{"$f":"E42*H42","v":0},0,null,0,{"$f":"J42*L42","v":0},0,{"$f":"+J42-N42","v":0},0,{"$f":"+J42*E$7","v":0}]
[null,null,"Tractors/Self-Propelled",3.38,null,"Gallon",3.6,null,12.167999999999999,{"$f":"E43*H43","v":0},0,null,0,{"$f":"J43*L43","v":0},12.167999999999999,{"$f":"+J43-N43","v":0},2433.6,{"$f":"+J43*E$7","v":0}]
[]
[null,"Gasoline"]
[null,null,"Pickup/General Use Equipment",1,null,"Acre",0,null,0,{"$f":"E46*H46","v":0},0,null,0,{"$f":"J46*L46","v":0},0,{"$f":"+J46-N46","v":0},0,{"$f":"+J46*E$7","v":0}]
[null,null,"Tractors/Self-Propelled",0,null,"Gallon",3.15,null,0,{"$f":"E47*H47","v":0},0,null,0,{"$f":"J47*L47","v":0},0,{"$f":"+J47-N47","v":0},0,{"$f":"+J47*E$7","v":0}]
[]
[null,"Repairs & Maintenance"]
[null,null,"Pickup/General Use Equipment",1,null,"Acre",0,null,0,{"$f":"E50*H50","v":0},0,null,0,{"$f":"J50*L50","v":0},0,{"$f":"+J50-N50","v":0},0,{"$f":"+J50*E$7","v":0}]
[null,null,"Irrigation Equipment",1,null,"Acre",0,null,0,0,0,null,0,0,0,0,0,0]
[null,null,"Tractors/Self-Propelled",1,null,"Acre",6.86006472849893,null,6.86006472849893,0,0,null,0,0,6.86006472849893,0,1372.0129456997861,0]
[null,null,"Implements",1,null,"Acre",7.1807360155954321,null,7.1807360155954321,0,0,null,0,0,7.1807360155954321,0,1436.1472031190865,0]
[null,null,null,null,null,null,null,null,0,0,0,null,0,0,0,0,0,0]
[null,null,null,null,null,null,null,null,0,0,0,null,0,0,0,0,0,0]
[null,"Interest on Credit Line",null,null,null,null,0.08,null,8.4791609843691056,{"$f":"+SUM(J17:J55)/2*H56","v":0},null,null,0,{"$f":"+SUM(N17:N55)/2*L56","v":0},8.4791609843691056,{"$f":"+SUM(P17:P55)/2*L56","v":0},1695.8321968738212,{"$f":"+J56*E$7","v":0}]
["Total Variable Costs",null,null,null,null,null,null,null,283.30796172846345,{"$f":"SUM(J18:J56)","v":0},null,null,0,{"$f":"SUM(N18:N56)","v":0},283.30796172846345,{"$f":"SUM(P18:P56)","v":0},56661.592345692698,{"$f":"SUM(R18:R56)","v":0}]
["Planned Returns Above Variable Costs:",null,null,null,null,null,null,null,91.692038271536546,{"$f":"+J13-J57","v":0},null,null,0,{"$f":"+N13-N57","v":0},91.692038271536546,{"$f":"+P13-P57","v":0},18338.407654307302,{"$f":"+R13-R57","v":0}]
[null,"Breakeven Price to Cover Variable Costs",null,null,null,null,2.8330796172846346,{"$f":"IF(E10=0,\"n/a\",(YVarExp-(YTotExp+YTotRet-J10))/E10)","v":"n/a"},"Bushel"]
[null,null,null,null,null,null,null,null,null,null,null,null,null,null,null,null,"Enterprise","Enterprise"]
["FIXED COSTS",null,null,"Quantity","Quantity","Units","$/Unit","$/Unit","Total","Total","Share","Share","Landlord","Landlord","Tenant","Tenant","Total","Total"]
[null,"Machinery Depreciation"]
[null,null,"Tractors/Self-Propelled",1,null,"Acre",7.0887335527822275,null,7.0887335527822275,{"$f":"E63*H63","v":0},0,null,0,{"$f":"J63*L63","v":0},7.0887335527822275,{"$f":"+J63-N63","v":0},1417.7467105564456,{"$f":"+J63*E$7","v":0}]
[null,null,"Implements",1,null,"Acre",8.3687561450775156,null,8.3687561450775156,0,0,null,0,{"$f":"J64*L64","v":0},8.3687561450775156,0,1673.7512290155032,0]
[null,"Equipment Investment"]
[null,null,"Tractors/Self-Propelled",55.223521064416381,null,"Dollars",0.08,null,4.4178816851533105,{"$f":"E66*H66","v":0},0,null,0,{"$f":"J66*L66","v":0},4.4178816851533105,{"$f":"+J66-N66","v":0},883.5763370306621,{"$f":"+J66*E$7","v":0}]
[null,null,"Implements",35.983042953942707,null,"Dollars",0.08,null,2.8786434363154165,0,0,null,0,{"$f":"J67*L67","v":0},2.8786434363154165,0,575.72868726308332,0]
[null,"Salaried Labor",null,1,null,"Acre",0,null,0,0,0,null,0,{"$f":"J68*L68","v":0},0,{"$f":"+J68-N68","v":0},0,{"$f":"+J68*E$7","v":0}]
[null,"Management Fee, Owner/Operator Labor",null,1,null,"Acre",0,null,0,0,0,null,0,0,0,0,0,0]
[null,"Allocated Establishment Cost",null,1,null,"Acre",0,null,0,0,0,null,0,0,0,0,0,0]
[null,"Dryland Crop Rent",null,1,null,"Acre",30,null,30,0,0,null,0,0,30,0,6000,0]
[null,"Property Taxes",null,1,null,"Acre",0,null,0,0,0,null,0,0,0,0,0,0]
[null,"Whole Farm Insurance",null,1,null,"Acre",0,null,0,0,0,null,0,0,0,0,0,0]
[null,null,null,1,null,null,0,null,0,0,0,null,0,0,0,0,0,0]
[null,null,null,1,null,null,0,null,0,{"$f":"E75*H75","v":0},0,null,0,0,0,0,0,0]
["Total Fixed Costs",null,null,null,null,null,null,null,52.754014819328475,{"$f":"+SUM(J63:J75)","v":0},null,null,0,{"$f":"+SUM(N63:N75)","v":0},52.754014819328475,{"$f":"+SUM(P63:P75)","v":0},10550.802963865695,{"$f":"+SUM(R63:R75)","v":0}]
["Total Specified Costs",null,null,null,null,null,null,null,336.06197654779191,{"$f":"+J57+J76","v":0},null,null,0,{"$f":"+N57+N76","v":0},336.06197654779191,{"$f":"+P57+P76","v":0},67212.3953095584,{"$f":"+R57+R76","v":0}]
[]
["Returns Above Specified Costs",null,null,null,null,null,null,null,38.938023452208085,{"$f":"+J13-J77","v":0},null,null,0,{"$f":"+N13-N77","v":0},38.938023452208085,{"$f":"+P13-P77","v":0},7787.6046904415998,{"$f":"+R13-R77","v":0}]
[]
["    Breakeven Price to Cover Total Costs",null,null,null,null,null,3.3606197654779191,{"$f":"IF(E10=0,\"n/a\",(YTotExp-(YTotExp+YTotRet-J10))/E10)","v":"n/a"},"Bushel"]
[]
[null,null,null,"Example Breakeven Prices"]
[null,"Example","Example","To Cover",null,null,"To Cover"]
[null,"Yield","Yield","Variable",null,null,"Total"]
[null,"Percent","Bushel","Costs",null,null,"Costs"]
[null,0.75,75,3.777439489712846,null,null,4.4808263539705591]
[null,0.9,90,3.1478662414273719,null,null,3.7340219616421324]
[null,1,100,2.8330796172846346,null,null,3.3606197654779191]
[null,1.1000000000000001,110.00000000000001,2.5755269248042127,null,null,3.0551088777071986]
[null,1.25,125,2.2664636938277076,null,null,2.6884958123823353]
[]
[null,null,null,"Your Breakeven Prices"]
[null,"Your","Your",null,"To Cover",null,null,"To Cover"]
[null,"Yield","Yield",null,"Variable",null,null,"Total"]
[null,"Percent","Bushel",null,"Costs",null,null,"Costs"]
[null,0.75,{"$f":"E10*YPER1","v":0},null,{"$f":"IF($E$10=0,0,(YVarExp-(YTotExp+YTotRet-J10))/($E$10*YPER1))","v":0},null,null,{"$f":"IF($E$10=0,0,(YTotExp-(YTotExp+YTotRet-J10))/($E$10*YPER1))","v":0}]
[null,0.9,{"$f":"E10*YPER2","v":0},null,{"$f":"IF($E$10=0,0,(YVarExp-(YTotExp+YTotRet-J10))/($E$10*YPER2))","v":0},null,null,{"$f":"IF($E$10=0,0,(YTotExp-(YTotExp+YTotRet-J10))/($E$10*YPER2))","v":0}]
[null,1,{"$f":"+E10","v":0},null,{"$f":"IF($E$10=0,0,(YVarExp-(YTotExp+YTotRet-J10))/($E$10*YPER3))","v":0},null,null,{"$f":"IF($E$10=0,0,(YTotExp-(YTotExp+YTotRet-J10))/($E$10*YPER3))","v":0}]
[null,1.1000000000000001,{"$f":"E10*YPER4","v":0},null,{"$f":"IF($E$10=0,0,(YVarExp-(YTotExp+YTotRet-J10))/($E$10*YPER4))","v":0},null,null,{"$f":"IF($E$10=0,0,(YTotExp-(YTotExp+YTotRet-J10))/($E$10*YPER4))","v":0}]
[null,1.25,{"$f":"E10*YPER5","v":0},null,{"$f":"IF($E$10=0,0,(YVarExp-(YTotExp+YTotRet-J10))/($E$10*YPER5))","v":0},null,null,{"$f":"IF($E$10=0,0,(YTotExp-(YTotExp+YTotRet-J10))/($E$10*YPER5))","v":0}]
[]
["  Developed by Jason Johnson, Associate Professor and Extension Economist, Texas A&M AgriLife Extension, 254-968-4144.  "]
[]
["Information presented is prepared solely as a general guide and not intended to recognize or predict the costs and returns from any one operation.  Brand names are mentioned only as examples and imply no endorsement."]

{"sheet":"SmallGrainGrazing","index":14,"n_rows":93,"n_cols":18,"rows_kept":93,"cut":false,"hidden":false,"merged":[[80,3,80,8],[70,3,70,8],[92,0,92,11],[0,0,0,11],[1,0,1,11],[2,0,2,11],[3,0,3,11]]}
["Projections for Planning Purposes Only -- Not to be Used without Updating"]
["2024 Estimated Costs and Returns per Acre"]
["Small Grain with Grazing"]
["Enter your name for this budget in the cell above."]
["Enter  Your Values in the cells highlighed in MAROON."]
[null,null,null,null,"Your Acres",null,null,null,null,null,null,null,null,null,null,null,null,"Your"]
[null,null,"Crop Acres",800,null,null,null,null,null,null,null,"Your",null,null,null,null,"Enterprise","Enterprise"]
[null,null,null,null,"Your",null,null,"Your","Cash","Your","Landlord","Landlord",null,"Your",null,"Your","Total","Total"]
["REVENUE",null,null,"Quantity","Quantity","Units","$/Unit","$/Unit","Total","Total","Share","Share","Landlord","Landlord","Tenant","Tenant","(800 acres)",{"$f":"\"(\" & E7 & \" acres)\"","v":"( acres)"}]
[null,"Stocker Weight Gain",null,315,null,"Pound",0.75,null,236.25,{"$f":"E10*H10","v":0},0,null,0,{"$f":"J10*L10","v":0},236.25,{"$f":"+J10-N10","v":0},189000,{"$f":"+J10*E$7","v":0}]
[null,null,null,0,null,null,0,null,0,0,0,null,0,0,0,{"$f":"+J11-N11","v":0},0,0]
[null,null,null,0,null,null,0,null,0,0,0,null,0,0,0,0,0,0]
["Total Revenue",null,null,null,null,null,null,null,236.25,{"$f":"SUM(J10:J12)","v":0},null,null,0,{"$f":"SUM(N10:N12)","v":0},236.25,{"$f":"SUM(P10:P12)","v":0},189000,{"$f":"SUM(R10:R12)","v":0}]
[null,null,null,null,null,null,null,null,null,null,null,null,null,null,null,null,"Enterprise","Enterprise"]
["VARIABLE COSTS",null,null,"Quantity","Quantity","Units","$/Unit","$/Unit","Total","Total","Share","Share","Landlord","Landlord","Tenant","Tenant","Total","Total"]
["Production Costs"]
[null,"Seed"]
[null,"","Oat Seed",110,null,"Pound",0.52,null,57.2,{"$f":"E18*H18","v":0},0,null,0,{"$f":"J18*L18","v":0},57.2,{"$f":"+J18-N18","v":0},45760,{"$f":"+J18*E$7","v":0}]
[null,"Fertilizer"]
[null,"","18-46-0 ",100,null,"Pound",0.6,null,60,0,0,null,0,0,60,0,48000,0]
[null,"","46-0-0",220,null,"Pound",0.55000000000000004,null,121.00000000000001,0,0,null,0,0,121.00000000000001,0,96800.000000000015,0]
[null,null,null,0,null,null,0,null,0,0,0,null,0,0,0,0,0,0]
[null,null,null,0,null,null,0,null,0,0,0,null,0,0,0,0,0,0]
[null,null,null,0,null,null,0,null,0,{"$f":"E24*H24","v":0},0,null,0,{"$f":"J24*L24","v":0},0,{"$f":"+J24-N24","v":0},0,{"$f":"+J24*E$7","v":0}]
[null,"Machinery Labor"]
[null,null,"Tractors/Self-Propelled",0.25,null,"Hour",12,null,3,{"$f":"E26*H26","v":0},0,null,0,{"$f":"J26*L26","v":0},3,{"$f":"+J26-N26","v":0},2400,{"$f":"+J26*E$7","v":0}]
[null,null,"Other Labor",0,null,"Hour",12,null,0,{"$f":"E27*H27","v":0},0,null,0,{"$f":"J27*L27","v":0},0,{"$f":"+J27-N27","v":0},0,{"$f":"+J27*E$7","v":0}]
[]
[null,"Diesel Fuel"]
[null,null,"Pickup/General Use Equipment",1,null,"Acre",0,null,0,{"$f":"E30*H30","v":0},0,null,0,{"$f":"J30*L30","v":0},0,{"$f":"+J30-N30","v":0},0,{"$f":"+J30*E$7","v":0}]
[null,null,"Tractors/Self-Propelled",1.1200000000000001,null,"Gallon",3.6,null,4.0320000000000009,{"$f":"E31*H31","v":0},0,null,0,{"$f":"J31*L31","v":0},4.0320000000000009,{"$f":"+J31-N31","v":0},3225.6000000000008,{"$f":"+J31*E$7","v":0}]
[]
[null,"Gasoline"]
[null,null,"Pickup/General Use Equipment",1,null,"Acre",0,null,0,{"$f":"E34*H34","v":0},0,null,0,{"$f":"J34*L34","v":0},0,{"$f":"+J34-N34","v":0},0,{"$f":"+J34*E$7","v":0}]
[null,null,"Tractors/Self-Propelled",0,null,"Gallon",3.15,null,0,{"$f":"E35*H35","v":0},0,null,0,{"$f":"J35*L35","v":0},0,{"$f":"+J35-N35","v":0},0,{"$f":"+J35*E$7","v":0}]
[]
[null,"Repairs & Maintenance"]
[null,null,"Pickup/General Use Equipment",1,null,"Acre",0,null,0,{"$f":"E38*H38","v":0},0,null,0,{"$f":"J38*L38","v":0},0,{"$f":"+J38-N38","v":0},0,{"$f":"+J38*E$7","v":0}]
[null,null,"Irrigation Equipment",1,null,"Acre",0,null,0,0,0,null,0,0,0,0,0,0]
[null,null,"Tractors/Self-Propelled",1,null,"Acre",1.9574863147654338,null,1.9574863147654338,0,0,null,0,0,1.9574863147654338,0,1565.989051812347,0]
[null,null,"Implements",1,null,"Acre",5.2526159228027636,null,5.2526159228027636,0,0,null,0,0,5.2526159228027636,0,4202.0927382422105,0]
[null,null,null,null,null,null,null,null,0,0,0,null,0,0,0,0,0,0]
[null,null,null,null,null,null,null,null,0,0,0,null,0,0,0,0,0,0]
[null,"Interest on Credit Line",null,null,null,null,0.08,null,15.018145372135088,{"$f":"+SUM(J17:J43)/2*H44","v":0},null,null,0,{"$f":"+SUM(N17:N43)/2*L44","v":0},15.018145372135088,{"$f":"+SUM(P17:P43)/2*L44","v":0},12014.516297708071,{"$f":"+J44*E$7","v":0}]
["Total Variable Costs",null,null,null,null,null,null,null,267.46024760970334,{"$f":"SUM(J18:J44)","v":0},null,null,0,{"$f":"SUM(N18:N44)","v":0},267.46024760970334,{"$f":"SUM(P18:P44)","v":0},213968.19808776263,{"$f":"SUM(R18:R44)","v":0}]
["Planned Returns Above Variable Costs:",null,null,null,null,null,null,null,-31.210247609703345,{"$f":"+J13-J45","v":0},null,null,0,{"$f":"+N13-N45","v":0},-31.210247609703345,{"$f":"+P13-P45","v":0},-24968.198087762634,{"$f":"+R13-R45","v":0}]
[null,"Breakeven Price to Cover Variable Costs",null,null,null,null,0.84908015114191537,{"$f":"IF(E10=0,\"n/a\",(YVarExp-(YTotExp+YTotRet-J10))/E10)","v":"n/a"},"Pound"]
[null,null,null,null,null,null,null,null,null,null,null,null,null,null,null,null,"Enterprise","Enterprise"]
["FIXED COSTS",null,null,"Quantity","Quantity","Units","$/Unit","$/Unit","Total","Total","Share","Share","Landlord","Landlord","Tenant","Tenant","Total","Total"]
[null,"Machinery Depreciation"]
[null,null,"Tractors/Self-Propelled",1,null,"Acre",1.8421814227097544,null,1.8421814227097544,{"$f":"E51*H51","v":0},0,null,0,{"$f":"J51*L51","v":0},1.8421814227097544,{"$f":"+J51-N51","v":0},1473.7451381678036,{"$f":"+J51*E$7","v":0}]
[null,null,"Implements",1,null,"Acre",6.4089727910052918,null,6.4089727910052918,0,0,null,0,{"$f":"J52*L52","v":0},6.4089727910052918,0,5127.1782328042336,0]
[null,"Equipment Investment"]
[null,null,"Tractors/Self-Propelled",14.351187534980827,null,"Dollars",0.08,null,1.1480950027984662,{"$f":"E54*H54","v":0},0,null,0,{"$f":"J54*L54","v":0},1.1480950027984662,{"$f":"+J54-N54","v":0},918.47600223877294,{"$f":"+J54*E$7","v":0}]
[null,null,"Implements",27.599525272633755,null,"Dollars",0.08,null,2.2079620218107006,0,0,null,0,{"$f":"J55*L55","v":0},2.2079620218107006,0,1766.3696174485603,0]
[null,"Salaried Labor",null,1,null,"Acre",0,null,0,0,0,null,0,{"$f":"J56*L56","v":0},0,{"$f":"+J56-N56","v":0},0,{"$f":"+J56*E$7","v":0}]
[null,"Management Fee, Owner/Operator Labor",null,1,null,"Acre",0,null,0,0,0,null,0,0,0,0,0,0]
[null,"Allocated Establishment Cost",null,1,null,"Acre",0,null,0,0,0,null,0,0,0,0,0,0]
[null,"Dryland Crop Rent",null,1,null,"Acre",30,null,30,0,0,null,0,0,30,0,24000,0]
[null,"Property Taxes",null,1,null,"Acre",0,null,0,0,0,null,0,0,0,0,0,0]
[null,"Whole Farm Insurance",null,1,null,"Acre",0,null,0,0,0,null,0,0,0,0,0,0]
[null,null,null,1,null,null,0,null,0,0,0,null,0,0,0,0,0,0]
[null,null,null,1,null,null,0,null,0,{"$f":"E63*H63","v":0},0,null,0,0,0,0,0,0]
["Total Fixed Costs",null,null,null,null,null,null,null,41.607211238324211,{"$f":"+SUM(J51:J63)","v":0},null,null,0,{"$f":"+SUM(N51:N63)","v":0},41.607211238324211,{"$f":"+SUM(P51:P63)","v":0},33285.768990659373,{"$f":"+SUM(R51:R63)","v":0}]
["Total Specified Costs",null,null,null,null,null,null,null,309.06745884802757,{"$f":"+J45+J64","v":0},null,null,0,{"$f":"+N45+N64","v":0},309.06745884802757,{"$f":"+P45+P64","v":0},247253.96707842202,{"$f":"+R45+R64","v":0}]
[]
["Returns Above Specified Costs",null,null,null,null,null,null,null,-72.81745884802757,{"$f":"+J13-J65","v":0},null,null,0,{"$f":"+N13-N65","v":0},-72.81745884802757,{"$f":"+P13-P65","v":0},-58253.967078422022,{"$f":"+R13-R65","v":0}]
[]
["    Breakeven Price to Cover Total Costs",null,null,null,null,null,0.98116653602548431,{"$f":"IF(E10=0,\"n/a\",(YTotExp-(YTotExp+YTotRet-J10))/E10)","v":"n/a"},"Pound"]
[]
[null,null,null,"Example Breakeven Prices"]
[null,"Example","Example","To Cover",null,null,"To Cover"]
[null,"Yield","Yield","Variable",null,null,"Total"]
[null,"Percent","Pound","Costs",null,null,"Costs"]
[null,0.75,236.25,1.1321068681892206,null,null,1.3082220480339792]
[null,0.9,283.5,0.94342239015768381,null,null,1.090185040028316]
[null,1,315,0.84908015114191537,null,null,0.98116653602548431]
[null,1.1000000000000001,346.5,0.77189104649265039,null,null,0.89196957820498579]
[null,1.25,393.75,0.67926412091353228,null,null,0.78493322882038752]
[]
[null,null,null,"Your Breakeven Prices"]
[null,"Your","Your",null,"To Cover",null,null,"To Cover"]
[null,"Yield","Yield",null,"Variable",null,null,"Total"]
[null,"Percent","Pound",null,"Costs",null,null,"Costs"]
[null,0.75,{"$f":"E10*YPER1","v":0},null,{"$f":"IF($E$10=0,0,(YVarExp-(YTotExp+YTotRet-J10))/($E$10*YPER1))","v":0},null,null,{"$f":"IF($E$10=0,0,(YTotExp-(YTotExp+YTotRet-J10))/($E$10*YPER1))","v":0}]
[null,0.9,{"$f":"E10*YPER2","v":0},null,{"$f":"IF($E$10=0,0,(YVarExp-(YTotExp+YTotRet-J10))/($E$10*YPER2))","v":0},null,null,{"$f":"IF($E$10=0,0,(YTotExp-(YTotExp+YTotRet-J10))/($E$10*YPER2))","v":0}]
[null,1,{"$f":"+E10","v":0},null,{"$f":"IF($E$10=0,0,(YVarExp-(YTotExp+YTotRet-J10))/($E$10*YPER3))","v":0},null,null,{"$f":"IF($E$10=0,0,(YTotExp-(YTotExp+YTotRet-J10))/($E$10*YPER3))","v":0}]
[null,1.1000000000000001,{"$f":"E10*YPER4","v":0},null,{"$f":"IF($E$10=0,0,(YVarExp-(YTotExp+YTotRet-J10))/($E$10*YPER4))","v":0},null,null,{"$f":"IF($E$10=0,0,(YTotExp-(YTotExp+YTotRet-J10))/($E$10*YPER4))","v":0}]
[null,1.25,{"$f":"E10*YPER5","v":0},null,{"$f":"IF($E$10=0,0,(YVarExp-(YTotExp+YTotRet-J10))/($E$10*YPER5))","v":0},null,null,{"$f":"IF($E$10=0,0,(YTotExp-(YTotExp+YTotRet-J10))/($E$10*YPER5))","v":0}]
[]
["  Developed by Jason Johnson, Associate Professor and Extension Economist, Texas A&M AgriLife Extension, 254-968-4144.  "]
[]
["Information presented is prepared solely as a general guide and not intended to recognize or predict the costs and returns from any one operation.  Brand names are mentioned only as examples and imply no endorsement."]

{"sheet":"CornSilageDryland","index":15,"n_rows":99,"n_cols":18,"rows_kept":99,"cut":false,"hidden":false,"merged":[[86,3,86,8],[76,3,76,8],[98,0,98,11],[0,0,0,11],[1,0,1,11],[2,0,2,11],[3,0,3,11]]}
["Projections for Planning Purposes Only -- Not to be Used without Updating"]
["2024 Estimated Costs and Returns per Acre"]
["RR Corn Silage - Dryland"]
["Enter your name for this budget in the cell above."]
["Enter  Your Values in the cells highlighed in MAROON."]
[null,null,null,null,"Your Acres",null,null,null,null,null,null,null,null,null,null,null,null,"Your"]
[null,null,"Crop Acres",500,null,null,null,null,null,null,null,"Your",null,null,null,null,"Enterprise","Enterprise"]
[null,null,null,null,"Your",null,null,"Your","Cash","Your","Landlord","Landlord",null,"Your",null,"Your","Total","Total"]
["REVENUE",null,null,"Quantity","Quantity","Units","$/Unit","$/Unit","Total","Total","Share","Share","Landlord","Landlord","Tenant","Tenant","(500 acres)",{"$f":"\"(\" & E7 & \" acres)\"","v":"( acres)"}]
[null,"Corn Silage",null,12,null,"Ton",65,null,780,{"$f":"E10*H10","v":0},0,null,0,{"$f":"J10*L10","v":0},780,{"$f":"+J10-N10","v":0},390000,{"$f":"+J10*E$7","v":0}]
[null,null,null,0,null,null,0,null,0,0,0,null,0,0,0,{"$f":"+J11-N11","v":0},0,0]
[null,null,null,0,null,null,0,null,0,0,0,null,0,0,0,0,0,0]
["Total Revenue",null,null,null,null,null,null,null,780,{"$f":"SUM(J10:J12)","v":0},null,null,0,{"$f":"SUM(N10:N12)","v":0},780,{"$f":"SUM(P10:P12)","v":0},390000,{"$f":"SUM(R10:R12)","v":0}]
[null,null,null,null,null,null,null,null,null,null,null,null,null,null,null,null,"Enterprise","Enterprise"]
["VARIABLE COSTS",null,null,"Quantity","Quantity","Units","$/Unit","$/Unit","Total","Total","Share","Share","Landlord","Landlord","Tenant","Tenant","Total","Total"]
["Production Costs"]
[null,"Seed"]
[null,"","HR Corn Silage Seed",24,null,"Thousand",3.8,null,91.199999999999989,{"$f":"E18*H18","v":0},0,null,0,{"$f":"J18*L18","v":0},91.199999999999989,{"$f":"+J18-N18","v":0},45599.999999999993,{"$f":"+J18*E$7","v":0}]
[null,"Fertilizer"]
[null,"","18-46-0 ",150,null,"Pound",0.6,null,90,0,0,null,0,0,90,0,45000,0]
[null,"","46-0-0",220,null,"Pound",0.55000000000000004,null,121.00000000000001,0,0,null,0,0,121.00000000000001,0,60500.000000000007,0]
[null,"","0-0-60",100,null,"Pound",0.5,null,50,0,0,null,0,0,50,0,25000,0]
[null,"Custom"]
[null,"","Custom Fertilize",1,null,"Acre",8,null,8,0,0,null,0,0,8,0,4000,0]
[null,"","Custom Harvest and Haul Silage",12,null,"Ton",10,null,120,0,0,null,0,0,120,0,60000,0]
[null,"Herbicide"]
[null,"","Post Plant Herbicide",1,null,"Acre",20,null,20,0,0,null,0,0,20,0,10000,0]
[null,null,null,0,null,null,0,null,0,0,0,null,0,0,0,0,0,0]
[null,null,null,0,null,null,0,null,0,0,0,null,0,0,0,0,0,0]
[null,null,null,0,null,null,0,null,0,{"$f":"E30*H30","v":0},0,null,0,{"$f":"J30*L30","v":0},0,{"$f":"+J30-N30","v":0},0,{"$f":"+J30*E$7","v":0}]
[null,"Machinery Labor"]
[null,null,"Tractors/Self-Propelled",7.0000000000000007E-2,null,"Hour",12,null,0.84000000000000008,{"$f":"E32*H32","v":0},0,null,0,{"$f":"J32*L32","v":0},0.84000000000000008,{"$f":"+J32-N32","v":0},420.00000000000006,{"$f":"+J32*E$7","v":0}]
[null,null,"Other Labor",0,null,"Hour",12,null,0,{"$f":"E33*H33","v":0},0,null,0,{"$f":"J33*L33","v":0},0,{"$f":"+J33-N33","v":0},0,{"$f":"+J33*E$7","v":0}]
[]
[null,"Diesel Fuel"]
[null,null,"Pickup/General Use Equipment",1,null,"Acre",0,null,0,{"$f":"E36*H36","v":0},0,null,0,{"$f":"J36*L36","v":0},0,{"$f":"+J36-N36","v":0},0,{"$f":"+J36*E$7","v":0}]
[null,null,"Tractors/Self-Propelled",0.6,null,"Gallon",3.6,null,2.16,{"$f":"E37*H37","v":0},0,null,0,{"$f":"J37*L37","v":0},2.16,{"$f":"+J37-N37","v":0},1080,{"$f":"+J37*E$7","v":0}]
[]
[null,"Gasoline"]
[null,null,"Pickup/General Use Equipment",1,null,"Acre",0,null,0,{"$f":"E40*H40","v":0},0,null,0,{"$f":"J40*L40","v":0},0,{"$f":"+J40-N40","v":0},0,{"$f":"+J40*E$7","v":0}]
[null,null,"Tractors/Self-Propelled",0,null,"Gallon",3.15,null,0,{"$f":"E41*H41","v":0},0,null,0,{"$f":"J41*L41","v":0},0,{"$f":"+J41-N41","v":0},0,{"$f":"+J41*E$7","v":0}]
[]
[null,"Repairs & Maintenance"]
[null,null,"Pickup/General Use Equipment",1,null,"Acre",0,null,0,{"$f":"E44*H44","v":0},0,null,0,{"$f":"J44*L44","v":0},0,{"$f":"+J44-N44","v":0},0,{"$f":"+J44*E$7","v":0}]
[null,null,"Irrigation Equipment",1,null,"Acre",0,null,0,0,0,null,0,0,0,0,0,0]
[null,null,"Tractors/Self-Propelled",1,null,"Acre",1.6345803537244123,null,1.6345803537244123,0,0,null,0,0,1.6345803537244123,0,817.29017686220618,0]
[null,null,"Implements",1,null,"Acre",2.9116813144751403,null,2.9116813144751403,0,0,null,0,0,2.9116813144751403,0,1455.8406572375702,0]
[null,null,null,null,null,null,null,null,0,0,0,null,0,0,0,0,0,0]
[null,null,null,null,null,null,null,null,0,0,0,null,0,0,0,0,0,0]
[null,"Interest on Credit Line",null,null,null,null,0.08,null,10.486720364788695,{"$f":"+SUM(J17:J49)/2*H50","v":0},null,null,0,{"$f":"+SUM(N17:N49)/2*L50","v":0},10.486720364788695,{"$f":"+SUM(P17:P49)/2*L50","v":0},5243.3601823943472,{"$f":"+J50*E$7","v":0}]
["Total Variable Costs",null,null,null,null,null,null,null,518.23298203298816,{"$f":"SUM(J18:J50)","v":0},null,null,0,{"$f":"SUM(N18:N50)","v":0},518.23298203298816,{"$f":"SUM(P18:P50)","v":0},259116.49101649414,{"$f":"SUM(R18:R50)","v":0}]
["Planned Returns Above Variable Costs:",null,null,null,null,null,null,null,261.76701796701184,{"$f":"+J13-J51","v":0},null,null,0,{"$f":"+N13-N51","v":0},261.76701796701184,{"$f":"+P13-P51","v":0},130883.50898350586,{"$f":"+R13-R51","v":0}]
[null,"Breakeven Price to Cover Variable Costs",null,null,null,null,43.186081836082344,{"$f":"IF(E10=0,\"n/a\",(YVarExp-(YTotExp+YTotRet-J10))/E10)","v":"n/a"},"Ton"]
[null,null,null,null,null,null,null,null,null,null,null,null,null,null,null,null,"Enterprise","Enterprise"]
["FIXED COSTS",null,null,"Quantity","Quantity","Units","$/Unit","$/Unit","Total","Total","Share","Share","Landlord","Landlord","Tenant","Tenant","Total","Total"]
[null,"Machinery Depreciation"]
[null,null,"Tractors/Self-Propelled",1,null,"Acre",1.689066365515226,null,1.689066365515226,{"$f":"E57*H57","v":0},0,null,0,{"$f":"J57*L57","v":0},1.689066365515226,{"$f":"+J57-N57","v":0},844.53318275761308,{"$f":"+J57*E$7","v":0}]
[null,null,"Implements",1,null,"Acre",3.8483063421349928,null,3.8483063421349928,0,0,null,0,{"$f":"J58*L58","v":0},3.8483063421349928,0,1924.1531710674965,0]
[null,"Equipment Investment"]
[null,null,"Tractors/Self-Propelled",13.158371847481522,null,"Dollars",0.08,null,1.0526697477985218,{"$f":"E60*H60","v":0},0,null,0,{"$f":"J60*L60","v":0},1.0526697477985218,{"$f":"+J60-N60","v":0},526.33487389926097,{"$f":"+J60*E$7","v":0}]
[null,null,"Implements",16.46219935246636,null,"Dollars",0.08,null,1.3169759481973089,0,0,null,0,{"$f":"J61*L61","v":0},1.3169759481973089,0,658.48797409865449,0]
[null,"Salaried Labor",null,1,null,"Acre",0,null,0,0,0,null,0,{"$f":"J62*L62","v":0},0,{"$f":"+J62-N62","v":0},0,{"$f":"+J62*E$7","v":0}]
[null,"Management Fee, Owner/Operator Labor",null,1,null,"Acre",0,null,0,0,0,null,0,0,0,0,0,0]
[null,"Allocated Establishment Cost",null,1,null,"Acre",0,null,0,0,0,null,0,0,0,0,0,0]
[null,"Dryland Crop Rent",null,1,null,"Acre",30,null,30,0,0,null,0,0,30,0,15000,0]
[null,"Property Taxes",null,1,null,"Acre",0,null,0,0,0,null,0,0,0,0,0,0]
[null,"Whole Farm Insurance",null,1,null,"Acre",0,null,0,0,0,null,0,0,0,0,0,0]
[null,null,null,1,null,null,0,null,0,0,0,null,0,0,0,0,0,0]
[null,null,null,1,null,null,0,null,0,{"$f":"E69*H69","v":0},0,null,0,0,0,0,0,0]
["Total Fixed Costs",null,null,null,null,null,null,null,37.907018403646049,{"$f":"+SUM(J57:J69)","v":0},null,null,0,{"$f":"+SUM(N57:N69)","v":0},37.907018403646049,{"$f":"+SUM(P57:P69)","v":0},18953.509201823024,{"$f":"+SUM(R57:R69)","v":0}]
["Total Specified Costs",null,null,null,null,null,null,null,556.14000043663418,{"$f":"+J51+J70","v":0},null,null,0,{"$f":"+N51+N70","v":0},556.14000043663418,{"$f":"+P51+P70","v":0},278070.00021831715,{"$f":"+R51+R70","v":0}]
[]
["Returns Above Specified Costs",null,null,null,null,null,null,null,223.85999956336582,{"$f":"+J13-J71","v":0},null,null,0,{"$f":"+N13-N71","v":0},223.85999956336582,{"$f":"+P13-P71","v":0},111929.99978168285,{"$f":"+R13-R71","v":0}]
[]
["    Breakeven Price to Cover Total Costs",null,null,null,null,null,46.345000036386182,{"$f":"IF(E10=0,\"n/a\",(YTotExp-(YTotExp+YTotRet-J10))/E10)","v":"n/a"},"Ton"]
[]
[null,null,null,"Example Breakeven Prices"]
[null,"Example","Example","To Cover",null,null,"To Cover"]
[null,"Yield","Yield","Variable",null,null,"Total"]
[null,"Percent","Ton","Costs",null,null,"Costs"]
[null,0.75,9,57.581442448109797,null,null,61.793333381848242]
[null,0.9,10.8,47.984535373424826,null,null,51.494444484873533]
[null,1,12,43.186081836082344,null,null,46.345000036386182]
[null,1.1000000000000001,13.200000000000001,39.26007439643849,null,null,42.131818214896526]
[null,1.25,15,34.548865468865877,null,null,37.076000029108947]
[]
[null,null,null,"Your Breakeven Prices"]
[null,"Your","Your",null,"To Cover",null,null,"To Cover"]
[null,"Yield","Yield",null,"Variable",null,null,"Total"]
[null,"Percent","Ton",null,"Costs",null,null,"Costs"]
[null,0.75,{"$f":"E10*YPER1","v":0},null,{"$f":"IF($E$10=0,0,(YVarExp-(YTotExp+YTotRet-J10))/($E$10*YPER1))","v":0},null,null,{"$f":"IF($E$10=0,0,(YTotExp-(YTotExp+YTotRet-J10))/($E$10*YPER1))","v":0}]
[null,0.9,{"$f":"E10*YPER2","v":0},null,{"$f":"IF($E$10=0,0,(YVarExp-(YTotExp+YTotRet-J10))/($E$10*YPER2))","v":0},null,null,{"$f":"IF($E$10=0,0,(YTotExp-(YTotExp+YTotRet-J10))/($E$10*YPER2))","v":0}]
[null,1,{"$f":"+E10","v":0},null,{"$f":"IF($E$10=0,0,(YVarExp-(YTotExp+YTotRet-J10))/($E$10*YPER3))","v":0},null,null,{"$f":"IF($E$10=0,0,(YTotExp-(YTotExp+YTotRet-J10))/($E$10*YPER3))","v":0}]
[null,1.1000000000000001,{"$f":"E10*YPER4","v":0},null,{"$f":"IF($E$10=0,0,(YVarExp-(YTotExp+YTotRet-J10))/($E$10*YPER4))","v":0},null,null,{"$f":"IF($E$10=0,0,(YTotExp-(YTotExp+YTotRet-J10))/($E$10*YPER4))","v":0}]
[null,1.25,{"$f":"E10*YPER5","v":0},null,{"$f":"IF($E$10=0,0,(YVarExp-(YTotExp+YTotRet-J10))/($E$10*YPER5))","v":0},null,null,{"$f":"IF($E$10=0,0,(YTotExp-(YTotExp+YTotRet-J10))/($E$10*YPER5))","v":0}]
[]
["  Developed by Jason Johnson, Associate Professor and Extension Economist, Texas A&M AgriLife Extension, 254-968-4144.  "]
[]
["Information presented is prepared solely as a general guide and not intended to recognize or predict the costs and returns from any one operation.  Brand names are mentioned only as examples and imply no endorsement."]

{"sheet":"CornSilageIrrigated","index":16,"n_rows":101,"n_cols":18,"rows_kept":101,"cut":false,"hidden":false,"merged":[[88,3,88,8],[78,3,78,8],[100,0,100,11],[0,0,0,11],[1,0,1,11],[2,0,2,11],[3,0,3,11]]}
["Projections for Planning Purposes Only -- Not to be Used without Updating"]
["2024 Estimated Costs and Returns per Acre"]
["RR Corn Silage - Irrigated"]
["Enter your name for this budget in the cell above."]
["Enter  Your Values in the cells highlighed in MAROON."]
[null,null,null,null,"Your Acres",null,null,null,null,null,null,null,null,null,null,null,null,"Your"]
[null,null,"Crop Acres",500,null,null,null,null,null,null,null,"Your",null,null,null,null,"Enterprise","Enterprise"]
[null,null,null,null,"Your",null,null,"Your","Cash","Your","Landlord","Landlord",null,"Your",null,"Your","Total","Total"]
["REVENUE",null,null,"Quantity","Quantity","Units","$/Unit","$/Unit","Total","Total","Share","Share","Landlord","Landlord","Tenant","Tenant","(500 acres)",{"$f":"\"(\" & E7 & \" acres)\"","v":"( acres)"}]
[null,"Corn Silage",null,22,null,"Ton",65,null,1430,{"$f":"E10*H10","v":0},0,null,0,{"$f":"J10*L10","v":0},1430,{"$f":"+J10-N10","v":0},715000,{"$f":"+J10*E$7","v":0}]
[null,null,null,0,null,null,0,null,0,0,0,null,0,0,0,{"$f":"+J11-N11","v":0},0,0]
[null,null,null,0,null,null,0,null,0,0,0,null,0,0,0,0,0,0]
["Total Revenue",null,null,null,null,null,null,null,1430,{"$f":"SUM(J10:J12)","v":0},null,null,0,{"$f":"SUM(N10:N12)","v":0},1430,{"$f":"SUM(P10:P12)","v":0},715000,{"$f":"SUM(R10:R12)","v":0}]
[null,null,null,null,null,null,null,null,null,null,null,null,null,null,null,null,"Enterprise","Enterprise"]
["VARIABLE COSTS",null,null,"Quantity","Quantity","Units","$/Unit","$/Unit","Total","Total","Share","Share","Landlord","Landlord","Tenant","Tenant","Total","Total"]
["Production Costs"]
[null,"Seed"]
[null,"","HR Corn Silage Seed",32,null,"Thousand",3.8,null,121.6,{"$f":"E18*H18","v":0},0,null,0,{"$f":"J18*L18","v":0},121.6,{"$f":"+J18-N18","v":0},60800,{"$f":"+J18*E$7","v":0}]
[null,"Fertilizer"]
[null,"","18-46-0 ",150,null,"Pound",0.6,null,90,0,0,null,0,0,90,0,45000,0]
[null,"","46-0-0",478,null,"Pound",0.55000000000000004,null,262.90000000000003,0,0,null,0,0,262.90000000000003,0,131450.00000000003,0]
[null,"","0-0-60",100,null,"Pound",0.5,null,50,0,0,null,0,0,50,0,25000,0]
[null,"Custom"]
[null,"","Custom Fertilize",1,null,"Acre",8,null,8,0,0,null,0,0,8,0,4000,0]
[null,"","Custom Harvest and Haul Silage",22,null,"Ton",10,null,220,0,0,null,0,0,220,0,110000,0]
[null,"Herbicide"]
[null,"","Post Plant Herbicide",1,null,"Acre",20,null,20,0,0,null,0,0,20,0,10000,0]
[null,null,null,0,null,null,0,null,0,0,0,null,0,0,0,0,0,0]
[null,null,null,0,null,null,0,null,0,0,0,null,0,0,0,0,0,0]
[null,null,null,0,null,null,0,null,0,{"$f":"E30*H30","v":0},0,null,0,{"$f":"J30*L30","v":0},0,{"$f":"+J30-N30","v":0},0,{"$f":"+J30*E$7","v":0}]
[null,"Irrigation"]
[null,null,"Energy Cost",20,null,"AcreInch",12,null,240,{"$f":"E32*H32","v":0},0,null,0,{"$f":"J32*L32","v":0},240,{"$f":"+J32-N32","v":0},120000,{"$f":"+J32*E$7","v":0}]
[null,"Machinery Labor"]
[null,null,"Tractors/Self-Propelled",7.0000000000000007E-2,null,"Hour",12,null,0.84000000000000008,{"$f":"E34*H34","v":0},0,null,0,{"$f":"J34*L34","v":0},0.84000000000000008,{"$f":"+J34-N34","v":0},420.00000000000006,{"$f":"+J34*E$7","v":0}]
[null,null,"Other Labor",0,null,"Hour",12,null,0,{"$f":"E35*H35","v":0},0,null,0,{"$f":"J35*L35","v":0},0,{"$f":"+J35-N35","v":0},0,{"$f":"+J35*E$7","v":0}]
[]
[null,"Diesel Fuel"]
[null,null,"Pickup/General Use Equipment",1,null,"Acre",0,null,0,{"$f":"E38*H38","v":0},0,null,0,{"$f":"J38*L38","v":0},0,{"$f":"+J38-N38","v":0},0,{"$f":"+J38*E$7","v":0}]
[null,null,"Tractors/Self-Propelled",0.6,null,"Gallon",3.6,null,2.16,{"$f":"E39*H39","v":0},0,null,0,{"$f":"J39*L39","v":0},2.16,{"$f":"+J39-N39","v":0},1080,{"$f":"+J39*E$7","v":0}]
[]
[null,"Gasoline"]
[null,null,"Pickup/General Use Equipment",1,null,"Acre",0,null,0,{"$f":"E42*H42","v":0},0,null,0,{"$f":"J42*L42","v":0},0,{"$f":"+J42-N42","v":0},0,{"$f":"+J42*E$7","v":0}]
[null,null,"Tractors/Self-Propelled",0,null,"Gallon",3.15,null,0,{"$f":"E43*H43","v":0},0,null,0,{"$f":"J43*L43","v":0},0,{"$f":"+J43-N43","v":0},0,{"$f":"+J43*E$7","v":0}]
[]
[null,"Repairs & Maintenance"]
[null,null,"Pickup/General Use Equipment",1,null,"Acre",0,null,0,{"$f":"E46*H46","v":0},0,null,0,{"$f":"J46*L46","v":0},0,{"$f":"+J46-N46","v":0},0,{"$f":"+J46*E$7","v":0}]
[null,null,"Irrigation Equipment",1,null,"Acre",0,null,0,0,0,null,0,0,0,0,0,0]
[null,null,"Tractors/Self-Propelled",1,null,"Acre",1.6345803537244123,null,1.6345803537244123,0,0,null,0,0,1.6345803537244123,0,817.29017686220618,0]
[null,null,"Implements",1,null,"Acre",2.9116813144751403,null,2.9116813144751403,0,0,null,0,0,2.9116813144751403,0,1455.8406572375702,0]
[null,null,null,null,null,null,null,null,0,0,0,null,0,0,0,0,0,0]
[null,null,null,null,null,null,null,null,0,0,0,null,0,0,0,0,0,0]
[null,"Interest on Credit Line",null,null,null,null,0.08,null,22.979272973287692,{"$f":"+SUM(J17:J51)/2*H52","v":0},null,null,0,{"$f":"+SUM(N17:N51)/2*L52","v":0},22.979272973287692,{"$f":"+SUM(P17:P51)/2*L52","v":0},11489.636486643845,{"$f":"+J52*E$7","v":0}]
["Total Variable Costs",null,null,null,null,null,null,null,1043.0255346414872,{"$f":"SUM(J18:J52)","v":0},null,null,0,{"$f":"SUM(N18:N52)","v":0},1043.0255346414872,{"$f":"SUM(P18:P52)","v":0},521512.76732074365,{"$f":"SUM(R18:R52)","v":0}]
["Planned Returns Above Variable Costs:",null,null,null,null,null,null,null,386.97446535851282,{"$f":"+J13-J53","v":0},null,null,0,{"$f":"+N13-N53","v":0},386.97446535851282,{"$f":"+P13-P53","v":0},193487.23267925635,{"$f":"+R13-R53","v":0}]
[null,"Breakeven Price to Cover Variable Costs",null,null,null,null,47.410251574613056,{"$f":"IF(E10=0,\"n/a\",(YVarExp-(YTotExp+YTotRet-J10))/E10)","v":"n/a"},"Ton"]
[null,null,null,null,null,null,null,null,null,null,null,null,null,null,null,null,"Enterprise","Enterprise"]
["FIXED COSTS",null,null,"Quantity","Quantity","Units","$/Unit","$/Unit","Total","Total","Share","Share","Landlord","Landlord","Tenant","Tenant","Total","Total"]
[null,"Machinery Depreciation"]
[null,null,"Tractors/Self-Propelled",1,null,"Acre",1.689066365515226,null,1.689066365515226,{"$f":"E59*H59","v":0},0,null,0,{"$f":"J59*L59","v":0},1.689066365515226,{"$f":"+J59-N59","v":0},844.53318275761308,{"$f":"+J59*E$7","v":0}]
[null,null,"Implements",1,null,"Acre",3.8483063421349928,null,3.8483063421349928,0,0,null,0,{"$f":"J60*L60","v":0},3.8483063421349928,0,1924.1531710674965,0]
[null,"Equipment Investment"]
[null,null,"Tractors/Self-Propelled",13.158371847481522,null,"Dollars",0.08,null,1.0526697477985218,{"$f":"E62*H62","v":0},0,null,0,{"$f":"J62*L62","v":0},1.0526697477985218,{"$f":"+J62-N62","v":0},526.33487389926097,{"$f":"+J62*E$7","v":0}]
[null,null,"Implements",16.46219935246636,null,"Dollars",0.08,null,1.3169759481973089,0,0,null,0,{"$f":"J63*L63","v":0},1.3169759481973089,0,658.48797409865449,0]
[null,"Salaried Labor",null,1,null,"Acre",0,null,0,0,0,null,0,{"$f":"J64*L64","v":0},0,{"$f":"+J64-N64","v":0},0,{"$f":"+J64*E$7","v":0}]
[null,"Management Fee, Owner/Operator Labor",null,1,null,"Acre",0,null,0,0,0,null,0,0,0,0,0,0]
[null,"Allocated Establishment Cost",null,1,null,"Acre",0,null,0,0,0,null,0,0,0,0,0,0]
[null,"Irrigated Land Rent",null,1,null,"Acre",50,null,50,0,0,null,0,0,50,0,25000,0]
[null,"Property Taxes",null,1,null,"Acre",0,null,0,0,0,null,0,0,0,0,0,0]
[null,"Whole Farm Insurance",null,1,null,"Acre",0,null,0,0,0,null,0,0,0,0,0,0]
[null,null,null,1,null,null,0,null,0,0,0,null,0,0,0,0,0,0]
[null,null,null,1,null,null,0,null,0,{"$f":"E71*H71","v":0},0,null,0,0,0,0,0,0]
["Total Fixed Costs",null,null,null,null,null,null,null,57.907018403646049,{"$f":"+SUM(J59:J71)","v":0},null,null,0,{"$f":"+SUM(N59:N71)","v":0},57.907018403646049,{"$f":"+SUM(P59:P71)","v":0},28953.509201823024,{"$f":"+SUM(R59:R71)","v":0}]
["Total Specified Costs",null,null,null,null,null,null,null,1100.9325530451333,{"$f":"+J53+J72","v":0},null,null,0,{"$f":"+N53+N72","v":0},1100.9325530451333,{"$f":"+P53+P72","v":0},550466.27652256668,{"$f":"+R53+R72","v":0}]
[]
["Returns Above Specified Costs",null,null,null,null,null,null,null,329.06744695486668,{"$f":"+J13-J73","v":0},null,null,0,{"$f":"+N13-N73","v":0},329.06744695486668,{"$f":"+P13-P73","v":0},164533.72347743332,{"$f":"+R13-R73","v":0}]
[]
["    Breakeven Price to Cover Total Costs",null,null,null,null,null,50.042388774778786,{"$f":"IF(E10=0,\"n/a\",(YTotExp-(YTotExp+YTotRet-J10))/E10)","v":"n/a"},"Ton"]
[]
[null,null,null,"Example Breakeven Prices"]
[null,"Example","Example","To Cover",null,null,"To Cover"]
[null,"Yield","Yield","Variable",null,null,"Total"]
[null,"Percent","Ton","Costs",null,null,"Costs"]
[null,0.75,16.5,63.213668766150739,null,null,66.723185033038376]
[null,0.9,19.8,52.678057305125613,null,null,55.602654194198649]
[null,1,22,47.410251574613056,null,null,50.042388774778786]
[null,1.1000000000000001,24.200000000000003,43.100228704193682,null,null,45.493080704344344]
[null,1.25,27.5,37.928201259690447,null,null,40.03391101982303]
[]
[null,null,null,"Your Breakeven Prices"]
[null,"Your","Your",null,"To Cover",null,null,"To Cover"]
[null,"Yield","Yield",null,"Variable",null,null,"Total"]
[null,"Percent","Ton",null,"Costs",null,null,"Costs"]
[null,0.75,{"$f":"E10*YPER1","v":0},null,{"$f":"IF($E$10=0,0,(YVarExp-(YTotExp+YTotRet-J10))/($E$10*YPER1))","v":0},null,null,{"$f":"IF($E$10=0,0,(YTotExp-(YTotExp+YTotRet-J10))/($E$10*YPER1))","v":0}]
[null,0.9,{"$f":"E10*YPER2","v":0},null,{"$f":"IF($E$10=0,0,(YVarExp-(YTotExp+YTotRet-J10))/($E$10*YPER2))","v":0},null,null,{"$f":"IF($E$10=0,0,(YTotExp-(YTotExp+YTotRet-J10))/($E$10*YPER2))","v":0}]
[null,1,{"$f":"+E10","v":0},null,{"$f":"IF($E$10=0,0,(YVarExp-(YTotExp+YTotRet-J10))/($E$10*YPER3))","v":0},null,null,{"$f":"IF($E$10=0,0,(YTotExp-(YTotExp+YTotRet-J10))/($E$10*YPER3))","v":0}]
[null,1.1000000000000001,{"$f":"E10*YPER4","v":0},null,{"$f":"IF($E$10=0,0,(YVarExp-(YTotExp+YTotRet-J10))/($E$10*YPER4))","v":0},null,null,{"$f":"IF($E$10=0,0,(YTotExp-(YTotExp+YTotRet-J10))/($E$10*YPER4))","v":0}]
[null,1.25,{"$f":"E10*YPER5","v":0},null,{"$f":"IF($E$10=0,0,(YVarExp-(YTotExp+YTotRet-J10))/($E$10*YPER5))","v":0},null,null,{"$f":"IF($E$10=0,0,(YTotExp-(YTotExp+YTotRet-J10))/($E$10*YPER5))","v":0}]
[]
["  Developed by Jason Johnson, Associate Professor and Extension Economist, Texas A&M AgriLife Extension, 254-968-4144.  "]
[]
["Information presented is prepared solely as a general guide and not intended to recognize or predict the costs and returns from any one operation.  Brand names are mentioned only as examples and imply no endorsement."]

{"sheet":"CowCalfImprove","index":17,"n_rows":94,"n_cols":14,"rows_kept":94,"cut":false,"hidden":false,"merged":[[69,7,69,8],[69,10,69,12],[0,0,0,13],[1,0,1,13],[2,0,2,13],[3,0,3,13],[68,2,68,12],[80,7,80,8],[80,10,80,12],[70,7,70,8],[70,10,70,12],[71,7,71,8],[71,10,71,12],[72,7,72,8],[72,10,72,12],[73,7,73,8],[73,10,73,12],[74,7,74,8],[74,10,74,12],[79,2,79,12],[81,7,81,8],[81,10,81,12],[82,7,82,8],[82,10,82,12],[83,7,83,8],[83,10,83,12],[84,7,84,8],[84,10,84,12],[85,7,85,8],[85,10,85,12],[93,0,93,13]]}
["Projections for Planning Purposes Only -- Not to be Used without Updating"]
["2024 Estimated Costs and Returns per Animal Unit"]
["Cow-Calf Improved Pasture"]
["Enter your name for this budget in the cell above."]
["Enter  Your Values in the cells highlighed in MAROON."]
[null,null,null,null,"Your Cows"]
[null,"Animal Units (AU)",null,40,null,"Animal Unit",null,null,null,null,null,null,null,"Your"]
[null,"Breeding Females",null,40,null,"Calf","Your",null,null,null,null,null,"Enterprise","Enterprise"]
[null,null,null,null,"Your","Quantity","Quantity",null,null,"Your",null,"Your","Total","Total"]
["REVENUE",null,null,"Head","Head","Per Head","Per Head","Units","$/Unit","$/Unit","Total","Total",{"$f":"\"(\" & D7 & \" AUs)\"","v":"(40 AUs)"},{"$f":"\"(\" & E7 & \" AUs)\"","v":"( AUs)"}]
[null,"Steer",null,0.42499999999999999,null,5.5,null,"CWT",285,null,666.1875,{"$f":"+E11*G11*J11","v":0},26647.5,{"$f":"+L11*E$7","v":0}]
[null,"Heifer",null,0.3,null,5.25,null,"CWT",270,null,425.25,{"$f":"+E12*G12*J12","v":0},17010,{"$f":"+L12*E$7","v":0}]
[null,"Cull Cow",null,0.1,null,9,null,"CWT",95,null,85.5,0,3420,0]
[null,"Cull Bull",null,0.01,null,16,null,"CWT",120,null,19.2,0,768,0]
[null,null,null,0,null,0,null,null,0,null,0,0,0,0]
[null,null,null,0,null,0,null,null,0,null,0,0,0,0]
["Total Revenue",null,null,null,null,391.24999999999994,null,null,null,null,1196.1375,{"$f":"+SUM(L11:L16)","v":0},47845.5,{"$f":"+SUM(N11:N16)","v":0}]
[null,null,null,null,null,497.25]
[null,null,null,null,null,106.00000000000006,null,null,null,null,null,null,"Enterprise","Enterprise"]
["VARIABLE COSTS",null,null,null,null,"Quantity","Quantity","Units","$/Unit","$/Unit","Total","Total","Total","Total"]
["Production Costs"]
[null,"Miscellaneous"]
[null,null,null,null,null,1,null,null,0,null,0,{"$f":"+J23*G23","v":0},0,{"$f":"+L23*E$7","v":0}]
[null,null,null,null,null,1,null,null,0,null,0,0,0,0]
[null,"Marketing Expense",null,null,null,1,null,"AU",15,null,15,0,600,0]
[null,"Feed"]
[null,null,"Salt & Mineral - Cow",null,null,50,null,"Pound",0.65,null,32.5,{"$f":"+J27*G27","v":0},1300,{"$f":"+L27*E$7","v":0}]
[null,null,"Supplement - Cow",null,null,700,null,"Pound",0.25,null,175,0,7000,0]
[null,null,"Bermuda Hay",null,null,2,null,"Roll",120,null,240,0,9600,0]
[null,null,null,null,null,0,null,null,0,null,0,0,0,0]
[null,null,null,null,null,0,null,null,0,null,0,0,0,0]
[null,null,null,null,null,0,null,null,0,null,0,0,0,0]
[null,"Vet. Medicine"]
[null,null,"Vet. Medicine - Cow",null,null,1,null,"Head",15,null,15,{"$f":"+J34*G34","v":0},600,{"$f":"+L34*E$7","v":0}]
[null,null,null,null,null,0,null,null,0,null,0,0,0,0]
[null,null,null,null,null,0,null,null,0,null,0,0,0,0]
[null,null,null,null,null,0,null,null,0,null,0,0,0,0]
[null,"Fuel",null,null,null,1,null,"AU",20.562000000000001,null,20.562000000000001,0,822.48,0]
[null,"Lube (As a % of fuel)",null,null,null,0.1,null,"Percent",20.562000000000001,null,2.0562,0,82.248000000000005,0]
[null,"Repairs ",null,null,null,1,null,"AU",5.9600484375000002,null,5.9600484375000002,0,238.4019375,0]
[null,"Labor",null,null,null,8.5079999999999991,null,"Hours",5.1863046544428775,null,44.125079999999997,0,1765.0031999999999,0]
[null,"Utilities",null,null,null,1,null,"AU",0,null,0,0,0,0]
[null,null,null,null,null,null,null,null,null,null,0,{"$f":"+J43*G43","v":0},0,0]
[null,"Purchase Breeding Female",null,null,null,1,null,null,0,null,0,0,0,0]
[null,"Purchase Breeding Male",null,null,null,1,null,null,0,null,0,0,0,0]
[null,"Purchase Older Repalcement Female",null,null,null,1,null,null,0,null,0,0,0,0]
[null,"Purchase Younger Repalcement Female",null,null,null,1,null,null,0,null,0,0,0,0]
[null,"Interest on Credit Line",null,null,null,null,null,null,0.08,null,56.50076670243152,{"$f":"+SUM(L21:L47)/2*J48","v":0},2260.0306680972608,0]
["Total Variable Costs",null,null,null,null,null,null,null,null,null,606.7040951399315,{"$f":"+SUM(L23:L48)","v":0},24268.163805597258,{"$f":"+SUM(N23:N48)","v":0}]
[]
["Planned Returns Above Variable Costs:",null,null,null,null,null,null,null,null,null,589.43340486006855,{"$f":"+L17-L49","v":0},23577.336194402742,{"$f":"+N17-N49","v":0}]
[null,"Average Calf Breakeven Price to Cover Variable Costs",null,null,null,null,null,null,128.30775594630839,{"$f":"IF((E11*G11+E12*G12)=0,\"n/a\",(L49-SUM(L13:L16))/(E11*G11+E12*G12))","v":"n/a"},"CWT"]
[null,null,null,null,null,null,null,null,null,null,null,null,"Enterprise","Enterprise"]
["FIXED COSTS",null,null,null,null,"Quantity","Quantity","Units","$/Unit","$/Unit","Total","Total","Total","Total"]
[null,"Depreciation - Equipment",null,null,null,1,null,"AU",41.885925781250009,null,41.885925781250009,{"$f":"+G55*J55","v":0},1675.4370312500005,{"$f":"+L55*E$7","v":0}]
[null,"Depreciation - Livestock",null,null,null,1,null,"AU",14.983333333333334,null,14.983333333333334,0,599.33333333333337,0]
[null,"Equipment Investment",null,null,null,1027.0899343750002,null,"dollars",0.08,null,82.167194750000021,0,3286.6877900000009,0]
[null,"Insurance",null,null,null,1,null,"AU",0,null,0,0,0,0]
[null,"Management Fee, Owner/Operator Labor",null,null,null,1,null,"AU",0,null,0,{"$f":"+J59*G59","v":0},0,0]
[null,"Salaried Labor",null,null,null,1,null,"AU",0,null,0,{"$f":"+J60*G60","v":0},0,0]
[null,"Pasture Cost",null,null,null,8,null,"Acres",25,null,200,0,8000,0]
[null,null,null,null,null,null,null,null,null,null,0,{"$f":"+G62*J62","v":0},0,0]
[null,null,null,null,null,null,null,null,null,null,0,0,0,0]
["Total Fixed Costs",null,null,null,null,null,null,null,null,null,339.03645386458334,{"$f":"+SUM(L55:L61)","v":0},13561.458154583335,{"$f":"+SUM(N55:N61)","v":0}]
["Total Costs",null,null,null,null,null,null,null,null,null,945.74054900451483,{"$f":"+L49+L64","v":0},37829.621960180593,{"$f":"+N49+N64","v":0}]
["Planned Returns to Management, Risk, and Profit:",null,null,null,null,null,null,null,null,null,250.39695099548521,{"$f":"+L17-L65","v":0},10015.878039819407,{"$f":"+N17-N65","v":0}]
[null,"Average Calf Breakeven Price to Cover Total Costs",null,null,null,null,null,null,214.9624406401316,{"$f":"IF((E11*G11+E12*G12)=0,\"n/a\",(L65-SUM(L13:L16))/(E11*G11+E12*G12))","v":"n/a"},"CWT"]
[]
[null,null,"Sensitivity Analysis for Example"]
[null,null,"Example Weaning Percent","Example Gross Sales per Animal Unit",null,"Pounds Produced per Animal Unit",null,"Example Breakeven Calf Pay Weight to Cover Total Cost",null,null,"Example Average Breakeven Price to Cover Total Cost"]
[null,null,0.91,1273.1801470588236,null,524.86764705882354,null,372.20945001659675,null,null,200.78909290561745]
[null,null,0.88,1234.6588235294118,null,511.05882352941177,null,386.52519809415816,null,null,207.63417561830892]
[null,null,0.85,1196.1375,null,497.25,null,401.98620601792453,null,null,214.9624406401316]
[null,null,0.82,1157.6161764705882,null,483.44117647058823,null,418.7356312686714,null,null,222.82692017574618]
[null,null,0.78999999999999992,1119.0948529411764,null,469.63235294117646,null,436.94152828035277,null,null,231.28870195457202]
[]
[null,null,null,{"$f":"\"Example Male \"&F8&\" Price\"","v":"Example Male Calf Price"},null,null,null,null,null,null,{"$f":"+I11","v":285}]
[null,null,null,{"$f":"\"Example Female \"&F8&\" Price\"","v":"Example Female Calf Price"},null,null,null,null,null,null,{"$f":"+I12","v":270}]
[null,null,null,{"$f":"\"Example Weighted Average \"&F8&\" Price ($/cwt)\"","v":"Example Weighted Average Calf Price ($/cwt)"},null,null,null,null,null,null,{"$f":"+(K11+K12)/(D11*F11+D12*F12)","v":278.96166134185307}]
[null,null,"Sensitivity Analysis for Your Values"]
[null,null,"Your Weaning Percent",{"$f":"\"Your Gross Sales per \"&F7","v":"Your Gross Sales per Animal Unit"},null,{"$f":"\"Pounds Produced per \"&F7","v":"Pounds Produced per Animal Unit"},null,{"$f":"\"Your Breakeven \"&F8&\" Pay Weight to Cover Total Cost\"","v":"Your Breakeven Calf Pay Weight to Cover Total Cost"},null,null,"Your Average Breakeven Price to Cover Total Cost"]
[null,null,{"$f":"+C83+C71-C72","v":1.06},{"$f":"+IF($C$84=0,0,$L$17-$L$11-$L$12+($L$11+$L$12)*C82/$C$84)","v":0},null,{"$f":"IF($C$84=0,0,$M$88*C82/$C$84+$M$89)","v":0},null,{"$f":"IF($D$84=0,0,(YTotExp-(YTotRet+YTotExp-$L$11-$L$12))/(YPrice/100)/(C82-$E$13*$E$7/$E$8)/($E$8/$E$7))","v":0},null,null,{"$f":"IF(F82-$M$89=0,0,(YTotExp-(YTotRet+YTotExp-$L$11-$L$12))/(F82-$M$89)*100)","v":0}]
[null,null,{"$f":"+C84+C72-C73","v":1.0299999999999998},{"$f":"+IF($C$84=0,0,$L$17-$L$11-$L$12+($L$11+$L$12)*C83/$C$84)","v":0},null,{"$f":"IF($C$84=0,0,$M$88*C83/$C$84+$M$89)","v":0},null,{"$f":"IF($D$84=0,0,(YTotExp-(YTotRet+YTotExp-$L$11-$L$12))/(YPrice/100)/(C83-$E$13*$E$7/$E$8)/($E$8/$E$7))","v":0},null,null,{"$f":"IF(F83-$M$89=0,0,(YTotExp-(YTotRet+YTotExp-$L$11-$L$12))/(F83-$M$89)*100)","v":0}]
[null,null,1,{"$f":"+L17","v":0},null,{"$f":"M88+M89","v":0},null,{"$f":"IF($D$84=0,0,(YTotExp-(YTotRet+YTotExp-$L$11-$L$12))/(YPrice/100)/(C84-$E$13*$E$7/$E$8)/($E$8/$E$7))","v":0},null,null,{"$f":"IF(F84-$M$89=0,0,(YTotExp-(YTotRet+YTotExp-$L$11-$L$12))/(F84-$M$89)*100)","v":0}]
[null,null,{"$f":"+C84+C74-C73","v":0.96999999999999986},{"$f":"+IF($C$84=0,0,$L$17-$L$11-$L$12+($L$11+$L$12)*C85/$C$84)","v":0},null,{"$f":"IF($C$84=0,0,$M$88*C85/$C$84+$M$89)","v":0},null,{"$f":"IF($D$84=0,0,(YTotExp-(YTotRet+YTotExp-$L$11-$L$12))/(YPrice/100)/(C85-$E$13*$E$7/$E$8)/($E$8/$E$7))","v":0},null,null,{"$f":"IF(F85-$M$89=0,0,(YTotExp-(YTotRet+YTotExp-$L$11-$L$12))/(F85-$M$89)*100)","v":0}]
[null,null,{"$f":"+C85+C75-C74","v":0.93999999999999984},{"$f":"+IF($C$84=0,0,$L$17-$L$11-$L$12+($L$11+$L$12)*C86/$C$84)","v":0},null,{"$f":"IF($C$84=0,0,$M$88*C86/$C$84+$M$89)","v":0},null,{"$f":"IF($D$84=0,0,(YTotExp-(YTotRet+YTotExp-$L$11-$L$12))/(YPrice/100)/(C86-$E$13*$E$7/$E$8)/($E$8/$E$7))","v":0},null,null,{"$f":"IF(F86-$M$89=0,0,(YTotExp-(YTotRet+YTotExp-$L$11-$L$12))/(F86-$M$89)*100)","v":0}]
[]
[null,null,null,{"$f":"\"Your Male \"&F8&\" Price\"","v":"Your Male Calf Price"},null,null,null,null,null,null,{"$f":"+J11","v":0},null,{"$f":"(E11*G11+E12*G12)*100","v":0}]
[null,null,null,{"$f":"\"Your Female \"&F8&\" Price\"","v":"Your Female Calf Price"},null,null,null,null,null,null,{"$f":"+J12","v":0},null,{"$f":"(E13*G13+E14*G14)*100","v":0}]
[null,null,null,{"$f":"\"Your Weighted Average \"&F8&\" Price ($/cwt)\"","v":"Your Weighted Average Calf Price ($/cwt)"},null,null,null,null,null,null,{"$f":"+IF((E11*G11+E12*G12)=0,0,(L11+L12)/(E11*G11+E12*G12))","v":0}]
[]
["  Developed by Jason Johnson, Associate Professor and Extension Economist, Texas A&M AgriLife Extension, 254-968-4144.  "]
[]
["Information presented is prepared solely as a general guide and not intended to recognize or predict the costs and returns from any one operation.  Brand names are mentioned only as examples and imply no endorsement."]

{"sheet":"CowCalfNative","index":18,"n_rows":94,"n_cols":14,"rows_kept":94,"cut":false,"hidden":false,"merged":[[84,7,84,8],[84,10,84,12],[85,7,85,8],[85,10,85,12],[93,0,93,13],[81,7,81,8],[81,10,81,12],[82,7,82,8],[82,10,82,12],[83,7,83,8],[83,10,83,12],[80,7,80,8],[80,10,80,12],[70,7,70,8],[70,10,70,12],[71,7,71,8],[71,10,71,12],[72,7,72,8],[72,10,72,12],[73,7,73,8],[73,10,73,12],[74,7,74,8],[74,10,74,12],[79,2,79,12],[69,7,69,8],[69,10,69,12],[0,0,0,13],[1,0,1,13],[2,0,2,13],[3,0,3,13],[68,2,68,12]]}
["Projections for Planning Purposes Only -- Not to be Used without Updating"]
["2024 Estimated Costs and Returns per Animal Unit"]
["Cow-Calf Native Pasture"]
["Enter your name for this budget in the cell above."]
["Enter  Your Values in the cells highlighed in MAROON."]
[null,null,null,null,"Your Cows"]
[null,"Animal Units (AU)",null,40,null,"Animal Unit",null,null,null,null,null,null,null,"Your"]
[null,"Breeding Females",null,40,null,"Calf","Your",null,null,null,null,null,"Enterprise","Enterprise"]
[null,null,null,null,"Your","Quantity","Quantity",null,null,"Your",null,"Your","Total","Total"]
["REVENUE",null,null,"Head","Head","Per Head","Per Head","Units","$/Unit","$/Unit","Total","Total",{"$f":"\"(\" & D7 & \" AUs)\"","v":"(40 AUs)"},{"$f":"\"(\" & E7 & \" AUs)\"","v":"( AUs)"}]
[null,"Steer",null,0.42499999999999999,null,5.5,null,"CWT",285,null,666.1875,{"$f":"+E11*G11*J11","v":0},26647.5,{"$f":"+L11*E$7","v":0}]
[null,"Heifer",null,0.3,null,5.25,null,"CWT",270,null,425.25,{"$f":"+E12*G12*J12","v":0},17010,{"$f":"+L12*E$7","v":0}]
[null,"Cull Cow",null,0.1,null,9,null,"CWT",95,null,85.5,0,3420,0]
[null,"Cull Bull",null,0.01,null,16,null,"CWT",120,null,19.2,0,768,0]
[null,null,null,0,null,0,null,null,0,null,0,0,0,0]
[null,null,null,0,null,0,null,null,0,null,0,0,0,0]
["Total Revenue",null,null,null,null,391.24999999999994,null,null,null,null,1196.1375,{"$f":"+SUM(L11:L16)","v":0},47845.5,{"$f":"+SUM(N11:N16)","v":0}]
[null,null,null,null,null,497.25]
[null,null,null,null,null,106.00000000000006,null,null,null,null,null,null,"Enterprise","Enterprise"]
["VARIABLE COSTS",null,null,null,null,"Quantity","Quantity","Units","$/Unit","$/Unit","Total","Total","Total","Total"]
["Production Costs"]
[null,"Miscellaneous"]
[null,null,null,null,null,1,null,null,0,null,0,{"$f":"+J23*G23","v":0},0,{"$f":"+L23*E$7","v":0}]
[null,null,null,null,null,1,null,null,0,null,0,0,0,0]
[null,"Marketing Expense",null,null,null,1,null,"AU",15,null,15,0,600,0]
[null,"Feed"]
[null,null,"Salt & Mineral - Cow",null,null,50,null,"Pound",0.65,null,32.5,{"$f":"+J27*G27","v":0},1300,{"$f":"+L27*E$7","v":0}]
[null,null,"Supplement - Cow",null,null,800,null,"Pound",0.25,null,200,0,8000,0]
[null,null,"Bermuda Hay",null,null,3,null,"Roll",120,null,360,0,14400,0]
[null,null,null,null,null,0,null,null,0,null,0,0,0,0]
[null,null,null,null,null,0,null,null,0,null,0,0,0,0]
[null,null,null,null,null,0,null,null,0,null,0,0,0,0]
[null,"Vet. Medicine"]
[null,null,"Vet. Medicine - Cow",null,null,1,null,"Head",15,null,15,0,600,{"$f":"+L34*E$7","v":0}]
[null,null,null,null,null,0,null,null,0,null,0,0,0,0]
[null,null,null,null,null,0,null,null,0,null,0,0,0,0]
[null,null,null,null,null,0,null,null,0,null,0,0,0,0]
[null,"Fuel",null,null,null,1,null,"AU",20.562000000000001,null,20.562000000000001,0,822.48,0]
[null,"Lube (As a % of fuel)",null,null,null,0.1,null,"Percent",20.562000000000001,null,2.0562,0,82.248000000000005,0]
[null,"Repairs ",null,null,null,1,null,"AU",5.9600484375000002,null,5.9600484375000002,0,238.4019375,0]
[null,"Labor",null,null,null,8.5079999999999991,null,"Hours",5.1863046544428775,null,44.125079999999997,0,1765.0031999999999,0]
[null,"Utilities",null,null,null,1,null,"AU",0,null,0,0,0,0]
[null,null,null,null,null,null,null,null,null,null,0,{"$f":"+J43*G43","v":0},0,0]
[null,"Purchase Breeding Female",null,null,null,1,null,null,0,null,0,{"$f":"+J44*G44","v":0},0,0]
[null,"Purchase Breeding Male",null,null,null,1,null,null,0,null,0,0,0,0]
[null,"Purchase Older Repalcement Female",null,null,null,1,null,null,0,null,0,0,0,0]
[null,"Purchase Younger Repalcement Female",null,null,null,1,null,null,0,null,0,0,0,0]
[null,"Interest on Credit Line",null,null,null,null,null,null,0.08,null,61.516657113390416,{"$f":"+SUM(L21:L47)/2*J48","v":0},2460.6662845356168,0]
["Total Variable Costs",null,null,null,null,null,null,null,null,null,756.71998555089044,{"$f":"+SUM(L23:L48)","v":0},30268.799422035612,{"$f":"+SUM(N23:N48)","v":0}]
[]
["Planned Returns Above Variable Costs:",null,null,null,null,null,null,null,null,null,439.4175144491096,{"$f":"+L17-L49","v":0},17576.700577964388,{"$f":"+N17-N49","v":0}]
[null,"Average Calf Breakeven Price to Cover Variable Costs",null,null,null,null,null,null,166.65047554016368,{"$f":"IF((E11*G11+E12*G12)=0,\"n/a\",(L49-SUM(L13:L16))/(E11*G11+E12*G12))","v":"n/a"},"CWT"]
[null,null,null,null,null,null,null,null,null,null,null,null,"Enterprise","Enterprise"]
["FIXED COSTS",null,null,null,null,"Quantity","Quantity","Units","$/Unit","$/Unit","Total","Total","Total","Total"]
[null,"Depreciation - Equipment",null,null,null,1,null,"AU",41.885925781250009,null,41.885925781250009,{"$f":"+G55*J55","v":0},1675.4370312500005,{"$f":"+L55*E$7","v":0}]
[null,"Depreciation - Livestock",null,null,null,1,null,"AU",14.983333333333334,null,14.983333333333334,0,599.33333333333337,0]
[null,"Equipment Investment",null,null,null,1027.0899343750002,null,"dollars",0.08,null,82.167194750000021,0,3286.6877900000009,0]
[null,"Insurance",null,null,null,1,null,"AU",0,null,0,0,0,0]
[null,"Management Fee, Owner/Operator Labor",null,null,null,1,null,"AU",0,null,0,{"$f":"+J59*G59","v":0},0,0]
[null,"Salaried Labor",null,null,null,1,null,"AU",0,null,0,{"$f":"+J60*G60","v":0},0,0]
[null,"Pasture Cost",null,null,null,25,null,"Acres",12,null,300,0,12000,0]
[null,null,null,null,null,null,null,null,null,null,0,0,0,0]
[null,null,null,null,null,null,null,null,null,null,0,0,0,0]
["Total Fixed Costs",null,null,null,null,null,null,null,null,null,439.03645386458334,{"$f":"+SUM(L55:L61)","v":0},17561.458154583335,{"$f":"+SUM(N55:N61)","v":0}]
["Total Costs",null,null,null,null,null,null,null,null,null,1195.7564394154738,{"$f":"+L49+L64","v":0},47830.257576618947,{"$f":"+N49+N64","v":0}]
["Planned Returns to Management, Risk, and Profit:",null,null,null,null,null,null,null,null,null,0.38106058452626712,{"$f":"+L17-L65","v":0},15.242423381052504,{"$f":"+N17-N65","v":0}]
[null,"Average Calf Breakeven Price to Cover Total Costs",null,null,null,null,null,null,278.86426566529684,{"$f":"IF((E11*G11+E12*G12)=0,\"n/a\",(L65-SUM(L13:L16))/(E11*G11+E12*G12))","v":"n/a"},"CWT"]
[]
[null,null,"Sensitivity Analysis for Example"]
[null,null,"Example Weaning Percent","Example Gross Sales per Animal Unit",null,"Pounds Produced per Animal Unit",null,"Example Breakeven Calf Pay Weight to Cover Total Cost",null,null,"Example Average Breakeven Price to Cover Total Cost"]
[null,null,0.91,1273.1801470588236,null,524.86764705882354,null,482.85604984513037,null,null,260.47761078626627]
[null,null,0.88,1234.6588235294118,null,511.05882352941177,null,501.42743637763539,null,null,269.35752933579806]
[null,null,0.85,1196.1375,null,497.25,null,521.48453383274079,null,null,278.86426566529684]
[null,null,0.82,1157.6161764705882,null,483.44117647058823,null,543.21305607577176,null,null,289.06661684817357]
[null,null,0.78999999999999992,1119.0948529411764,null,469.63235294117646,null,566.83101503558794,null,null,300.04383014620549]
[]
[null,null,null,{"$f":"\"Example Male \"&F8&\" Price\"","v":"Example Male Calf Price"},null,null,null,null,null,null,{"$f":"+I11","v":285}]
[null,null,null,{"$f":"\"Example Female \"&F8&\" Price\"","v":"Example Female Calf Price"},null,null,null,null,null,null,{"$f":"+I12","v":270}]
[null,null,null,{"$f":"\"Example Weighted Average \"&F8&\" Price ($/cwt)\"","v":"Example Weighted Average Calf Price ($/cwt)"},null,null,null,null,null,null,{"$f":"+(K11+K12)/(D11*F11+D12*F12)","v":278.96166134185307}]
[null,null,"Sensitivity Analysis for Your Values"]
[null,null,"Your Weaning Percent",{"$f":"\"Your Gross Sales per \"&F7","v":"Your Gross Sales per Animal Unit"},null,{"$f":"\"Pounds Produced per \"&F7","v":"Pounds Produced per Animal Unit"},null,{"$f":"\"Your Breakeven \"&F8&\" Pay Weight to Cover Total Cost\"","v":"Your Breakeven Calf Pay Weight to Cover Total Cost"},null,null,"Your Average Breakeven Price to Cover Total Cost"]
[null,null,{"$f":"+C83+C71-C72","v":1.06},{"$f":"+IF($C$84=0,0,$L$17-$L$11-$L$12+($L$11+$L$12)*C82/$C$84)","v":0},null,{"$f":"IF($C$84=0,0,$M$88*C82/$C$84+$M$89)","v":0},null,{"$f":"IF($D$84=0,0,(YTotExp-(YTotRet+YTotExp-$L$11-$L$12))/(YPrice/100)/(C82-$E$13*$E$7/$E$8)/($E$8/$E$7))","v":0},null,null,{"$f":"IF(F82-$M$89=0,0,(YTotExp-(YTotRet+YTotExp-$L$11-$L$12))/(F82-$M$89)*100)","v":0}]
[null,null,{"$f":"+C84+C72-C73","v":1.0299999999999998},{"$f":"+IF($C$84=0,0,$L$17-$L$11-$L$12+($L$11+$L$12)*C83/$C$84)","v":0},null,{"$f":"IF($C$84=0,0,$M$88*C83/$C$84+$M$89)","v":0},null,{"$f":"IF($D$84=0,0,(YTotExp-(YTotRet+YTotExp-$L$11-$L$12))/(YPrice/100)/(C83-$E$13*$E$7/$E$8)/($E$8/$E$7))","v":0},null,null,{"$f":"IF(F83-$M$89=0,0,(YTotExp-(YTotRet+YTotExp-$L$11-$L$12))/(F83-$M$89)*100)","v":0}]
[null,null,1,{"$f":"+L17","v":0},null,{"$f":"M88+M89","v":0},null,{"$f":"IF($D$84=0,0,(YTotExp-(YTotRet+YTotExp-$L$11-$L$12))/(YPrice/100)/(C84-$E$13*$E$7/$E$8)/($E$8/$E$7))","v":0},null,null,{"$f":"IF(F84-$M$89=0,0,(YTotExp-(YTotRet+YTotExp-$L$11-$L$12))/(F84-$M$89)*100)","v":0}]
[null,null,{"$f":"+C84+C74-C73","v":0.96999999999999986},{"$f":"+IF($C$84=0,0,$L$17-$L$11-$L$12+($L$11+$L$12)*C85/$C$84)","v":0},null,{"$f":"IF($C$84=0,0,$M$88*C85/$C$84+$M$89)","v":0},null,{"$f":"IF($D$84=0,0,(YTotExp-(YTotRet+YTotExp-$L$11-$L$12))/(YPrice/100)/(C85-$E$13*$E$7/$E$8)/($E$8/$E$7))","v":0},null,null,{"$f":"IF(F85-$M$89=0,0,(YTotExp-(YTotRet+YTotExp-$L$11-$L$12))/(F85-$M$89)*100)","v":0}]
[null,null,{"$f":"+C85+C75-C74","v":0.93999999999999984},{"$f":"+IF($C$84=0,0,$L$17-$L$11-$L$12+($L$11+$L$12)*C86/$C$84)","v":0},null,{"$f":"IF($C$84=0,0,$M$88*C86/$C$84+$M$89)","v":0},null,{"$f":"IF($D$84=0,0,(YTotExp-(YTotRet+YTotExp-$L$11-$L$12))/(YPrice/100)/(C86-$E$13*$E$7/$E$8)/($E$8/$E$7))","v":0},null,null,{"$f":"IF(F86-$M$89=0,0,(YTotExp-(YTotRet+YTotExp-$L$11-$L$12))/(F86-$M$89)*100)","v":0}]
[]
[null,null,null,{"$f":"\"Your Male \"&F8&\" Price\"","v":"Your Male Calf Price"},null,null,null,null,null,null,{"$f":"+J11","v":0},null,{"$f":"(E11*G11+E12*G12)*100","v":0}]
[null,null,null,{"$f":"\"Your Female \"&F8&\" Price\"","v":"Your Female Calf Price"},null,null,null,null,null,null,{"$f":"+J12","v":0},null,{"$f":"(E13*G13+E14*G14)*100","v":0}]
[null,null,null,{"$f":"\"Your Weighted Average \"&F8&\" Price ($/cwt)\"","v":"Your Weighted Average Calf Price ($/cwt)"},null,null,null,null,null,null,{"$f":"+IF((E11*G11+E12*G12)=0,0,(L11+L12)/(E11*G11+E12*G12))","v":0}]
[]
["  Developed by Jason Johnson, Associate Professor and Extension Economist, Texas A&M AgriLife Extension, 254-968-4144.  "]
[]
["Information presented is prepared solely as a general guide and not intended to recognize or predict the costs and returns from any one operation.  Brand names are mentioned only as examples and imply no endorsement."]

{"sheet":"StockersNative","index":19,"n_rows":98,"n_cols":14,"rows_kept":98,"cut":false,"hidden":false,"merged":[[85,2,85,7],[86,2,87,2],[86,5,86,7],[97,0,97,13],[0,0,0,13],[1,0,1,13],[2,0,2,13],[3,0,3,13],[72,2,72,7],[73,2,74,2],[73,5,73,7]]}
["Projections for Planning Purposes Only -- Not to be Used without Updating"]
["2024 Estimated Costs and Returns per Animal"]
["Stockers on Native Pasture"]
["Enter your name for this budget in the cell above."]
["Enter  Your Values in the cells highlighed in MAROON.",null,null,null,null,null,null,null,null,null,null,null,"Stocker"]
[null,null,null,null,"Your Head",null,null,null,null,null,null,null,null,"Your"]
[null,"Number of Head",null,320,null,null,"Your",null,null,null,null,null,"Enterprise","Enterprise"]
[null,null,null,null,"Your","Pay Weight","Weight",null,null,"Your",null,"Your","Total","Total"]
["REVENUE",null,null,"Head","Head","or Amount","or Amount","Units","$/Unit","$/Unit","Total","Total",{"$f":"\"(\" & D7 & \" Head)\"","v":"(320 Head)"},{"$f":"\"(\" & E7 & \" Head)\"","v":"( Head)"}]
[]
[null,"Stocker",null,0.98000000000000009,null,7.4999999999999991,null,"CWT",2.5,null,18.375,{"$f":"+J11*G11*E11","v":0},5880,{"$f":"+L11*E$7","v":0}]
[null,null,null,0.98000000000000009,null,0,null,null,0,null,0,0,0,0]
[null,null,null,0.98000000000000009,null,0,null,null,0,null,0,0,0,0]
["Total Revenue",null,null,null,null,null,null,null,null,null,18.375,{"$f":"+L11","v":0},5880,0]
[null,null,null,null,null,null,null,null,null,null,null,null,"Enterprise","Enterprise"]
["VARIABLE COSTS",null,null,null,null,"Quantity","Quantity","Units","$/Unit","$/Unit","Total","Total","Total","Total"]
["Production Costs"]
[null,"Stocker Purchase",null,null,null,4,null,"CWT",3.1,null,12.4,{"$f":"+J18*G18","v":0},3968,{"$f":"+L18*E$7","v":0}]
[null,"Stocker Delivery",null,null,null,1,null,"Head",0,null,0,{"$f":"+J19*G19","v":0},0,{"$f":"+L19*E$7","v":0}]
[null,"Grazing"]
[null,null,"Acre Lease",null,null,5,null,"Acre",12,null,60,0,19200,{"$f":"+L21*E$7","v":0}]
[null,null,"Grazing by Month",null,null,0,null,"Month",0,null,0,0,0,0]
[null,null,"Gain Contract",null,null,0,null,"Pounds",0,null,0,0,0,0]
[null,null,"On Weight Per Month",null,null,0,null,"Month",0,null,0,{"$f":"+G24*J24*G18","v":0},0,0]
[null,"Health"]
[null,null,"Vet. Medicine - Stocker",null,null,1,null,"Head",15,null,15,{"$f":"+J26*G26","v":0},4800,{"$f":"+L26*E$7","v":0}]
[null,null,null,null,null,0,null,null,0,null,0,0,0,0]
[null,null,null,null,null,0,null,null,0,null,0,0,0,0]
[null,null,null,null,null,0,null,null,0,null,0,0,0,0]
[null,"Feed"]
[null,null,"Bermuda Hay Bale",null,null,4,null,"Bale",14,null,56,0,17920,0]
[null,null,"Mineral - Stocker",null,null,0.26300000000000001,null,"CWT",30,null,7.8900000000000006,0,2524.8000000000002,0]
[null,null,"Supplement - Stocker",null,null,1.5,null,"CWT",25,null,37.5,0,12000,0]
[null,null,null,null,null,0,null,null,0,null,0,0,0,0]
[null,null,null,null,null,0,null,null,0,null,0,0,0,0]
[null,null,null,null,null,0,null,null,0,null,0,0,0,0]
[null,"Miscellaneous"]
[null,null,"Miscellaneous",null,null,1,null,"Head",4,null,4,{"$f":"+J38*G38","v":0},1280,{"$f":"+L38*E$7","v":0}]
[null,null,null,null,null,1,null,null,0,null,0,0,0,0]
[null,null,null,null,null,1,null,null,0,null,0,0,0,0]
[null,"Fuel",null,null,null,1,null,"Head",4.8156249999999998,null,4.8156249999999998,0,1541,0]
[null,"Lube (As a % of fuel)",null,null,null,0.1,null,"Percent",4.8156249999999998,null,0.4815625,0,154.1,0]
[null,"Utilities",null,null,null,1,null,"Head",0,null,0,0,0,0]
[null,"Repairs ",null,null,null,1,null,"Head",0.96,null,0.96,0,307.2,0]
[null,"Marketing",null,null,null,0.98000000000000009,null,"Head",14.6,null,14.308000000000002,0,4578.5600000000004,0]
[null,"Labor",null,null,null,1,null,"Head",15.83212,null,15.83212,0,5066.2784000000001,0]
[null,null,null,null,null,null,null,null,null,null,0,{"$f":"+J47*G47","v":0},0,{"$f":"+L47*E$7","v":0}]
[null,null,null,null,null,null,null,null,null,null,0,{"$f":"+J48*G48","v":0},0,{"$f":"+L48*E$7","v":0}]
[null,"Interest on Credit Line",null,null,null,null,null,null,0.08,null,5.7411079210958906,{"$f":"+SUM(L18:L46)*J49/2","v":0},1837.1545347506849,0]
["Total Variable Costs",null,null,null,null,null,null,null,null,null,234.92841542109593,{"$f":"+SUM(L18:L49)","v":0},75177.09293475069,{"$f":"+SUM(N18:N49)","v":0}]
[]
["Planned Returns Above Variable Costs:",null,null,null,null,null,null,null,null,null,-216.55341542109593,{"$f":"+L14-L50","v":0},-69297.09293475069,{"$f":"+N14-N50","v":0}]
[]
[null,"Breakeven Price to Cover Variable Costs",null,null,null,null,null,null,31.963049717155911,{"$f":"+IF(G11=0,\"n/a\",(L50-SUM(L12:L13))/(G11*E11))","v":"n/a"},"CWT"]
[null,null,null,null,null,null,null,null,null,null,null,null,"Enterprise","Enterprise"]
["FIXED COSTS",null,null,null,null,"Quantity","Quantity","Units","$/Unit","$/Unit","Total","Total","Total","Total"]
[]
[null,"Depreciation",null,null,null,1,null,"Head",15.502857142857142,null,15.502857142857142,{"$f":"+J58*G58","v":0},4960.9142857142851,{"$f":"+L58*E$7","v":0}]
[null,"Equipment Investment",null,null,null,258.00625000000002,null,"dollars",0.08,null,20.640500000000003,0,6604.9600000000009,0]
[null,"Salaried Labor",null,null,null,1,null,"Head",0,null,0,0,0,0]
[null,"Management Fee, Owner/Operator Labor",null,null,null,1,null,"Head",0,null,0,0,0,0]
[null,"Insurance",null,null,null,1,null,"Head",0,null,0,0,0,0]
[null,null,null,null,null,null,null,null,null,null,0,0,0,0]
[null,null,null,null,null,null,null,null,null,null,0,0,0,0]
["Total Fixed Costs",null,null,null,null,null,null,null,null,null,36.143357142857141,{"$f":"+SUM(L58:L62)","v":0},11565.874285714286,{"$f":"+SUM(N58:N62)","v":0}]
[]
["Total Costs",null,null,null,null,null,null,null,null,null,271.07177256395306,{"$f":"+L50+L65","v":0},86742.967220464983,{"$f":"+N50+N65","v":0}]
[]
["Planned Returns to Management, Risk, and Profit:",null,null,null,null,null,null,null,null,null,-252.69677256395306,{"$f":"+L52-L65","v":0},-80862.967220464983,{"$f":"+N52-N65","v":0}]
[]
["    Breakeven Price to Cover Total Costs",null,null,null,null,null,null,null,36.880513274007221,{"$f":"+IF(G11=0,\"n/a\",(L67-SUM(L12:L13))/(G11*E11))","v":"n/a"},"CWT"]
[]
[null,null,"Example Breakeven Sensitivity Analysis"]
[null,null,null,null,null,"Purchase Weight (Lbs/Hd): 400",null,"Sales Price/Cwt of $Total"]
[null,null,null,null,null,"Sales Price/Cwt  2.50",null,"Purchase Price/Cwt  3.10"]
[null,null,"ADG (Lbs/day)","Net Pay Weight with Shrink",null,"Breakeven Purchase Price ($/CWT)",null,"Breakeven Sales Price ($/CWT)"]
[null,null,3.2950819672131146,802,null,-59.755693140988278,null,34.489258049258623]
[null,null,3.0204918032786887,768.5,null,-59.960880640988265,null,35.992693500982966]
[null,null,2.7459016393442623,749.99999999999989,null,-60.074193140988271,null,36.880513274007221]
[null,null,2.471311475409836,701.5,null,-60.371255640988267,null,39.430342060592174]
[null,null,2.1967213114754101,668,null,-60.576443140988282,null,41.407761909439238]
[null,null,"Your Average Daily Gain",null,0,"Pounds per Day"]
[null,null,{"$f":"+\"Your Animal\"&IF(M5=\"Stocker\",\" Grazing\",\" Feeding\")&\" Days\"","v":"Your Animal Grazing Days"},null,0,"Days"]
[null,null,"Your Sale Shrink",null,0]
[]
[null,null,"Your Breakeven Sensitivity Analysis"]
[null,null,null,null,null,{"$f":"+\"Purchase Weight (Lbs/Hd): \"&G18*100","v":"Purchase Weight (Lbs/Hd): 0"},null,"Sales Price/Cwt of $Total"]
[null,null,null,null,null,{"$f":"\"Sales Price/Cwt  \"&IF(J11=\"\",\".00\",TEXT(J11,\"#.00\"))","v":"Sales Price/Cwt  .00"},null,{"$f":"\"Purchase Price/Cwt  \"&IF(J18=\"\",\".00\",TEXT(J18,\"#.00\"))","v":"Purchase Price/Cwt  .00"}]
[null,null,"ADG (Lbs/day)","Net Pay Weight with Shrink",null,"Breakeven Purchase Price ($/CWT)",null,"Breakeven Sales Price ($/CWT)"]
[null,null,{"$f":"+C92*1.2","v":0},{"$f":"+C90*$E$83+$G$18*100*(1-$E$84)","v":0},null,{"$f":"IF($G$18=0,0,(((D90*$J$11/100*$E$11)-($L$67-SUM($J$12:$J$13)-$L$18))/(100*$G$18))*100)","v":0},null,{"$f":"IF($E$11=0,0,($L$67-SUM($J$12:$J$13))/(D90*$E$11/100))","v":0}]
[null,null,{"$f":"+C92*1.1","v":0},{"$f":"+C91*$E$83+$G$18*100*(1-$E$84)","v":0},null,{"$f":"IF($G$18=0,0,(((D91*$J$11/100*$E$11)-($L$67-SUM($J$12:$J$13)-$L$18))/(100*$G$18))*100)","v":0},null,{"$f":"IF($E$11=0,0,($L$67-SUM($J$12:$J$13))/(D91*$E$11/100))","v":0}]
[null,null,{"$f":"+E82","v":0},{"$f":"+C92*$E$83+$G$18*100*(1-$E$84)","v":0},null,{"$f":"IF($G$18=0,0,(((D92*$J$11/100*$E$11)-($L$67-SUM($J$12:$J$13)-$L$18))/(100*$G$18))*100)","v":0},null,{"$f":"IF($E$11=0,0,($L$67-SUM($J$12:$J$13))/(D92*$E$11/100))","v":0}]
[null,null,{"$f":"+C92*0.9","v":0},{"$f":"+C93*$E$83+$G$18*100*(1-$E$84)","v":0},null,{"$f":"IF($G$18=0,0,(((D93*$J$11/100*$E$11)-($L$67-SUM($J$12:$J$13)-$L$18))/(100*$G$18))*100)","v":0},null,{"$f":"IF($E$11=0,0,($L$67-SUM($J$12:$J$13))/(D93*$E$11/100))","v":0}]
[null,null,{"$f":"+C92*0.8","v":0},{"$f":"+C94*$E$83+$G$18*100*(1-$E$84)","v":0},null,{"$f":"IF($G$18=0,0,(((D94*$J$11/100*$E$11)-($L$67-SUM($J$12:$J$13)-$L$18))/(100*$G$18))*100)","v":0},null,{"$f":"IF($E$11=0,0,($L$67-SUM($J$12:$J$13))/(D94*$E$11/100))","v":0}]
[]
["  Developed by Jason Johnson, Associate Professor and Extension Economist, Texas A&M AgriLife Extension, 254-968-4144.  "]
[]
["Information presented is prepared solely as a general guide and not intended to recognize or predict the costs and returns from any one operation.  Brand names are mentioned only as examples and imply no endorsement."]

{"sheet":"Livestock Budget","index":20,"n_rows":116,"n_cols":8,"rows_kept":116,"cut":false,"hidden":false,"merged":[[98,4,98,5],[98,6,98,7],[104,2,104,7],[108,2,110,2],[108,3,110,3],[108,4,110,4],[108,5,108,7],[95,4,95,5],[95,6,95,7],[96,4,96,5],[96,6,96,7],[97,4,97,5],[97,6,97,7],[94,4,94,5],[94,6,94,7],[0,0,0,6],[2,0,2,6],[92,1,92,7],[93,4,93,5],[93,6,93,7]]}
["Estimated Costs and Returns per Animal or Breeding Female"]
[]
["Livestock Budget"]
[]
["Number of Head of Livestock",null,null,0]
[]
["Enter Your Values in the cells highlighed in MAROON.",null,null,null,null,null,null,"Enterprise"]
["REVENUE",null,"Head","Quantity","Units","$/Unit","Total","Total"]
[null,"Males Sold",0,0,"CWT",0,{"$f":"IF($D$5=0,0,C9/$D$5*D9*F9)","v":0},{"$f":"+G9*$D$5","v":0}]
[null,"Females Sold",0,0,"CWT",0,{"$f":"IF($D$5=0,0,C10/$D$5*D10*F10)","v":0},{"$f":"+G10*$D$5","v":0}]
[null,"Cull Breeding Females",0,0,"CWT",0,0,0]
[null,"Cull Breeding Males",0,0,"CWT",0,0,0]
[null,"Stocker or Feed Animal",0,0,"CWT",0,0,0]
[null,"Other Revenue",0,0,"CWT",0,0,0]
[null,"Other Revenue",0,0,"CWT",0,0,0]
[null,"Other Revenue",0,0,"CWT",0,0,0]
[]
["Total Revenue",null,null,null,null,null,{"$f":"+SUM(G9:G17)","v":0},{"$f":"+SUM(H9:H17)","v":0}]
[]
[null,null,null,null,null,null,null,"Enterprise"]
["VARIABLE COSTS",null,null,"Quantity","Units","$/Unit","Total","Total"]
["Production Costs"]
[null,"Animal Purchase Price, if applicable",null,0,"Cwt",0,{"$f":"D23*F23","v":0},{"$f":"+G23*$D$5","v":0}]
[null,"Pasture",{"$f":"+SUM(G25:G28)","v":0}]
[null,null,"Pasture 1",0,"Acre",0,{"$f":"D25*F25","v":0},{"$f":"+G25*$D$5","v":0}]
[null,null,"Pasture 2",0,"Acre",0,0,0]
[null,null,"Pasture 3",0,"Acre",0,0,0]
[null,null,"Pasture 4",0,"Acre",0,0,0]
[null,"Feed",{"$f":"SUM(G30:G37)","v":0}]
[null,null,"Hay",0,"Bales",0,{"$f":"D30*F30","v":0},{"$f":"+G30*$D$5","v":0}]
[null,null,"Supplement",0,"Cwt,lb,etc",0,{"$f":"D31*F31","v":0},{"$f":"+G31*$D$5","v":0}]
[null,null,"Salt Minerals",0,"Cwt",0,0,0]
[null,null,"Other Feed",0,"Cwt,lb,etc",0,0,0]
[null,null,"Other Feed",0,"Cwt,lb,etc",0,0,0]
[null,null,"Other Feed",0,"Cwt,lb,etc",0,0,0]
[null,null,"Other Feed",0,"Cwt,lb,etc",0,0,0]
[null,null,"Other Feed",0,"Cwt,lb,etc",0,0,0]
[null,"Health",{"$f":"SUM(G39:G48)","v":0}]
[null,null,"Vet/Medicine 1",0,"Visit,dose,cc's, etc.",0,{"$f":"D39*F39","v":0},{"$f":"+G39*$D$5","v":0}]
[null,null,"Vet/Medicine 2",0,"Visit,dose,cc's, etc.",0,0,0]
[null,null,"Vet/Medicine 3",0,"Visit,dose,cc's, etc.",0,0,0]
[null,null,"Vet/Medicine 4",0,"Visit,dose,cc's, etc.",0,0,0]
[null,null,"Vet/Medicine 5",0,"Visit,dose,cc's, etc.",0,0,0]
[null,null,"Vet/Medicine 6",0,"Visit,dose,cc's, etc.",0,0,0]
[null,null,"Vet/Medicine 7",0,"Visit,dose,cc's, etc.",0,0,0]
[null,null,"Vet/Medicine 8",0,"Visit,dose,cc's, etc.",0,0,0]
[null,null,"Vet/Medicine 9",0,"Visit,dose,cc's, etc.",0,0,0]
[null,null,"Vet/Medicine 10",0,"Visit,dose,cc's, etc.",0,0,0]
[]
[null,"Fuel, Lube, Repair",null,1,"Head",0,0,0]
[]
[null,"Labor",null,0,"Hours",0,0,0]
[]
[null,"Other Variable Expense",null,0,"Cwt,lb,etc",0,0,0]
[null,"Other Variable Expense",null,0,"Cwt,lb,etc",0,0,0]
[null,"Other Variable Expense",null,0,"Cwt,lb,etc",0,0,0]
[null,"Other Variable Expense",null,0,"Cwt,lb,etc",0,0,0]
[null,"Other Variable Expense",null,0,"Cwt,lb,etc",0,0,0]
[null,"Other Variable Expense",null,0,"Cwt,lb,etc",0,0,0]
[]
[null,"Operating Interest",null,null,null,0,{"$f":"+SUM(G23:G59)/2*F61","v":0},0]
[]
["Total Variable Costs",null,null,null,null,null,{"$f":"+SUM(G23:G62)","v":0},{"$f":"+SUM(H23:H62)","v":0}]
[]
["Planned Returns Above Variable Costs",null,null,null,null,null,{"$f":"+G18-G63","v":0},{"$f":"+H18-H63","v":0}]
[]
[null,"Breakeven Price to Cover Variable Costs",null,null,{"$f":"IF((H101/100+C13*D13)=0,0,(G63-SUM(G11:G12,G14:G16))/(H101/100+C13/D5*D13))","v":0},{"$f":"+E9","v":"CWT"}]
[]
[null,null,null,null,null,null,null,"Enterprise"]
["FIXED COSTS",null,null,"Quantity","Units","$/Unit","Total","Total"]
[null,"Depreciation - Equipment",null,0,"Head,$,etc",0,{"$f":"D71*F71","v":0},{"$f":"+G71*$D$5","v":0}]
[null,"Depreciation - Livestock",null,0,"Head,$,etc",0,{"$f":"D72*F72","v":0},0]
[null,"Equipment Investment",null,0,"Head,$,etc",0,0,0]
[null,"Insurance",null,0,"Head,$,etc",0,0,0]
[null,"Management Fee",null,0,"Head,$,etc",0,0,0]
[null,"Owner/Operator Labor",null,0,"Head,$,etc",0,0,0]
[null,"Salaried Labor",null,0,"Head,$,etc",0,0,0]
[null,"Other Fixed Expense",null,0,"Head,$,etc",0,0,0]
[null,"Other Fixed Expense",null,0,"Head,$,etc",0,0,0]
[null,"Other Fixed Expense",null,0,"Head,$,etc",0,0,0]
[null,"Other Fixed Expense",null,0,"Head,$,etc",0,0,0]
[null,"Other Fixed Expense",null,0,"Head,$,etc",0,0,0]
[]
[null,null,null,"Total Fixed Costs",null,null,{"$f":"+SUM(G71:G83)","v":0},{"$f":"+SUM(H71:H83)","v":0}]
[]
[null,null,null,"Total Specified Costs",null,null,{"$f":"+G63+G84","v":0},{"$f":"+H63+H84","v":0}]
[]
[null,null,null,"Returns Above Specifiied Costs",null,null,{"$f":"+G18-G86","v":0},{"$f":"+H18-H86","v":0}]
[]
[null,"Breakeven Price to Cover Total Costs",null,null,{"$f":"IF((H101/100+C13*D13)=0,0,(G86-SUM(G11:G12,G14:G16))/(H101/100+C13/D5*D13))","v":0},{"$f":"+F67","v":"CWT"}]
[]
[]
[null,"Sensitivity Analysis for Your Breeding Herd or Flock Values"]
[null,"Your Weaning Percent","Your Gross Sales per Head","Pounds Produced per Head",{"$f":"\"Your Breakeven Pay Weight to Cover Total Cost\"","v":"Your Breakeven Pay Weight to Cover Total Cost"},null,"Your Average Breakeven Price to Cover Total Cost"]
[null,{"$f":"+B96-0.03","v":-0.06},{"$f":"+IF($B$97=0,0,YTotRet-$G$9-$G$10+($G$9+$G$10)*B95/$B$97)","v":0},{"$f":"IF($B$97=0,0,$H$101*B95/$B$97+$H$102)","v":0},{"$f":"IF($C$97=0,0,(YTotExp-($G$18-$G$9-$G$10))/(YPrice/100)/(B95-$C$11/$D$5))","v":0},null,{"$f":"IF(D95-$H$102=0,0,(YTotExp-($G$18-$G$9-$G$10))/(D95-$H$102)*100)","v":0}]
[null,{"$f":"+B97-0.03","v":-0.03},{"$f":"+IF($B$97=0,0,YTotRet-$G$9-$G$10+($G$9+$G$10)*B96/$B$97)","v":0},{"$f":"IF($B$97=0,0,$H$101*B96/$B$97+$H$102)","v":0},{"$f":"IF($C$97=0,0,(YTotExp-($G$18-$G$9-$G$10))/(YPrice/100)/(B96-$C$11/$D$5))","v":0},null,{"$f":"IF(D96-$H$102=0,0,(YTotExp-($G$18-$G$9-$G$10))/(D96-$H$102)*100)","v":0}]
[null,0,{"$f":"+G18","v":0},{"$f":"H101+H102","v":0},{"$f":"IF($C$97=0,0,(YTotExp-($G$18-$G$9-$G$10))/(YPrice/100)/(B97-$C$11/$D$5))","v":0},null,{"$f":"IF(D97-$H$102=0,0,(YTotExp-($G$18-$G$9-$G$10))/(D97-$H$102)*100)","v":0}]
[null,{"$f":"+B97+0.03","v":0.03},{"$f":"+IF($B$97=0,0,YTotRet-$G$9-$G$10+($G$9+$G$10)*B98/$B$97)","v":0},{"$f":"IF($B$97=0,0,$H$101*B98/$B$97+$H$102)","v":0},{"$f":"IF($C$97=0,0,(YTotExp-($G$18-$G$9-$G$10))/(YPrice/100)/(B98-$C$11/$D$5))","v":0},null,{"$f":"IF(D98-$H$102=0,0,(YTotExp-($G$18-$G$9-$G$10))/(D98-$H$102)*100)","v":0}]
[null,{"$f":"+B98+0.03","v":0.06},{"$f":"+IF($B$97=0,0,YTotRet-$G$9-$G$10+($G$9+$G$10)*B99/$B$97)","v":0},{"$f":"IF($B$97=0,0,$H$101*B99/$B$97+$H$102)","v":0},{"$f":"IF($C$97=0,0,(YTotExp-($G$18-$G$9-$G$10))/(YPrice/100)/(B99-$C$11/$D$5))","v":0},null,{"$f":"IF(D99-$H$102=0,0,(YTotExp-($G$18-$G$9-$G$10))/(D99-$H$102)*100)","v":0}]
[]
[null,null,"Your Male Price",null,null,{"$f":"+F9","v":0},null,{"$f":"IF(D5=0,0,(C9*D9+C10*D10)*100/D5)","v":0}]
[null,null,"Your Female Price",null,null,{"$f":"+F10","v":0},null,{"$f":"IF(D5=0,0,(C11*D11+C12*D12)*100/D5)","v":0}]
[null,null,"Your Weighted Average Price ($/cwt)",null,null,{"$f":"+IF((C9*D9+C10*D10)=0,F13,(G9+G10)/((C9*D9+C10*D10)/D5))","v":0}]
[]
[null,null,"Your Stocker or Feeder Breakeven Sensitivity Analysis"]
[null,null,"Your Average Daily Gain",null,0,"Pounds per Day"]
[null,null,{"$f":"+\"Your Animal\"&IF(M25=\"Stocker\",\" Grazing\",\" Feeding\")&\" Days\"","v":"Your Animal Feeding Days"},null,0,"Days"]
[null,null,"Your Sale Shrink",null,0]
[null,null,"Average Daily Gain    (Pounds/day)","Net Pay Weight with Shrink   (Pounds)",null,{"$f":"+\"Purchase Weight (Pounds/Head): \"&D23*100","v":"Purchase Weight (Pounds/Head): 0"},null,"Sales Price/Cwt of $Total"]
[null,null,null,null,null,{"$f":"\"Sales Price        \"&IF(F13=\"\",\".00\",TEXT(F13,\"#.00\"))","v":"Sales Price        .00"},null,{"$f":"\"Purchase Price        \"&IF(F23=\"\",\".00\",TEXT(F23,\"#.00\"))","v":"Purchase Price        .00"}]
[null,null,null,null,null,"Breakeven Purchase Price ($/CWT)",null,"Breakeven Sales Price ($/CWT)"]
[null,null,{"$f":"+C114*1.2","v":0},{"$f":"+(C112*$E$107+$D$23*100)*(1-$E$108)","v":0},null,{"$f":"IF($D$23=0,0,(((D112*$F$13/100*($C$13/$D$5))-($G$86-SUM($G$14:$G$16)-$G$23))/(100*$D$23))*100)","v":0},null,{"$f":"IF($C$13=0,0,($G$86-SUM($G$14:$G$16))/(D112*($C$13/$D$5)*100))","v":0}]
[null,null,{"$f":"+C114*1.1","v":0},{"$f":"+(C113*$E$107+$D$23*100)*(1-$E$108)","v":0},null,{"$f":"IF($D$23=0,0,(((D113*$F$13/100*($C$13/$D$5))-($G$86-SUM($G$14:$G$16)-$G$23))/(100*$D$23))*100)","v":0},null,{"$f":"IF($C$13=0,0,($G$86-SUM($G$14:$G$16))/(D113*($C$13/$D$5)*100))","v":0}]
[null,null,{"$f":"+E106","v":0},{"$f":"+(C114*$E$107+$D$23*100)*(1-$E$108)","v":0},null,{"$f":"IF($D$23=0,0,(((D114*$F$13/100*($C$13/$D$5))-($G$86-SUM($G$14:$G$16)-$G$23))/(100*$D$23))*100)","v":0},null,{"$f":"IF($C$13=0,0,($G$86-SUM($G$14:$G$16))/(D114*($C$13/$D$5)*100))","v":0}]
[null,null,{"$f":"+C114*0.9","v":0},{"$f":"+(C115*$E$107+$D$23*100)*(1-$E$108)","v":0},null,{"$f":"IF($D$23=0,0,(((D115*$F$13/100*($C$13/$D$5))-($G$86-SUM($G$14:$G$16)-$G$23))/(100*$D$23))*100)","v":0},null,{"$f":"IF($C$13=0,0,($G$86-SUM($G$14:$G$16))/(D115*($C$13/$D$5)*100))","v":0}]
[null,null,{"$f":"+C114*0.8","v":0},{"$f":"+(C116*$E$107+$D$23*100)*(1-$E$108)","v":0},null,{"$f":"IF($D$23=0,0,(((D116*$F$13/100*($C$13/$D$5))-($G$86-SUM($G$14:$G$16)-$G$23))/(100*$D$23))*100)","v":0},null,{"$f":"IF($C$13=0,0,($G$86-SUM($G$14:$G$16))/(D116*($C$13/$D$5)*100))","v":0}]

{"sheet":"Crop Budget","index":21,"n_rows":155,"n_cols":7,"rows_kept":155,"cut":false,"hidden":false,"merged":[[0,0,0,6],[2,0,2,5],[146,1,146,6]]}
["Estimated Costs and Returns per Acre"]
[]
["Crop Enterprise"]
[]
["Number of Acres of Crop",null,null,0]
[]
["Enter Your Values in the cells highlighed in MAROON.",null,null,null,null,null,"Enterprise"]
["REVENUE",null,"Quantity","Units","$/Unit","Total","Total"]
[null,"Primary Product",0,"Cwt,lb,etc",0,{"$f":"C9*E9","v":0},{"$f":"+F9*$D$5","v":0}]
[null,"Secondary Product",0,"Cwt,lb,etc",0,{"$f":"C10*E10","v":0},{"$f":"+F10*$D$5","v":0}]
[null,"Secondary Product",0,"Cwt,lb,etc",0,0,0]
[null,"Secondary Product",0,"Cwt,lb,etc",0,0,0]
[null,"Secondary Product",0,"Cwt,lb,etc",0,0,0]
[null,"Secondary Product",0,"Cwt,lb,etc",0,0,0]
[null,"Secondary Product",0,"Cwt,lb,etc",0,0,0]
[null,"Secondary Product",0,"Cwt,lb,etc",0,0,0]
[]
["Total Revenue",null,null,null,null,{"$f":"+SUM(F9:F16)","v":0},{"$f":"+SUM(G9:G16)","v":0}]
[]
[null,null,null,null,null,null,"Enterprise"]
["VARIABLE COSTS",null,"Quantity","Units","$/Unit","Total","Total"]
[]
["Custom Field and Harvest Operations"]
[null,"Custom Field Operation 1",0,"Acre",0,{"$f":"C24*E24","v":0},{"$f":"+F24*$D$5","v":0}]
[null,"Custom Field Operation 2",0,"Acre",0,0,0]
[null,"Custom Field Operation 3",0,"Acre",0,0,0]
[null,"Custom Field Operation 4",0,"Acre",0,0,0]
[null,"Custom Field Operation 5",0,"Acre",0,0,0]
[null,"Custom Field Operation 6",0,"Acre",0,0,0]
["Machinery Expenses"]
[null,"Diesel",0,"Gallon",0,{"$f":"C31*E31","v":0},0]
[null,"Gasoline",0,"Gallon",0,0,0]
[null,"Lube",0,"Acre",0,0,0]
[null,"Repairs",0,"Acre",0,0,0]
[null,"Other Machinery Expense 1",0,"Acre",0,0,0]
[null,"Other Machinery Expense 2",0,"Acre",0,0,0]
["Labor"]
[null,"Labor 1",0,"Hour",0,{"$f":"C38*E38","v":0},0]
[null,"Labor 2",0,"Hour",0,0,0]
[null,"Labor 3",0,"Hour",0,0,0]
[null,"Labor 4",0,"Hour",0,0,0]
[null,"Labor 5",0,"Hour",0,0,0]
[null,"Irrigation Labor",0,"Hour",0,0,0]
["Seed or Transplants"]
[null,"Seed",0,"Pound",0,{"$f":"C45*E45","v":0},0]
[null,"Seed Treatment",0,"Pound",0,0,0]
[null,"Seed Fee",0,"Pound",0,0,0]
[null,"Transplants",0,"Thousand",0,0,0]
[null,"Mulch",0,"Foot",0,0,0]
[null,"Other Seed or Transplant",0,"Pound",0,0,0]
["Fertilizer and Lime"]
[null,"Fertlizer 1",0,"Pound",0,{"$f":"C52*E52","v":0},0]
[null,"Fertlizer 2",0,"Pound",0,0,0]
[null,"Fertlizer 3",0,"Pound",0,0,0]
[null,"Fertlizer 4",0,"Pound",0,0,0]
[null,"Fertlizer 5",0,"Pound",0,0,0]
[null,"Lime",0,"Ton",0,0,0]
[null,"Other Soil Amendment 1",0,"Pound",0,0,0]
[null,"Other Soil Amendment 2",0,"Pound",0,0,0]
["Herbicides"]
[null,"Herbicide 1",0,"Lb,Oz,Acre",0,{"$f":"C61*E61","v":0},0]
[null,"Herbicide 2",0,"Lb,Oz,Acre",0,0,0]
[null,"Herbicide 3",0,"Lb,Oz,Acre",0,0,0]
[null,"Herbicide 4",0,"Lb,Oz,Acre",0,0,0]
[null,"Herbicide 5",0,"Lb,Oz,Acre",0,0,0]
[null,"Herbicide 6",0,"Lb,Oz,Acre",0,0,0]
["Insecticides"]
[null,"Insecticide 1",0,"Lb,Oz,Acre",0,{"$f":"C68*E68","v":0},0]
[null,"Insecticide 2",0,"Lb,Oz,Acre",0,0,0]
[null,"Insecticide 3",0,"Lb,Oz,Acre",0,0,0]
[null,"Insecticide 4",0,"Lb,Oz,Acre",0,0,0]
[null,"Insecticide 5",0,"Lb,Oz,Acre",0,0,0]
[null,"Insecticide 6",0,"Lb,Oz,Acre",0,0,0]
["Fungicides"]
[null,"Fungicide 1",0,"Lb,Oz,Acre",0,{"$f":"C75*E75","v":0},0]
[null,"Fungicide 2",0,"Lb,Oz,Acre",0,0,0]
[null,"Fungicide 3",0,"Lb,Oz,Acre",0,0,0]
[null,"Fungicide 4",0,"Lb,Oz,Acre",0,0,0]
[null,"Fungicide 5",0,"Lb,Oz,Acre",0,0,0]
[null,"Fungicide 6",0,"Lb,Oz,Acre",0,0,0]
["Growth Regulators"]
[null,"Growth Regulator 1",0,"Lb,Oz,Acre",0,{"$f":"C82*E82","v":0},0]
[null,"Growth Regulator 2",0,"Lb,Oz,Acre",0,0,0]
[null,"Growth Regulator 3",0,"Lb,Oz,Acre",0,0,0]
[null,"Growth Regulator 4",0,"Lb,Oz,Acre",0,0,0]
[null,"Growth Regulator 5",0,"Lb,Oz,Acre",0,0,0]
[null,"Growth Regulator 6",0,"Lb,Oz,Acre",0,0,0]
["Other Chemicals"]
[null,"Fumigant",0,"Lb,Oz,Acre",0,{"$f":"C89*E89","v":0},0]
[null,"Other Chemical 1",0,"Lb,Oz,Acre",0,0,{"$f":"+F90*$D$5","v":0}]
[null,"Other Chemical 2",0,"Lb,Oz,Acre",0,0,{"$f":"+F91*$D$5","v":0}]
[null,"Other Chemical 3",0,"Lb,Oz,Acre",0,0,{"$f":"+F92*$D$5","v":0}]
[null,"Other Chemical 4",0,"Lb,Oz,Acre",0,0,{"$f":"+F93*$D$5","v":0}]
[null,"Other Chemical 5",0,"Lb,Oz,Acre",0,0,{"$f":"+F94*$D$5","v":0}]
["Irrigation"]
[null,"Well Expense",0,"Acre",0,{"$f":"C96*E96","v":0},{"$f":"+F96*$D$5","v":0}]
[null,"Pump Fuel",0,"Mcf,kWh,Gallon",0,0,0]
[null,"Pump Expense",0,"Acre",0,0,0]
[null,"Irrigation Equipment Expense",0,"Acre",0,0,0]
[null,"Repairs",0,"Acre",0,0,0]
[null,"Drip Tape",0,"Foot,Acre",0,0,0]
[null,"Water Cost",0,"AcIn,Gallon",0,0,0]
[null,"Other Irrigation Expense 1",0,"Acre",0,0,0]
[null,"Other Irrigation Expense 2",0,"Acre",0,0,0]
["Miscellaneous Expenses"]
[null,"Crop Insurance",0,"Acre",0,{"$f":"C106*E106","v":0},0]
[null,"Other Variable Expense 1",0,"Enter Unit",0,0,0]
[null,"Other Variable Expense 2",0,"Enter Unit",0,0,0]
[null,"Other Variable Expense 3",0,"Enter Unit",0,0,0]
[null,"Other Variable Expense 4",0,"Enter Unit",0,0,0]
[null,"Other Variable Expense 5",0,"Enter Unit",0,0,0]
[null,"Other Variable Expense 6",0,"Enter Unit",0,0,0]
[null,"Other Variable Expense 7",0,"Enter Unit",0,0,0]
[null,"Other Variable Expense 8",0,"Enter Unit",0,0,0]
[]
[null,"Operating Interest",null,null,0,{"$f":"+SUM(F23:F115)/2*E116","v":0},{"$f":"+F116*$D$6","v":0}]
[]
["Total Variable Costs",null,null,null,null,{"$f":"+SUM(F23:F116)","v":0},{"$f":"+SUM(G23:G116)","v":0}]
[]
["Planned Returns Above Variable Costs",null,null,null,null,{"$f":"+F18-F118","v":0},{"$f":"+G18-G118","v":0}]
[]
[null,"Breakeven Price to Cover Variable Costs",null,null,{"$f":"+IF(C9=0,0,F118-SUM(F10:F16)/C9)","v":0},{"$f":"+D9","v":"Cwt,lb,etc"}]
[]
[null,null,null,null,null,null,"Enterprise"]
["FIXED COSTS",null,"Quantity","Units","$/Unit","Total","Total"]
[null,"Land Rent or Expense",1,"Acre",0,{"$f":"C126*E126","v":0},{"$f":"+F126*$D$6","v":0}]
[null,"Depreciation - Equipment",1,"Acre",0,{"$f":"C127*E127","v":0},0]
[null,"Equipment Investment",0,"$",0,0,0]
[null,"Insurance",1,"Acre",0,0,0]
[null,"Management Fee",1,"Acre",0,0,0]
[null,"Owner/Operator Labor",0,"Acre",0,0,0]
[null,"Salaried Labor",1,"Acre,$,etc",0,0,0]
[null,"Other Fixed Expense",0,"Acre,$,etc",0,0,0]
[null,"Other Fixed Expense",0,"Acre,$,etc",0,0,0]
[null,"Other Fixed Expense",0,"Acre,$,etc",0,0,0]
[null,"Other Fixed Expense",0,"Acre,$,etc",0,0,0]
[null,"Other Fixed Expense",0,"Acre,$,etc",0,0,0]
[]
[null,null,null,"Total Fixed Costs",null,{"$f":"+SUM(F126:F137)","v":0},{"$f":"+SUM(G126:G137)","v":0}]
[]
[null,null,null,"Total Specified Costs",null,{"$f":"+F118+F139","v":0},{"$f":"+G118+G139","v":0}]
[]
[null,null,null,"Returns Above Specifiied Costs",null,{"$f":"+F18-F141","v":0},{"$f":"+G18-G141","v":0}]
[]
[null,"Breakeven Price to Cover Total Costs",null,null,{"$f":"+IF(C9=0,0,F141-SUM(F10:F16)/C9)","v":0},{"$f":"+D9","v":"Cwt,lb,etc"}]
[]
[null,"Breakeven Prices for Your Crop"]
[null,null,null,null,"Price To Cover",null,"Price To Cover"]
[null,"Yield","Yield",null,"Variable",null,"Total"]
[null,"Percent",{"$f":"+D9","v":"Cwt,lb,etc"},null,"Costs",null,"Costs"]
[null,0.75,{"$f":"+$C$153*B151","v":0},null,{"$f":"+IF(C151=0,0,($F$118-SUM($F$10:$F$16))/C151)","v":0},null,{"$f":"+IF(C151=0,0,($F$141-SUM($F$10:$F$16))/C151)","v":0}]
[null,0.9,{"$f":"+$C$153*B152","v":0},null,{"$f":"+IF(C152=0,0,($F$118-SUM($F$10:$F$16))/C152)","v":0},null,{"$f":"+IF(C152=0,0,($F$141-SUM($F$10:$F$16))/C152)","v":0}]
[null,1,{"$f":"+C9","v":0},null,{"$f":"+IF(C153=0,0,($F$118-SUM($F$10:$F$16))/C153)","v":0},null,{"$f":"+IF(C153=0,0,($F$141-SUM($F$10:$F$16))/C153)","v":0}]
[null,1.1000000000000001,0,null,{"$f":"+IF(C154=0,0,($F$118-SUM($F$10:$F$16))/C154)","v":0},null,{"$f":"+IF(C154=0,0,($F$141-SUM($F$10:$F$16))/C154)","v":0}]
[null,1.25,0,null,{"$f":"+IF(C155=0,0,($F$118-SUM($F$10:$F$16))/C155)","v":0},null,{"$f":"+IF(C155=0,0,($F$141-SUM($F$10:$F$16))/C155)","v":0}]

{"sheet":"Comparative Returns - Cash Rent","index":22,"n_rows":30,"n_cols":11,"rows_kept":30,"cut":false,"hidden":false,"merged":[[2,7,2,10],[2,4,2,5],[2,1,2,2]]}
["Comparative Returns - Cash Rent"]
[]
[null,"Returns Above Total Specified Expenses",null,null,"Total Direct Expenses",null,null,"Breakeven Yield to Cover Total Costs at Price Entered"]
[null,"Total Costs","Variable Costs",null,"Total Costs","Variable Costs",null,"Price","Units","Total Costs","Variable Costs"]
["FORAGE CROPS"]
[]
[{"$f":"+CoastalEstablishFarmland!A3","v":"Coastal Bermudagrass Establishment - Farmland"},{"$f":"+CoastalEstablishFarmland!TotRet","v":-349.69446390861606},{"$f":"+CoastalEstablishFarmland!VarRet","v":-340.37531915938882},null,{"$f":"+CoastalEstablishFarmland!TotExp","v":349.69446390861606},{"$f":"+CoastalEstablishFarmland!VarExp","v":340.37531915938882},null,{"$f":"+CoastalEstablishFarmland!Price","v":0},{"$f":"+CoastalEstablishFarmland!Unit","v":""},{"$f":"+IF($H7=0,0,E7/$H7)","v":0},0]
[{"$f":"+CoastalEstablishNative!A3","v":"Coastal Bermudagrass Establishment - Native Prairie"},{"$f":"+CoastalEstablishNative!TotRet","v":-527.36863412551156},{"$f":"+CoastalEstablishNative!VarRet","v":-513.05047772863395},null,{"$f":"+CoastalEstablishNative!TotExp","v":527.36863412551156},{"$f":"+CoastalEstablishNative!VarExp","v":513.05047772863395},null,{"$f":"+CoastalEstablishNative!Price","v":0},{"$f":"+CoastalEstablishNative!Unit","v":""},0,0]
[{"$f":"+CoastalHay!A3","v":"Coastal Bermudagrass Hay"},{"$f":"+CoastalHay!TotRet","v":77.406111588023691},{"$f":"+CoastalHay!VarRet","v":87.508487202507808},null,{"$f":"+CoastalHay!TotExp","v":642.59388841197631},{"$f":"+CoastalHay!VarExp","v":632.49151279749219},null,{"$f":"+CoastalHay!Price","v":120},{"$f":"+CoastalHay!Unit","v":"Roll"},5.3549490700998028,5.2707626066457687]
[{"$f":"+CoastalPasture!A3","v":"Coastal Bermudagrass Pasture"},{"$f":"+CoastalPasture!TotRet","v":-29.96427397260274},{"$f":"+CoastalPasture!VarRet","v":-29.96427397260274},null,{"$f":"+CoastalPasture!TotExp","v":159.96427397260274},{"$f":"+CoastalPasture!VarExp","v":159.96427397260274},null,{"$f":"+CoastalPasture!Price","v":26},{"$f":"+CoastalPasture!Unit","v":"AUM"},6.1524720758693361,6.1524720758693361]
[{"$f":"SmallGrainGrazing!A3","v":"Small Grain with Grazing"},{"$f":"SmallGrainGrazing!TotRet","v":-72.81745884802757},{"$f":"SmallGrainGrazing!VarRet","v":-31.210247609703345},null,{"$f":"SmallGrainGrazing!TotExp","v":309.06745884802757},{"$f":"SmallGrainGrazing!VarExp","v":267.46024760970334},null,{"$f":"SmallGrainGrazing!Price","v":0.75},{"$f":"SmallGrainGrazing!Unit","v":"Pound"},{"$f":"IF(H11=0,0,E11/H11)","v":412.08994513070343},{"$f":"IF(H11=0,0,F11/H11)","v":356.61366347960444}]
[{"$f":"CornSilageDryland!A3","v":"RR Corn Silage - Dryland"},{"$f":"CornSilageDryland!TotRet","v":223.85999956336582},{"$f":"CornSilageDryland!VarRet","v":261.76701796701184},null,{"$f":"CornSilageDryland!TotExp","v":556.14000043663418},{"$f":"CornSilageDryland!VarExp","v":518.23298203298816},null,{"$f":"CornSilageDryland!Price","v":65},{"$f":"CornSilageDryland!Unit","v":"Ton"},{"$f":"IF(H12=0,0,E12/H12)","v":8.5560000067174489},{"$f":"IF(H12=0,0,F12/H12)","v":7.9728151081998178}]
[{"$f":"CornSilageIrrigated!A3","v":"RR Corn Silage - Irrigated"},{"$f":"CornSilageIrrigated!TotRet","v":329.06744695486668},{"$f":"CornSilageIrrigated!VarRet","v":386.97446535851282},null,{"$f":"CornSilageIrrigated!TotExp","v":1100.9325530451333},{"$f":"CornSilageIrrigated!VarExp","v":1043.0255346414872},null,{"$f":"CornSilageIrrigated!Price","v":65},{"$f":"CornSilageIrrigated!Unit","v":"Ton"},{"$f":"IF(H13=0,0,E13/H13)","v":16.937423893002052},{"$f":"IF(H13=0,0,F13/H13)","v":16.046546686792112}]
[]
["FIELD CROPS"]
[]
[{"$f":"+Barley!A3","v":"Malting Barley"},{"$f":"+Barley!TotRet","v":13.943894364292873},{"$f":"+Barley!VarRet","v":66.343626153431387},null,{"$f":"+Barley!TotExp","v":286.05610563570713},{"$f":"+Barley!VarExp","v":233.65637384656861},null,{"$f":"+Barley!Price","v":5},{"$f":"+Barley!Unit","v":"Bushel"},{"$f":"+IF($H17=0,0,E17/$H17)","v":57.211221127141428},46.731274769313721]
[{"$f":"+Canola!A3","v":"Canola"},{"$f":"+Canola!TotRet","v":-71.136508135362419},{"$f":"+Canola!VarRet","v":-18.736776346223905},null,{"$f":"+Canola!TotExp","v":305.13650813536242},{"$f":"+Canola!VarExp","v":252.73677634622391},null,{"$f":"+Canola!Price","v":18},{"$f":"+Canola!Unit","v":"CWT"},16.952028229742357,14.040932019234662]
[{"$f":"+Corn!A3","v":"Herbicide Resistant Corn"},{"$f":"+Corn!TotRet","v":-104.13111159748371},{"$f":"+Corn!VarRet","v":-5.9143705740953578},null,{"$f":"+Corn!TotExp","v":576.63111159748371},{"$f":"+Corn!VarExp","v":478.41437057409536},null,{"$f":"+Corn!Price","v":5.25},{"$f":"+Corn!Unit","v":"Bushel"},109.83449744713975,91.126546776018159]
[{"$f":"+CornReducedTill!A3","v":"Herbicide Resistant Corn - Reduced Tillage"},{"$f":"+CornReducedTill!TotRet","v":-98.814560647081294},{"$f":"+CornReducedTill!VarRet","v":-3.1148895675721633},null,{"$f":"+CornReducedTill!TotExp","v":571.31456064708129},{"$f":"+CornReducedTill!VarExp","v":475.61488956757216},null,{"$f":"+CornReducedTill!Price","v":5.25},{"$f":"+CornReducedTill!Unit","v":"Bushel"},108.82182107563453,90.593312298585175]
[{"$f":"+Cotton!A3","v":"Stacked Cotton"},{"$f":"+Cotton!TotRet","v":-60.925712476150352},{"$f":"+Cotton!VarRet","v":19.611829306738343},null,{"$f":"+Cotton!TotExp","v":521.82571247615033},{"$f":"+Cotton!VarExp","v":441.28817069326163},null,{"$f":"+Cotton!Price","v":0.77},{"$f":"+Cotton!Unit","v":"Pound"},677.69573048850691,573.10152038085926]
[{"$f":"+OatsGrain!A3","v":"Oats for Grain"},{"$f":"+OatsGrain!TotRet","v":38.938023452208085},{"$f":"+OatsGrain!VarRet","v":91.692038271536546},null,{"$f":"+OatsGrain!TotExp","v":336.06197654779191},{"$f":"+OatsGrain!VarExp","v":283.30796172846345},null,{"$f":"+OatsGrain!Price","v":3.75},{"$f":"+OatsGrain!Unit","v":"Bushel"},89.616527079411171,75.548789794256919]
[{"$f":"+Sorghum!A3","v":"Grain Sorghum"},{"$f":"+Sorghum!TotRet","v":82.313534375298445},{"$f":"+Sorghum!VarRet","v":134.67516600976018},null,{"$f":"+Sorghum!TotExp","v":300.18646562470155},{"$f":"+Sorghum!VarExp","v":247.82483399023982},null,{"$f":"+Sorghum!Price","v":8.5},{"$f":"+Sorghum!Unit","v":"CWT"},{"$f":"+IF($H23=0,0,E23/$H23)","v":35.316054779376657},{"$f":"+IF($H23=0,0,F23/$H23)","v":29.155862822381156}]
[{"$f":"+Wheat!A3","v":"Hard Red Winter Wheat"},{"$f":"+Wheat!TotRet","v":-13.230838334367206},{"$f":"+Wheat!VarRet","v":37.417513877489569},null,{"$f":"+Wheat!TotExp","v":330.03083833436716},{"$f":"+Wheat!VarExp","v":279.38248612251039},null,{"$f":"+Wheat!Price","v":6.6},{"$f":"+Wheat!Unit","v":"Bushel"},{"$f":"+IF($H24=0,0,E24/$H24)","v":50.004672474904119},42.330679715531879]
[]
["LIVESTOCK"]
[]
[{"$f":"+CowCalfImprove!A3","v":"Cow-Calf Improved Pasture"},{"$f":"+CowCalfImprove!TotRet","v":250.39695099548521},{"$f":"+CowCalfImprove!VarRet","v":589.43340486006855},null,{"$f":"+CowCalfImprove!TotExp","v":945.74054900451483},{"$f":"+CowCalfImprove!VarExp","v":606.7040951399315},null,{"$f":"+CowCalfImprove!Price","v":278.96166134185307},{"$f":"+CowCalfImprove!Unit","v":"CWT"},{"$f":"+IF($H28=0,0,E28/$H28)","v":3.3902169368197113},2.1748655074019188]
[{"$f":"CowCalfNative!A3","v":"Cow-Calf Native Pasture"},{"$f":"CowCalfNative!TotRet","v":0.38106058452626712},{"$f":"CowCalfNative!VarRet","v":439.4175144491096},null,{"$f":"CowCalfNative!TotExp","v":1195.7564394154738},{"$f":"CowCalfNative!VarExp","v":756.71998555089044},null,{"$f":"CowCalfNative!Price","v":278.96166134185307},{"$f":"CowCalfNative!Unit","v":"CWT"},{"$f":"IF(H29=0,0,E29/H29)","v":4.2864543954308338},{"$f":"IF(H29=0,0,F29/H29)","v":2.7126307676507895}]
[{"$f":"+StockersNative!A3","v":"Stockers on Native Pasture"},{"$f":"+StockersNative!TotRet","v":-252.69677256395306},{"$f":"+StockersNative!VarRet","v":-216.55341542109593},null,{"$f":"+StockersNative!TotExp","v":271.07177256395306},{"$f":"+StockersNative!VarExp","v":234.92841542109593},null,{"$f":"+StockersNative!Price","v":2.5},{"$f":"+StockersNative!Unit","v":"CWT"},108.42870902558123,93.971366168438379]

{"sheet":"Comparative Returns-Share Rent","index":23,"n_rows":30,"n_cols":28,"rows_kept":30,"cut":false,"hidden":false,"merged":[[2,23,2,27],[2,1,2,3],[2,5,2,7],[2,9,2,13],[2,15,2,17],[2,19,2,21]]}
["Comparative Returns - Share Rent"]
[]
["Variable Costs to the right of Total Costs","Returns Above Total Specified Expenses",null,null,null,"Total Direct Expenses",null,null,null,"Breakeven Yield to Cover Total Costs at Price Entered",null,null,null,null,null,"Returns Above Variable Specified Expenses",null,null,null,"Variable Direct Expenses",null,null,null,"Breakeven Yield to Cover Variavle Costs at Price Entered"]
[null,"Total","Tenant","Landlord",null,"Total","Tenant","Landlord",null,"Price","Units","Total","Tenant","Landlord",null,"Total","Tenant","Landlord",null,"Total","Tenant","Landlord",null,"Price","Units","Total","Tenant","Landlord"]
["FORAGE CROPS"]
[]
[{"$f":"+CoastalEstablishFarmland!A3","v":"Coastal Bermudagrass Establishment - Farmland"},{"$f":"+CoastalEstablishFarmland!TotRet","v":-349.69446390861606},{"$f":"+CoastalEstablishFarmland!TTotRet","v":-349.69446390861606},{"$f":"+CoastalEstablishFarmland!LTotRet","v":0},null,{"$f":"+CoastalEstablishFarmland!TotExp","v":349.69446390861606},{"$f":"+CoastalEstablishFarmland!TTotExp","v":349.69446390861606},{"$f":"+CoastalEstablishFarmland!LTotExp","v":0},null,{"$f":"+CoastalEstablishFarmland!Price","v":0},{"$f":"+CoastalEstablishFarmland!Unit","v":""},{"$f":"+IF($J7=0,0,F7/$J7)","v":0},0,0,null,{"$f":"+CoastalEstablishFarmland!VarRet","v":-340.37531915938882},{"$f":"+CoastalEstablishFarmland!TVarRet","v":-340.37531915938882},{"$f":"+CoastalEstablishFarmland!LVarRet","v":0},null,{"$f":"+CoastalEstablishFarmland!VarExp","v":340.37531915938882},{"$f":"+CoastalEstablishFarmland!TVarExp","v":340.37531915938882},{"$f":"+CoastalEstablishFarmland!LVarExp","v":0},null,{"$f":"+CoastalEstablishFarmland!Price","v":0},{"$f":"+CoastalEstablishFarmland!Unit","v":""},{"$f":"+IF($J7=0,0,T7/$J7)","v":0},0,0]
[{"$f":"+CoastalEstablishNative!A3","v":"Coastal Bermudagrass Establishment - Native Prairie"},{"$f":"+CoastalEstablishNative!TotRet","v":-527.36863412551156},{"$f":"+CoastalEstablishNative!TTotRet","v":-527.36863412551156},{"$f":"+CoastalEstablishNative!LTotRet","v":0},null,{"$f":"+CoastalEstablishNative!TotExp","v":527.36863412551156},{"$f":"+CoastalEstablishNative!TTotExp","v":527.36863412551156},{"$f":"+CoastalEstablishNative!LTotExp","v":0},null,{"$f":"+CoastalEstablishNative!Price","v":0},{"$f":"+CoastalEstablishNative!Unit","v":""},0,0,0,null,{"$f":"+CoastalEstablishNative!VarRet","v":-513.05047772863395},{"$f":"+CoastalEstablishNative!TVarRet","v":-513.05047772863395},{"$f":"+CoastalEstablishNative!LVarRet","v":0},null,{"$f":"+CoastalEstablishNative!VarExp","v":513.05047772863395},{"$f":"+CoastalEstablishNative!TVarExp","v":513.05047772863395},{"$f":"+CoastalEstablishNative!LVarExp","v":0},null,{"$f":"+CoastalEstablishNative!Price","v":0},{"$f":"+CoastalEstablishNative!Unit","v":""},0,0,0]
[{"$f":"+CoastalHay!A3","v":"Coastal Bermudagrass Hay"},{"$f":"+CoastalHay!TotRet","v":77.406111588023691},{"$f":"+CoastalHay!TTotRet","v":77.406111588023691},{"$f":"+CoastalHay!LTotRet","v":0},null,{"$f":"+CoastalHay!TotExp","v":642.59388841197631},{"$f":"+CoastalHay!TTotExp","v":642.59388841197631},{"$f":"+CoastalHay!LTotExp","v":0},null,{"$f":"+CoastalHay!Price","v":120},{"$f":"+CoastalHay!Unit","v":"Roll"},5.3549490700998028,5.3549490700998028,0,null,{"$f":"+CoastalHay!VarRet","v":87.508487202507808},{"$f":"+CoastalHay!TVarRet","v":87.508487202507808},{"$f":"+CoastalHay!LVarRet","v":0},null,{"$f":"+CoastalHay!VarExp","v":632.49151279749219},{"$f":"+CoastalHay!TVarExp","v":632.49151279749219},{"$f":"+CoastalHay!LVarExp","v":0},null,{"$f":"+CoastalHay!Price","v":120},{"$f":"+CoastalHay!Unit","v":"Roll"},5.2707626066457687,5.2707626066457687,0]
[{"$f":"+CoastalPasture!A3","v":"Coastal Bermudagrass Pasture"},{"$f":"+CoastalPasture!TotRet","v":-29.96427397260274},{"$f":"+CoastalPasture!TTotRet","v":-29.96427397260274},{"$f":"+CoastalPasture!LTotRet","v":0},null,{"$f":"+CoastalPasture!TotExp","v":159.96427397260274},{"$f":"+CoastalPasture!TTotExp","v":159.96427397260274},{"$f":"+CoastalPasture!LTotExp","v":0},null,{"$f":"+CoastalPasture!Price","v":26},{"$f":"+CoastalPasture!Unit","v":"AUM"},6.1524720758693361,6.1524720758693361,0,null,{"$f":"+CoastalPasture!VarRet","v":-29.96427397260274},{"$f":"+CoastalPasture!TVarRet","v":-29.96427397260274},{"$f":"+CoastalPasture!LVarRet","v":0},null,{"$f":"+CoastalPasture!VarExp","v":159.96427397260274},{"$f":"+CoastalPasture!TVarExp","v":159.96427397260274},{"$f":"+CoastalPasture!LVarExp","v":0},null,{"$f":"+CoastalPasture!Price","v":26},{"$f":"+CoastalPasture!Unit","v":"AUM"},6.1524720758693361,6.1524720758693361,0]
[{"$f":"SmallGrainGrazing!A3","v":"Small Grain with Grazing"},{"$f":"SmallGrainGrazing!TotRet","v":-72.81745884802757},{"$f":"SmallGrainGrazing!TTotRet","v":-72.81745884802757},{"$f":"SmallGrainGrazing!LTotRet","v":0},null,{"$f":"SmallGrainGrazing!TotExp","v":309.06745884802757},{"$f":"SmallGrainGrazing!TTotExp","v":309.06745884802757},{"$f":"SmallGrainGrazing!LTotExp","v":0},null,{"$f":"SmallGrainGrazing!Price","v":0.75},{"$f":"SmallGrainGrazing!Unit","v":"Pound"},{"$f":"IF(J11=0,0,F11/J11)","v":412.08994513070343},{"$f":"IF(J11=0,0,G11/J11)","v":412.08994513070343},{"$f":"IF(J11=0,0,H11/J11)","v":0},null,{"$f":"SmallGrainGrazing!VarRet","v":-31.210247609703345},{"$f":"SmallGrainGrazing!TVarRet","v":-31.210247609703345},{"$f":"SmallGrainGrazing!LVarRet","v":0},null,{"$f":"SmallGrainGrazing!VarExp","v":267.46024760970334},{"$f":"SmallGrainGrazing!TVarExp","v":267.46024760970334},{"$f":"SmallGrainGrazing!LVarExp","v":0},null,{"$f":"SmallGrainGrazing!Price","v":0.75},{"$f":"SmallGrainGrazing!Unit","v":"Pound"},{"$f":"IF(J11=0,0,T11/J11)","v":356.61366347960444},{"$f":"IF(J11=0,0,U11/J11)","v":356.61366347960444},{"$f":"IF(J11=0,0,V11/J11)","v":0}]
[{"$f":"CornSilageDryland!A3","v":"RR Corn Silage - Dryland"},{"$f":"CornSilageDryland!TotRet","v":223.85999956336582},{"$f":"CornSilageDryland!TTotRet","v":223.85999956336582},{"$f":"CornSilageDryland!LTotRet","v":0},null,{"$f":"CornSilageDryland!TotExp","v":556.14000043663418},{"$f":"CornSilageDryland!TTotExp","v":556.14000043663418},{"$f":"CornSilageDryland!LTotExp","v":0},null,{"$f":"CornSilageDryland!Price","v":65},{"$f":"CornSilageDryland!Unit","v":"Ton"},{"$f":"IF(J12=0,0,F12/J12)","v":8.5560000067174489},{"$f":"IF(J12=0,0,G12/J12)","v":8.5560000067174489},{"$f":"IF(J12=0,0,H12/J12)","v":0},null,{"$f":"CornSilageDryland!VarRet","v":261.76701796701184},{"$f":"CornSilageDryland!TVarRet","v":261.76701796701184},{"$f":"CornSilageDryland!LVarRet","v":0},null,{"$f":"CornSilageDryland!VarExp","v":518.23298203298816},{"$f":"CornSilageDryland!TVarExp","v":518.23298203298816},{"$f":"CornSilageDryland!LVarExp","v":0},null,{"$f":"CornSilageDryland!Price","v":65},{"$f":"CornSilageDryland!Unit","v":"Ton"},{"$f":"IF(J12=0,0,T12/J12)","v":7.9728151081998178},{"$f":"IF(J12=0,0,U12/J12)","v":7.9728151081998178},{"$f":"IF(J12=0,0,V12/J12)","v":0}]
[{"$f":"CornSilageIrrigated!A3","v":"RR Corn Silage - Irrigated"},{"$f":"CornSilageIrrigated!TotRet","v":329.06744695486668},{"$f":"CornSilageIrrigated!TTotRet","v":329.06744695486668},{"$f":"CornSilageIrrigated!LTotRet","v":0},null,{"$f":"CornSilageIrrigated!TotExp","v":1100.9325530451333},{"$f":"CornSilageIrrigated!TTotExp","v":1100.9325530451333},{"$f":"CornSilageIrrigated!LTotExp","v":0},null,{"$f":"CornSilageIrrigated!Price","v":65},{"$f":"CornSilageIrrigated!Unit","v":"Ton"},{"$f":"IF(J13=0,0,F13/J13)","v":16.937423893002052},{"$f":"IF(J13=0,0,G13/J13)","v":16.937423893002052},{"$f":"IF(J13=0,0,H13/J13)","v":0},null,{"$f":"CornSilageIrrigated!VarRet","v":386.97446535851282},{"$f":"CornSilageIrrigated!TVarRet","v":386.97446535851282},{"$f":"CornSilageIrrigated!LVarRet","v":0},null,{"$f":"CornSilageIrrigated!VarExp","v":1043.0255346414872},{"$f":"CornSilageIrrigated!TVarExp","v":1043.0255346414872},{"$f":"CornSilageIrrigated!LVarExp","v":0},null,{"$f":"CornSilageIrrigated!Price","v":65},{"$f":"CornSilageIrrigated!Unit","v":"Ton"},{"$f":"IF(J13=0,0,T13/J13)","v":16.046546686792112},{"$f":"IF(J13=0,0,U13/J13)","v":16.046546686792112},{"$f":"IF(J13=0,0,V13/J13)","v":0}]
[]
["FIELD CROPS"]
[]
[{"$f":"+Barley!A3","v":"Malting Barley"},{"$f":"+Barley!TotRet","v":13.943894364292873},{"$f":"+Barley!TTotRet","v":13.943894364292873},{"$f":"+Barley!LTotRet","v":0},null,{"$f":"+Barley!TotExp","v":286.05610563570713},{"$f":"+Barley!TTotExp","v":286.05610563570713},{"$f":"+Barley!LTotExp","v":0},null,{"$f":"+Barley!Price","v":5},{"$f":"+Barley!Unit","v":"Bushel"},{"$f":"+IF($J17=0,0,F17/$J17)","v":57.211221127141428},57.211221127141428,0,null,{"$f":"+Barley!VarRet","v":66.343626153431387},{"$f":"+Barley!TVarRet","v":66.343626153431387},{"$f":"+Barley!LVarRet","v":0},null,{"$f":"+Barley!VarExp","v":233.65637384656861},{"$f":"+Barley!TVarExp","v":233.65637384656861},{"$f":"+Barley!LVarExp","v":0},null,{"$f":"+Barley!Price","v":5},{"$f":"+Barley!Unit","v":"Bushel"},{"$f":"+IF($J17=0,0,T17/$J17)","v":46.731274769313721},46.731274769313721,0]
[{"$f":"+Canola!A3","v":"Canola"},{"$f":"+Canola!TotRet","v":-71.136508135362419},{"$f":"+Canola!TTotRet","v":-71.136508135362419},{"$f":"+Canola!LTotRet","v":0},null,{"$f":"+Canola!TotExp","v":305.13650813536242},{"$f":"+Canola!TTotExp","v":305.13650813536242},{"$f":"+Canola!LTotExp","v":0},null,{"$f":"+Canola!Price","v":18},{"$f":"+Canola!Unit","v":"CWT"},16.952028229742357,16.952028229742357,0,null,{"$f":"+Canola!VarRet","v":-18.736776346223905},{"$f":"+Canola!TVarRet","v":-18.736776346223905},{"$f":"+Canola!LVarRet","v":0},null,{"$f":"+Canola!VarExp","v":252.73677634622391},{"$f":"+Canola!TVarExp","v":252.73677634622391},{"$f":"+Canola!LVarExp","v":0},null,{"$f":"+Canola!Price","v":18},{"$f":"+Canola!Unit","v":"CWT"},14.040932019234662,14.040932019234662,0]
[{"$f":"+Corn!A3","v":"Herbicide Resistant Corn"},{"$f":"+Corn!TotRet","v":-104.13111159748371},{"$f":"+Corn!TTotRet","v":-104.13111159748371},{"$f":"+Corn!LTotRet","v":0},null,{"$f":"+Corn!TotExp","v":576.63111159748371},{"$f":"+Corn!TTotExp","v":576.63111159748371},{"$f":"+Corn!LTotExp","v":0},null,{"$f":"+Corn!Price","v":5.25},{"$f":"+Corn!Unit","v":"Bushel"},109.83449744713975,109.83449744713975,0,null,{"$f":"+Corn!VarRet","v":-5.9143705740953578},{"$f":"+Corn!TVarRet","v":-5.9143705740953578},{"$f":"+Corn!LVarRet","v":0},null,{"$f":"+Corn!VarExp","v":478.41437057409536},{"$f":"+Corn!TVarExp","v":478.41437057409536},{"$f":"+Corn!LVarExp","v":0},null,{"$f":"+Corn!Price","v":5.25},{"$f":"+Corn!Unit","v":"Bushel"},91.126546776018159,91.126546776018159,0]
[{"$f":"+CornReducedTill!A3","v":"Herbicide Resistant Corn - Reduced Tillage"},{"$f":"+CornReducedTill!TotRet","v":-98.814560647081294},{"$f":"+CornReducedTill!TTotRet","v":-98.814560647081294},{"$f":"+CornReducedTill!LTotRet","v":0},null,{"$f":"+CornReducedTill!TotExp","v":571.31456064708129},{"$f":"+CornReducedTill!TTotExp","v":571.31456064708129},{"$f":"+CornReducedTill!LTotExp","v":0},null,{"$f":"+CornReducedTill!Price","v":5.25},{"$f":"+CornReducedTill!Unit","v":"Bushel"},108.82182107563453,108.82182107563453,0,null,{"$f":"+CornReducedTill!VarRet","v":-3.1148895675721633},{"$f":"+CornReducedTill!TVarRet","v":-3.1148895675721633},{"$f":"+CornReducedTill!LVarRet","v":0},null,{"$f":"+CornReducedTill!VarExp","v":475.61488956757216},{"$f":"+CornReducedTill!TVarExp","v":475.61488956757216},{"$f":"+CornReducedTill!LVarExp","v":0},null,{"$f":"+CornReducedTill!Price","v":5.25},{"$f":"+CornReducedTill!Unit","v":"Bushel"},90.593312298585175,90.593312298585175,0]
[{"$f":"+Cotton!A3","v":"Stacked Cotton"},{"$f":"+Cotton!TotRet","v":-60.925712476150352},{"$f":"+Cotton!TTotRet","v":-60.925712476150352},{"$f":"+Cotton!LTotRet","v":0},null,{"$f":"+Cotton!TotExp","v":521.82571247615033},{"$f":"+Cotton!TTotExp","v":521.82571247615033},{"$f":"+Cotton!LTotExp","v":0},null,{"$f":"+Cotton!Price","v":0.77},{"$f":"+Cotton!Unit","v":"Pound"},677.69573048850691,677.69573048850691,0,null,{"$f":"+Cotton!VarRet","v":19.611829306738343},{"$f":"+Cotton!TVarRet","v":19.611829306738343},{"$f":"+Cotton!LVarRet","v":0},null,{"$f":"+Cotton!VarExp","v":441.28817069326163},{"$f":"+Cotton!TVarExp","v":441.28817069326163},{"$f":"+Cotton!LVarExp","v":0},null,{"$f":"+Cotton!Price","v":0.77},{"$f":"+Cotton!Unit","v":"Pound"},573.10152038085926,573.10152038085926,0]
[{"$f":"+OatsGrain!A3","v":"Oats for Grain"},{"$f":"+OatsGrain!TotRet","v":38.938023452208085},{"$f":"+OatsGrain!TTotRet","v":38.938023452208085},{"$f":"+OatsGrain!LTotRet","v":0},null,{"$f":"+OatsGrain!TotExp","v":336.06197654779191},{"$f":"+OatsGrain!TTotExp","v":336.06197654779191},{"$f":"+OatsGrain!LTotExp","v":0},null,{"$f":"+OatsGrain!Price","v":3.75},{"$f":"+OatsGrain!Unit","v":"Bushel"},{"$f":"+IF($J22=0,0,F22/$J22)","v":89.616527079411171},89.616527079411171,0,null,{"$f":"+OatsGrain!VarRet","v":91.692038271536546},{"$f":"+OatsGrain!TVarRet","v":91.692038271536546},{"$f":"+OatsGrain!LVarRet","v":0},null,{"$f":"+OatsGrain!VarExp","v":283.30796172846345},{"$f":"+OatsGrain!TVarExp","v":283.30796172846345},{"$f":"+OatsGrain!LVarExp","v":0},null,{"$f":"+OatsGrain!Price","v":3.75},{"$f":"+OatsGrain!Unit","v":"Bushel"},{"$f":"+IF($J22=0,0,T22/$J22)","v":75.548789794256919},75.548789794256919,0]
[{"$f":"+Sorghum!A3","v":"Grain Sorghum"},{"$f":"+Sorghum!TotRet","v":82.313534375298445},{"$f":"+Sorghum!TTotRet","v":82.313534375298445},{"$f":"+Sorghum!LTotRet","v":0},null,{"$f":"+Sorghum!TotExp","v":300.18646562470155},{"$f":"+Sorghum!TTotExp","v":300.18646562470155},{"$f":"+Sorghum!LTotExp","v":0},null,{"$f":"+Sorghum!Price","v":8.5},{"$f":"+Sorghum!Unit","v":"CWT"},{"$f":"+IF($J23=0,0,F23/$J23)","v":35.316054779376657},35.316054779376657,0,null,{"$f":"+Sorghum!VarRet","v":134.67516600976018},{"$f":"+Sorghum!TVarRet","v":134.67516600976018},{"$f":"+Sorghum!LVarRet","v":0},null,{"$f":"+Sorghum!VarExp","v":247.82483399023982},{"$f":"+Sorghum!TVarExp","v":247.82483399023982},{"$f":"+Sorghum!LVarExp","v":0},null,{"$f":"+Sorghum!Price","v":8.5},{"$f":"+Sorghum!Unit","v":"CWT"},{"$f":"+IF($J23=0,0,T23/$J23)","v":29.155862822381156},29.155862822381156,0]
[{"$f":"+Wheat!A3","v":"Hard Red Winter Wheat"},{"$f":"+Wheat!TotRet","v":-13.230838334367206},{"$f":"+Wheat!TTotRet","v":-13.230838334367206},{"$f":"+Wheat!LTotRet","v":0},null,{"$f":"+Wheat!TotExp","v":330.03083833436716},{"$f":"+Wheat!TTotExp","v":330.03083833436716},{"$f":"+Wheat!LTotExp","v":0},null,{"$f":"+Wheat!Price","v":6.6},{"$f":"+Wheat!Unit","v":"Bushel"},{"$f":"+IF($J24=0,0,F24/$J24)","v":50.004672474904119},50.004672474904119,0,null,{"$f":"+Wheat!VarRet","v":37.417513877489569},{"$f":"+Wheat!TVarRet","v":37.417513877489569},{"$f":"+Wheat!LVarRet","v":0},null,{"$f":"+Wheat!VarExp","v":279.38248612251039},{"$f":"+Wheat!TVarExp","v":279.38248612251039},{"$f":"+Wheat!LVarExp","v":0},null,{"$f":"+Wheat!Price","v":6.6},{"$f":"+Wheat!Unit","v":"Bushel"},{"$f":"+IF($J24=0,0,T24/$J24)","v":42.330679715531879},42.330679715531879,0]
[]
["LIVESTOCK"]
[]
[{"$f":"+CowCalfImprove!A3","v":"Cow-Calf Improved Pasture"},{"$f":"+CowCalfImprove!TotRet","v":250.39695099548521},null,null,null,{"$f":"+CowCalfImprove!TotExp","v":945.74054900451483},null,null,null,{"$f":"+CowCalfImprove!Price","v":278.96166134185307},{"$f":"+CowCalfImprove!Unit","v":"CWT"},{"$f":"+IF($J28=0,0,F28/$J28)","v":3.3902169368197113},null,null,null,{"$f":"+CowCalfImprove!VarRet","v":589.43340486006855},null,null,null,{"$f":"+CowCalfImprove!VarExp","v":606.7040951399315},null,null,null,{"$f":"+CowCalfImprove!Price","v":278.96166134185307},{"$f":"+CowCalfImprove!Unit","v":"CWT"},{"$f":"+IF($J28=0,0,T28/$J28)","v":2.1748655074019188}]
[{"$f":"CowCalfNative!A3","v":"Cow-Calf Native Pasture"},{"$f":"CowCalfNative!TotRet","v":0.38106058452626712},null,null,null,{"$f":"CowCalfNative!TotExp","v":1195.7564394154738},null,null,null,{"$f":"CowCalfNative!Price","v":278.96166134185307},{"$f":"CowCalfNative!Unit","v":"CWT"},{"$f":"IF(J29=0,0,F29/J29)","v":4.2864543954308338},null,null,null,{"$f":"CowCalfNative!VarRet","v":439.4175144491096},null,null,null,{"$f":"CowCalfNative!VarExp","v":756.71998555089044},null,null,null,{"$f":"CowCalfNative!Price","v":278.96166134185307},{"$f":"CowCalfNative!Unit","v":"CWT"},{"$f":"IF(J29=0,0,T29/J29)","v":2.7126307676507895}]
[{"$f":"+StockersNative!A3","v":"Stockers on Native Pasture"},{"$f":"+StockersNative!TotRet","v":-252.69677256395306},null,null,null,{"$f":"+StockersNative!TotExp","v":271.07177256395306},null,null,null,{"$f":"+StockersNative!Price","v":2.5},{"$f":"+StockersNative!Unit","v":"CWT"},{"$f":"+IF($J30=0,0,F30/$J30)","v":108.42870902558123},null,null,null,{"$f":"+StockersNative!VarRet","v":-216.55341542109593},null,null,null,{"$f":"+StockersNative!VarExp","v":234.92841542109593},null,null,null,{"$f":"+StockersNative!Price","v":2.5},{"$f":"+StockersNative!Unit","v":"CWT"},{"$f":"+IF($J30=0,0,T30/$J30)","v":93.971366168438379}]

{"sheet":"Your Returns - Cash Rent","index":24,"n_rows":35,"n_cols":12,"rows_kept":35,"cut":false,"hidden":false,"merged":[[2,2,2,3],[2,5,2,6],[2,8,2,11]]}
["Your Returns - Cash Rent"]
[]
[null,"Quantity ","Returns Above Total Specified Expenses",null,null,"Total Direct Expenses",null,null,"Breakeven Yield to Cover Total Costs at Price Entered"]
[null,"Acres, AUs,  or Head","Total Costs","Variable Costs",null,"Total Costs","Variable Costs",null,"Price","Units","Total Costs","Variable Costs"]
["FORAGE CROPS"]
[]
[{"$f":"+CoastalEstablishFarmland!A3","v":"Coastal Bermudagrass Establishment - Farmland"},{"$f":"+CoastalEstablishFarmland!E7","v":0},{"$f":"+CoastalEstablishFarmland!YTotRet","v":0},{"$f":"+CoastalEstablishFarmland!YVarRet","v":0},null,{"$f":"+CoastalEstablishFarmland!YTotExp","v":0},{"$f":"+CoastalEstablishFarmland!YVarExp","v":0},null,{"$f":"+CoastalEstablishFarmland!YPrice","v":0},{"$f":"+CoastalEstablishFarmland!Unit","v":""},{"$f":"+IF($I7=0,0,F7/$I7)","v":0},0]
[{"$f":"+CoastalEstablishNative!A3","v":"Coastal Bermudagrass Establishment - Native Prairie"},{"$f":"+CoastalEstablishNative!E7","v":0},{"$f":"+CoastalEstablishNative!YTotRet","v":0},{"$f":"+CoastalEstablishNative!YVarRet","v":0},null,{"$f":"+CoastalEstablishNative!YTotExp","v":0},{"$f":"+CoastalEstablishNative!YVarExp","v":0},null,{"$f":"+CoastalEstablishNative!YPrice","v":0},{"$f":"+CoastalEstablishNative!Unit","v":""},0,0]
[{"$f":"+CoastalHay!A3","v":"Coastal Bermudagrass Hay"},{"$f":"+CoastalHay!E7","v":0},{"$f":"+CoastalHay!YTotRet","v":0},{"$f":"+CoastalHay!YVarRet","v":0},null,{"$f":"+CoastalHay!YTotExp","v":0},{"$f":"+CoastalHay!YVarExp","v":0},null,{"$f":"+CoastalHay!YPrice","v":0},{"$f":"+CoastalHay!Unit","v":"Roll"},0,0]
[{"$f":"+CoastalPasture!A3","v":"Coastal Bermudagrass Pasture"},{"$f":"+CoastalPasture!E7","v":0},{"$f":"+CoastalPasture!YTotRet","v":0},{"$f":"+CoastalPasture!YVarRet","v":0},null,{"$f":"+CoastalPasture!YTotExp","v":0},{"$f":"+CoastalPasture!YVarExp","v":0},null,{"$f":"+CoastalPasture!YPrice","v":0},{"$f":"+CoastalPasture!Unit","v":"AUM"},0,0]
[{"$f":"SmallGrainGrazing!A3","v":"Small Grain with Grazing"},{"$f":"SmallGrainGrazing!E7","v":0},{"$f":"SmallGrainGrazing!YTotRet","v":0},{"$f":"SmallGrainGrazing!YVarRet","v":0},null,{"$f":"SmallGrainGrazing!YTotExp","v":0},{"$f":"SmallGrainGrazing!YVarExp","v":0},null,{"$f":"SmallGrainGrazing!YPrice","v":0},{"$f":"SmallGrainGrazing!Unit","v":"Pound"},{"$f":"IF(I11=0,0,F11/I11)","v":0},{"$f":"IF(I11=0,0,G11/I11)","v":0}]
[{"$f":"CornSilageDryland!A3","v":"RR Corn Silage - Dryland"},{"$f":"CornSilageDryland!E7","v":0},{"$f":"CornSilageDryland!YTotRet","v":0},{"$f":"CornSilageDryland!YVarRet","v":0},null,{"$f":"CornSilageDryland!YTotExp","v":0},{"$f":"CornSilageDryland!YVarExp","v":0},null,{"$f":"CornSilageDryland!YPrice","v":0},{"$f":"CornSilageDryland!Unit","v":"Ton"},{"$f":"IF(I12=0,0,F12/I12)","v":0},{"$f":"IF(I12=0,0,G12/I12)","v":0}]
[{"$f":"CornSilageIrrigated!A3","v":"RR Corn Silage - Irrigated"},{"$f":"CornSilageIrrigated!E7","v":0},{"$f":"CornSilageIrrigated!YTotRet","v":0},{"$f":"CornSilageIrrigated!YVarRet","v":0},null,{"$f":"CornSilageIrrigated!YTotExp","v":0},{"$f":"CornSilageIrrigated!YVarExp","v":0},null,{"$f":"CornSilageIrrigated!YPrice","v":0},{"$f":"CornSilageIrrigated!Unit","v":"Ton"},{"$f":"IF(I13=0,0,F13/I13)","v":0},{"$f":"IF(I13=0,0,G13/I13)","v":0}]
[]
["FIELD CROPS"]
[]
[{"$f":"+Barley!A3","v":"Malting Barley"},{"$f":"+Barley!E7","v":0},{"$f":"+Barley!YTotRet","v":0},{"$f":"+Barley!YVarRet","v":0},null,{"$f":"+Barley!YTotExp","v":0},{"$f":"+Barley!YVarExp","v":0},null,{"$f":"+Barley!YPrice","v":0},{"$f":"+Barley!Unit","v":"Bushel"},{"$f":"+IF($I17=0,0,F17/$I17)","v":0},0]
[{"$f":"+Canola!A3","v":"Canola"},{"$f":"+Canola!E7","v":0},{"$f":"+Canola!YTotRet","v":0},{"$f":"+Canola!YVarRet","v":0},null,{"$f":"+Canola!YTotExp","v":0},{"$f":"+Canola!YVarExp","v":0},null,{"$f":"+Canola!YPrice","v":0},{"$f":"+Canola!Unit","v":"CWT"},0,0]
[{"$f":"+Corn!A3","v":"Herbicide Resistant Corn"},{"$f":"+Corn!E7","v":0},{"$f":"+Corn!YTotRet","v":0},{"$f":"+Corn!YVarRet","v":0},null,{"$f":"+Corn!YTotExp","v":0},{"$f":"+Corn!YVarExp","v":0},null,{"$f":"+Corn!YPrice","v":0},{"$f":"+Corn!Unit","v":"Bushel"},0,0]
[{"$f":"+CornReducedTill!A3","v":"Herbicide Resistant Corn - Reduced Tillage"},{"$f":"+CornReducedTill!E7","v":0},{"$f":"+CornReducedTill!YTotRet","v":0},{"$f":"+CornReducedTill!YVarRet","v":0},null,{"$f":"+CornReducedTill!YTotExp","v":0},{"$f":"+CornReducedTill!YVarExp","v":0},null,{"$f":"+CornReducedTill!YPrice","v":0},{"$f":"+CornReducedTill!Unit","v":"Bushel"},0,0]
[{"$f":"+Cotton!A3","v":"Stacked Cotton"},{"$f":"+Cotton!E7","v":0},{"$f":"+Cotton!YTotRet","v":0},{"$f":"+Cotton!YVarRet","v":0},null,{"$f":"+Cotton!YTotExp","v":0},{"$f":"+Cotton!YVarExp","v":0},null,{"$f":"+Cotton!YPrice","v":0},{"$f":"+Cotton!Unit","v":"Pound"},0,0]
[{"$f":"+OatsGrain!A3","v":"Oats for Grain"},{"$f":"+OatsGrain!E7","v":0},{"$f":"+OatsGrain!YTotRet","v":0},{"$f":"+OatsGrain!YVarRet","v":0},null,{"$f":"+OatsGrain!YTotExp","v":0},{"$f":"+OatsGrain!YVarExp","v":0},null,{"$f":"+OatsGrain!YPrice","v":0},{"$f":"+OatsGrain!Unit","v":"Bushel"},0,0]
[{"$f":"+Sorghum!A3","v":"Grain Sorghum"},{"$f":"+Sorghum!E7","v":0},{"$f":"+Sorghum!YTotRet","v":0},{"$f":"+Sorghum!YVarRet","v":0},null,{"$f":"+Sorghum!YTotExp","v":0},{"$f":"+Sorghum!YVarExp","v":0},null,{"$f":"+Sorghum!YPrice","v":0},{"$f":"+Sorghum!Unit","v":"CWT"},{"$f":"+IF($I23=0,0,F23/$I23)","v":0},{"$f":"+IF($I23=0,0,G23/$I23)","v":0}]
[{"$f":"+Wheat!A3","v":"Hard Red Winter Wheat"},{"$f":"+Wheat!E7","v":0},{"$f":"+Wheat!YTotRet","v":0},{"$f":"+Wheat!YVarRet","v":0},null,{"$f":"+Wheat!YTotExp","v":0},{"$f":"+Wheat!YVarExp","v":0},null,{"$f":"+Wheat!YPrice","v":0},{"$f":"+Wheat!Unit","v":"Bushel"},{"$f":"+IF($I24=0,0,F24/$I24)","v":0},0]
[]
["LIVESTOCK"]
[]
[{"$f":"+CowCalfImprove!A3","v":"Cow-Calf Improved Pasture"},{"$f":"+CowCalfImprove!E7","v":0},{"$f":"+CowCalfImprove!YTotRet","v":0},{"$f":"+CowCalfImprove!YVarRet","v":0},null,{"$f":"+CowCalfImprove!YTotExp","v":0},{"$f":"+CowCalfImprove!YVarExp","v":0},null,{"$f":"+CowCalfImprove!YPrice","v":0},{"$f":"+CowCalfImprove!Unit","v":"CWT"},{"$f":"+IF($I28=0,0,F28/$I28)","v":0},0]
[{"$f":"CowCalfNative!A3","v":"Cow-Calf Native Pasture"},{"$f":"CowCalfNative!E7","v":0},{"$f":"CowCalfNative!YTotRet","v":0},{"$f":"CowCalfNative!YVarRet","v":0},null,{"$f":"CowCalfNative!YTotExp","v":0},{"$f":"CowCalfNative!YVarExp","v":0},null,{"$f":"CowCalfNative!YPrice","v":0},{"$f":"CowCalfNative!Unit","v":"CWT"},{"$f":"IF(I29=0,0,F29/I29)","v":0},{"$f":"IF(I29=0,0,G29/I29)","v":0}]
[{"$f":"+StockersNative!A3","v":"Stockers on Native Pasture"},{"$f":"+StockersNative!E7","v":0},{"$f":"+StockersNative!YTotRet","v":0},{"$f":"+StockersNative!YVarRet","v":0},null,{"$f":"+StockersNative!YTotExp","v":0},{"$f":"+StockersNative!YVarExp","v":0},null,{"$f":"+StockersNative!YPrice","v":0},{"$f":"+StockersNative!Unit","v":"CWT"},0,0]
[]
["OTHER BUDGETS"]
[]
[{"$f":"+'Livestock Budget'!A3","v":"Livestock Budget"},{"$f":"+'Livestock Budget'!D5","v":0},{"$f":"+'Livestock Budget'!YTotRet","v":0},{"$f":"+'Livestock Budget'!YVarRet","v":0},null,{"$f":"+'Livestock Budget'!YTotExp","v":0},{"$f":"+'Livestock Budget'!YVarExp","v":0},null,{"$f":"+'Livestock Budget'!YPrice","v":0},{"$f":"+'Livestock Budget'!Unit","v":"CWT"},{"$f":"+IF($I34=0,0,F34/$I34)","v":0},{"$f":"+IF($I34=0,0,G34/$I34)","v":0}]
[{"$f":"+'Crop Budget'!A3","v":"Crop Enterprise"},{"$f":"+'Crop Budget'!D5","v":0},{"$f":"+'Crop Budget'!YTotRet","v":0},{"$f":"+'Crop Budget'!YVarRet","v":0},null,{"$f":"+'Crop Budget'!YTotExp","v":0},{"$f":"+'Crop Budget'!YVarExp","v":0},null,{"$f":"+'Crop Budget'!YPrice","v":0},{"$f":"+'Crop Budget'!Unit","v":"Cwt,lb,etc"},{"$f":"+IF($I35=0,0,F35/$I35)","v":0},{"$f":"+IF($I35=0,0,G35/$I35)","v":0}]

{"sheet":"Your Returns-Share Rent","index":25,"n_rows":47,"n_cols":29,"rows_kept":47,"cut":false,"hidden":false,"merged":[[2,24,2,28],[2,2,2,4],[2,6,2,8],[2,10,2,14],[2,16,2,18],[2,20,2,22]]}
["Your Returns - Share Rent"]
[]
["Variable Costs to the right of Total Costs","Quantity ","Returns Above Total Specified Expenses",null,null,null,"Total Direct Expenses",null,null,null,"Breakeven Yield to Cover Total Costs at Price Entered",null,null,null,null,null,"Returns Above Variable Specified Expenses",null,null,null,"Variable Direct Expenses",null,null,null,"Breakeven Yield to Cover Variavle Costs at Price Entered"]
[null,"Acres, AUs,  or Head","Total","Tenant","Landlord",null,"Total","Tenant","Landlord",null,"Price","Units","Total","Tenant","Landlord",null,"Total","Tenant","Landlord",null,"Total","Tenant","Landlord",null,"Price","Units","Total","Tenant","Landlord"]
["FORAGE CROPS"]
[]
[{"$f":"+CoastalEstablishFarmland!A3","v":"Coastal Bermudagrass Establishment - Farmland"},{"$f":"+CoastalEstablishFarmland!E7","v":0},{"$f":"+CoastalEstablishFarmland!YTotRet","v":0},{"$f":"+CoastalEstablishFarmland!YTTotRet","v":0},{"$f":"+CoastalEstablishFarmland!YLTotRet","v":0},null,{"$f":"+CoastalEstablishFarmland!YTotExp","v":0},{"$f":"+CoastalEstablishFarmland!YTTotExp","v":0},{"$f":"+CoastalEstablishFarmland!YLTotExp","v":0},null,{"$f":"+CoastalEstablishFarmland!YPrice","v":0},{"$f":"+CoastalEstablishFarmland!Unit","v":""},{"$f":"+IF($K7=0,0,G7/$K7)","v":0},0,0,null,{"$f":"+CoastalEstablishFarmland!YVarRet","v":0},{"$f":"+CoastalEstablishFarmland!YTVarRet","v":0},{"$f":"+CoastalEstablishFarmland!YLVarRet","v":0},null,{"$f":"+CoastalEstablishFarmland!YVarExp","v":0},{"$f":"+CoastalEstablishFarmland!YTVarExp","v":0},{"$f":"+CoastalEstablishFarmland!YLVarExp","v":0},null,{"$f":"+CoastalEstablishFarmland!YPrice","v":0},{"$f":"+CoastalEstablishFarmland!Unit","v":""},{"$f":"+IF($K7=0,0,U7/$K7)","v":0},0,0]
[{"$f":"+CoastalEstablishNative!A3","v":"Coastal Bermudagrass Establishment - Native Prairie"},{"$f":"+CoastalEstablishNative!E7","v":0},{"$f":"+CoastalEstablishNative!YTotRet","v":0},{"$f":"+CoastalEstablishNative!YTTotRet","v":0},{"$f":"+CoastalEstablishNative!YLTotRet","v":0},null,{"$f":"+CoastalEstablishNative!YTotExp","v":0},{"$f":"+CoastalEstablishNative!YTTotExp","v":0},{"$f":"+CoastalEstablishNative!YLTotExp","v":0},null,{"$f":"+CoastalEstablishNative!YPrice","v":0},{"$f":"+CoastalEstablishNative!Unit","v":""},0,0,0,null,{"$f":"+CoastalEstablishNative!YVarRet","v":0},{"$f":"+CoastalEstablishNative!YTVarRet","v":0},{"$f":"+CoastalEstablishNative!YLVarRet","v":0},null,{"$f":"+CoastalEstablishNative!YVarExp","v":0},{"$f":"+CoastalEstablishNative!YTVarExp","v":0},{"$f":"+CoastalEstablishNative!YLVarExp","v":0},null,{"$f":"+CoastalEstablishNative!YPrice","v":0},{"$f":"+CoastalEstablishNative!Unit","v":""},0,0,0]
[{"$f":"+CoastalHay!A3","v":"Coastal Bermudagrass Hay"},{"$f":"+CoastalHay!E7","v":0},{"$f":"+CoastalHay!YTotRet","v":0},{"$f":"+CoastalHay!YTTotRet","v":0},{"$f":"+CoastalHay!YLTotRet","v":0},null,{"$f":"+CoastalHay!YTotExp","v":0},{"$f":"+CoastalHay!YTTotExp","v":0},{"$f":"+CoastalHay!YLTotExp","v":0},null,{"$f":"+CoastalHay!YPrice","v":0},{"$f":"+CoastalHay!Unit","v":"Roll"},0,0,0,null,{"$f":"+CoastalHay!YVarRet","v":0},{"$f":"+CoastalHay!YTVarRet","v":0},{"$f":"+CoastalHay!YLVarRet","v":0},null,{"$f":"+CoastalHay!YVarExp","v":0},{"$f":"+CoastalHay!YTVarExp","v":0},{"$f":"+CoastalHay!YLVarExp","v":0},null,{"$f":"+CoastalHay!YPrice","v":0},{"$f":"+CoastalHay!Unit","v":"Roll"},0,0,0]
[{"$f":"+CoastalPasture!A3","v":"Coastal Bermudagrass Pasture"},{"$f":"+CoastalPasture!E7","v":0},{"$f":"+CoastalPasture!YTotRet","v":0},{"$f":"+CoastalPasture!YTTotRet","v":0},{"$f":"+CoastalPasture!YLTotRet","v":0},null,{"$f":"+CoastalPasture!YTotExp","v":0},{"$f":"+CoastalPasture!YTTotExp","v":0},{"$f":"+CoastalPasture!YLTotExp","v":0},null,{"$f":"+CoastalPasture!YPrice","v":0},{"$f":"+CoastalPasture!Unit","v":"AUM"},0,0,0,null,{"$f":"+CoastalPasture!YVarRet","v":0},{"$f":"+CoastalPasture!YTVarRet","v":0},{"$f":"+CoastalPasture!YLVarRet","v":0},null,{"$f":"+CoastalPasture!YVarExp","v":0},{"$f":"+CoastalPasture!YTVarExp","v":0},{"$f":"+CoastalPasture!YLVarExp","v":0},null,{"$f":"+CoastalPasture!YPrice","v":0},{"$f":"+CoastalPasture!Unit","v":"AUM"},0,0,0]
[{"$f":"SmallGrainGrazing!A3","v":"Small Grain with Grazing"},{"$f":"SmallGrainGrazing!E7","v":0},{"$f":"SmallGrainGrazing!YTotRet","v":0},{"$f":"SmallGrainGrazing!YTTotRet","v":0},{"$f":"SmallGrainGrazing!YLTotRet","v":0},null,{"$f":"SmallGrainGrazing!YTotExp","v":0},{"$f":"SmallGrainGrazing!YTTotExp","v":0},{"$f":"SmallGrainGrazing!YLTotExp","v":0},null,{"$f":"SmallGrainGrazing!YPrice","v":0},{"$f":"SmallGrainGrazing!Unit","v":"Pound"},{"$f":"IF(K11=0,0,G11/K11)","v":0},{"$f":"IF(K11=0,0,H11/K11)","v":0},{"$f":"IF(K11=0,0,I11/K11)","v":0},null,{"$f":"SmallGrainGrazing!YVarRet","v":0},{"$f":"SmallGrainGrazing!YTVarRet","v":0},{"$f":"SmallGrainGrazing!YLVarRet","v":0},null,{"$f":"SmallGrainGrazing!YVarExp","v":0},{"$f":"SmallGrainGrazing!YTVarExp","v":0},{"$f":"SmallGrainGrazing!YLVarExp","v":0},null,{"$f":"SmallGrainGrazing!YPrice","v":0},{"$f":"SmallGrainGrazing!Unit","v":"Pound"},{"$f":"IF(K11=0,0,U11/K11)","v":0},{"$f":"IF(K11=0,0,V11/K11)","v":0},{"$f":"IF(K11=0,0,W11/K11)","v":0}]
[{"$f":"CornSilageDryland!A3","v":"RR Corn Silage - Dryland"},{"$f":"CornSilageDryland!E7","v":0},{"$f":"CornSilageDryland!YTotRet","v":0},{"$f":"CornSilageDryland!YTTotRet","v":0},{"$f":"CornSilageDryland!YLTotRet","v":0},null,{"$f":"CornSilageDryland!YTotExp","v":0},{"$f":"CornSilageDryland!YTTotExp","v":0},{"$f":"CornSilageDryland!YLTotExp","v":0},null,{"$f":"CornSilageDryland!YPrice","v":0},{"$f":"CornSilageDryland!Unit","v":"Ton"},{"$f":"IF(K12=0,0,G12/K12)","v":0},{"$f":"IF(K12=0,0,H12/K12)","v":0},{"$f":"IF(K12=0,0,I12/K12)","v":0},null,{"$f":"CornSilageDryland!YVarRet","v":0},{"$f":"CornSilageDryland!YTVarRet","v":0},{"$f":"CornSilageDryland!YLVarRet","v":0},null,{"$f":"CornSilageDryland!YVarExp","v":0},{"$f":"CornSilageDryland!YTVarExp","v":0},{"$f":"CornSilageDryland!YLVarExp","v":0},null,{"$f":"CornSilageDryland!YPrice","v":0},{"$f":"CornSilageDryland!Unit","v":"Ton"},{"$f":"IF(K12=0,0,U12/K12)","v":0},{"$f":"IF(K12=0,0,V12/K12)","v":0},{"$f":"IF(K12=0,0,W12/K12)","v":0}]
[{"$f":"CornSilageIrrigated!A3","v":"RR Corn Silage - Irrigated"},{"$f":"CornSilageIrrigated!E7","v":0},{"$f":"CornSilageIrrigated!YTotRet","v":0},{"$f":"CornSilageIrrigated!YTTotRet","v":0},{"$f":"CornSilageIrrigated!YLTotRet","v":0},null,{"$f":"CornSilageIrrigated!YTotExp","v":0},{"$f":"CornSilageIrrigated!YTTotExp","v":0},{"$f":"CornSilageIrrigated!YLTotExp","v":0},null,{"$f":"CornSilageIrrigated!YPrice","v":0},{"$f":"CornSilageIrrigated!Unit","v":"Ton"},{"$f":"IF(K13=0,0,G13/K13)","v":0},{"$f":"IF(K13=0,0,H13/K13)","v":0},{"$f":"IF(K13=0,0,I13/K13)","v":0},null,{"$f":"CornSilageIrrigated!YVarRet","v":0},{"$f":"CornSilageIrrigated!YTVarRet","v":0},{"$f":"CornSilageIrrigated!YLVarRet","v":0},null,{"$f":"CornSilageIrrigated!YVarExp","v":0},{"$f":"CornSilageIrrigated!YTVarExp","v":0},{"$f":"CornSilageIrrigated!YLVarExp","v":0},null,{"$f":"CornSilageIrrigated!YPrice","v":0},{"$f":"CornSilageIrrigated!Unit","v":"Ton"},{"$f":"IF(K13=0,0,U13/K13)","v":0},{"$f":"IF(K13=0,0,V13/K13)","v":0},{"$f":"IF(K13=0,0,W13/K13)","v":0}]
[]
["FIELD CROPS"]
[]
[{"$f":"+Barley!A3","v":"Malting Barley"},{"$f":"+Barley!E7","v":0},{"$f":"+Barley!YTotRet","v":0},{"$f":"+Barley!YTTotRet","v":0},{"$f":"+Barley!YLTotRet","v":0},null,{"$f":"+Barley!YTotExp","v":0},{"$f":"+Barley!YTTotExp","v":0},{"$f":"+Barley!YLTotExp","v":0},null,{"$f":"+Barley!YPrice","v":0},{"$f":"+Barley!Unit","v":"Bushel"},{"$f":"+IF($K17=0,0,G17/$K17)","v":0},0,0,null,{"$f":"+Barley!YVarRet","v":0},{"$f":"+Barley!YTVarRet","v":0},{"$f":"+Barley!YLVarRet","v":0},null,{"$f":"+Barley!YVarExp","v":0},{"$f":"+Barley!YTVarExp","v":0},{"$f":"+Barley!YLVarExp","v":0},null,{"$f":"+Barley!YPrice","v":0},{"$f":"+Barley!Unit","v":"Bushel"},{"$f":"+IF($K17=0,0,U17/$K17)","v":0},0,0]
[{"$f":"+Canola!A3","v":"Canola"},{"$f":"+Canola!E7","v":0},{"$f":"+Canola!YTotRet","v":0},{"$f":"+Canola!YTTotRet","v":0},{"$f":"+Canola!YLTotRet","v":0},null,{"$f":"+Canola!YTotExp","v":0},{"$f":"+Canola!YTTotExp","v":0},{"$f":"+Canola!YLTotExp","v":0},null,{"$f":"+Canola!YPrice","v":0},{"$f":"+Canola!Unit","v":"CWT"},0,0,0,null,{"$f":"+Canola!YVarRet","v":0},{"$f":"+Canola!YTVarRet","v":0},{"$f":"+Canola!YLVarRet","v":0},null,{"$f":"+Canola!YVarExp","v":0},{"$f":"+Canola!YTVarExp","v":0},{"$f":"+Canola!YLVarExp","v":0},null,{"$f":"+Canola!YPrice","v":0},{"$f":"+Canola!Unit","v":"CWT"},0,0,0]
[{"$f":"+Corn!A3","v":"Herbicide Resistant Corn"},{"$f":"+Corn!E7","v":0},{"$f":"+Corn!YTotRet","v":0},{"$f":"+Corn!YTTotRet","v":0},{"$f":"+Corn!YLTotRet","v":0},null,{"$f":"+Corn!YTotExp","v":0},{"$f":"+Corn!YTTotExp","v":0},{"$f":"+Corn!YLTotExp","v":0},null,{"$f":"+Corn!YPrice","v":0},{"$f":"+Corn!Unit","v":"Bushel"},0,0,0,null,{"$f":"+Corn!YVarRet","v":0},{"$f":"+Corn!YTVarRet","v":0},{"$f":"+Corn!YLVarRet","v":0},null,{"$f":"+Corn!YVarExp","v":0},{"$f":"+Corn!YTVarExp","v":0},{"$f":"+Corn!YLVarExp","v":0},null,{"$f":"+Corn!YPrice","v":0},{"$f":"+Corn!Unit","v":"Bushel"},0,0,0]
[{"$f":"+CornReducedTill!A3","v":"Herbicide Resistant Corn - Reduced Tillage"},{"$f":"+CornReducedTill!E7","v":0},{"$f":"+CornReducedTill!YTotRet","v":0},{"$f":"+CornReducedTill!YTTotRet","v":0},{"$f":"+CornReducedTill!YLTotRet","v":0},null,{"$f":"+CornReducedTill!YTotExp","v":0},{"$f":"+CornReducedTill!YTTotExp","v":0},{"$f":"+CornReducedTill!YLTotExp","v":0},null,{"$f":"+CornReducedTill!YPrice","v":0},{"$f":"+CornReducedTill!Unit","v":"Bushel"},0,0,0,null,{"$f":"+CornReducedTill!YVarRet","v":0},{"$f":"+CornReducedTill!YTVarRet","v":0},{"$f":"+CornReducedTill!YLVarRet","v":0},null,{"$f":"+CornReducedTill!YVarExp","v":0},{"$f":"+CornReducedTill!YTVarExp","v":0},{"$f":"+CornReducedTill!YLVarExp","v":0},null,{"$f":"+CornReducedTill!YPrice","v":0},{"$f":"+CornReducedTill!Unit","v":"Bushel"},0,0,0]
[{"$f":"+Cotton!A3","v":"Stacked Cotton"},{"$f":"+Cotton!E7","v":0},{"$f":"+Cotton!YTotRet","v":0},{"$f":"+Cotton!YTTotRet","v":0},{"$f":"+Cotton!YLTotRet","v":0},null,{"$f":"+Cotton!YTotExp","v":0},{"$f":"+Cotton!YTTotExp","v":0},{"$f":"+Cotton!YLTotExp","v":0},null,{"$f":"+Cotton!YPrice","v":0},{"$f":"+Cotton!Unit","v":"Pound"},0,0,0,null,{"$f":"+Cotton!YVarRet","v":0},{"$f":"+Cotton!YTVarRet","v":0},{"$f":"+Cotton!YLVarRet","v":0},null,{"$f":"+Cotton!YVarExp","v":0},{"$f":"+Cotton!YTVarExp","v":0},{"$f":"+Cotton!YLVarExp","v":0},null,{"$f":"+Cotton!YPrice","v":0},{"$f":"+Cotton!Unit","v":"Pound"},0,0,0]
[{"$f":"+OatsGrain!A3","v":"Oats for Grain"},{"$f":"+OatsGrain!E7","v":0},{"$f":"+OatsGrain!YTotRet","v":0},{"$f":"+OatsGrain!YTTotRet","v":0},{"$f":"+OatsGrain!YLTotRet","v":0},null,{"$f":"+OatsGrain!YTotExp","v":0},{"$f":"+OatsGrain!YTTotExp","v":0},{"$f":"+OatsGrain!YLTotExp","v":0},null,{"$f":"+OatsGrain!YPrice","v":0},{"$f":"+OatsGrain!Unit","v":"Bushel"},{"$f":"+IF($K22=0,0,G22/$K22)","v":0},0,0,null,{"$f":"+OatsGrain!YVarRet","v":0},{"$f":"+OatsGrain!YTVarRet","v":0},{"$f":"+OatsGrain!YLVarRet","v":0},null,{"$f":"+OatsGrain!YVarExp","v":0},{"$f":"+OatsGrain!YTVarExp","v":0},{"$f":"+OatsGrain!YLVarExp","v":0},null,{"$f":"+OatsGrain!YPrice","v":0},{"$f":"+OatsGrain!Unit","v":"Bushel"},{"$f":"+IF($K22=0,0,U22/$K22)","v":0},0,0]
[{"$f":"+Sorghum!A3","v":"Grain Sorghum"},{"$f":"+Sorghum!E7","v":0},{"$f":"+Sorghum!YTotRet","v":0},{"$f":"+Sorghum!YTTotRet","v":0},{"$f":"+Sorghum!YLTotRet","v":0},null,{"$f":"+Sorghum!YTotExp","v":0},{"$f":"+Sorghum!YTTotExp","v":0},{"$f":"+Sorghum!YLTotExp","v":0},null,{"$f":"+Sorghum!YPrice","v":0},{"$f":"+Sorghum!Unit","v":"CWT"},{"$f":"+IF($K23=0,0,G23/$K23)","v":0},{"$f":"+IF($K23=0,0,H23/$K23)","v":0},{"$f":"+IF($K23=0,0,I23/$K23)","v":0},null,{"$f":"+Sorghum!YVarRet","v":0},{"$f":"+Sorghum!YTVarRet","v":0},{"$f":"+Sorghum!YLVarRet","v":0},null,{"$f":"+Sorghum!YVarExp","v":0},{"$f":"+Sorghum!YTVarExp","v":0},{"$f":"+Sorghum!YLVarExp","v":0},null,{"$f":"+Sorghum!YPrice","v":0},{"$f":"+Sorghum!Unit","v":"CWT"},{"$f":"+IF($K23=0,0,U23/$K23)","v":0},{"$f":"+IF($K23=0,0,V23/$K23)","v":0},{"$f":"+IF($K23=0,0,W23/$K23)","v":0}]
[{"$f":"+Wheat!A3","v":"Hard Red Winter Wheat"},{"$f":"+Wheat!E7","v":0},{"$f":"+Wheat!YTotRet","v":0},{"$f":"+Wheat!YTTotRet","v":0},{"$f":"+Wheat!YLTotRet","v":0},null,{"$f":"+Wheat!YTotExp","v":0},{"$f":"+Wheat!YTTotExp","v":0},{"$f":"+Wheat!YLTotExp","v":0},null,{"$f":"+Wheat!YPrice","v":0},{"$f":"+Wheat!Unit","v":"Bushel"},{"$f":"+IF($K24=0,0,G24/$K24)","v":0},{"$f":"+IF($K24=0,0,H24/$K24)","v":0},{"$f":"+IF($K24=0,0,I24/$K24)","v":0},null,{"$f":"+Wheat!YVarRet","v":0},{"$f":"+Wheat!YTVarRet","v":0},{"$f":"+Wheat!YLVarRet","v":0},null,{"$f":"+Wheat!YVarExp","v":0},{"$f":"+Wheat!YTVarExp","v":0},{"$f":"+Wheat!YLVarExp","v":0},null,{"$f":"+Wheat!YPrice","v":0},{"$f":"+Wheat!Unit","v":"Bushel"},{"$f":"+IF($K24=0,0,U24/$K24)","v":0},{"$f":"+IF($K24=0,0,V24/$K24)","v":0},{"$f":"+IF($K24=0,0,W24/$K24)","v":0}]
[]
["LIVESTOCK"]
[]
[{"$f":"+CowCalfImprove!A3","v":"Cow-Calf Improved Pasture"},{"$f":"+CowCalfImprove!E7","v":0},{"$f":"+CowCalfImprove!YTotRet","v":0},null,null,null,{"$f":"+CowCalfImprove!YTotExp","v":0},null,null,null,{"$f":"+CowCalfImprove!YPrice","v":0},{"$f":"+CowCalfImprove!Unit","v":"CWT"},{"$f":"+IF($K28=0,0,G28/$K28)","v":0},null,null,null,{"$f":"+CowCalfImprove!YVarRet","v":0},null,null,null,{"$f":"+CowCalfImprove!YVarExp","v":0},null,null,null,{"$f":"+CowCalfImprove!YPrice","v":0},{"$f":"+CowCalfImprove!Unit","v":"CWT"},{"$f":"+IF($K28=0,0,U28/$K28)","v":0}]
[{"$f":"CowCalfNative!A3","v":"Cow-Calf Native Pasture"},{"$f":"CowCalfNative!E7","v":0},{"$f":"CowCalfNative!YTotRet","v":0},null,null,null,{"$f":"CowCalfNative!YTotExp","v":0},null,null,null,{"$f":"CowCalfNative!YPrice","v":0},{"$f":"CowCalfNative!Unit","v":"CWT"},{"$f":"IF(K29=0,0,G29/K29)","v":0},null,null,null,{"$f":"CowCalfNative!YVarRet","v":0},null,null,null,{"$f":"CowCalfNative!YVarExp","v":0},null,null,null,{"$f":"CowCalfNative!YPrice","v":0},{"$f":"CowCalfNative!Unit","v":"CWT"},{"$f":"IF(K29=0,0,U29/K29)","v":0}]
[{"$f":"+StockersNative!A3","v":"Stockers on Native Pasture"},{"$f":"+StockersNative!E7","v":0},{"$f":"+StockersNative!YTotRet","v":0},null,null,null,{"$f":"+StockersNative!YTotExp","v":0},null,null,null,{"$f":"+StockersNative!YPrice","v":0},{"$f":"+StockersNative!Unit","v":"CWT"},{"$f":"+IF($K30=0,0,G30/$K30)","v":0},null,null,null,{"$f":"+StockersNative!YVarRet","v":0},null,null,null,{"$f":"+StockersNative!YVarExp","v":0},null,null,null,{"$f":"+StockersNative!YPrice","v":0},{"$f":"+StockersNative!Unit","v":"CWT"},0]
[]
[]
[]
[]
[]
[]
[]
[]
[]
[]
[null,null,null,null,null,null,null,null,null,null,null,null,null,null,{"$f":"+IF($K22=0,0,I22/$K22)","v":0}]
[]
[]
[]
[null,null,null,null,null,null,null,null,null,null,null,null,null,null,{"$f":"+IF($K28=0,0,I28/$K28)","v":0}]
[null,null,null,null,null,null,null,null,null,null,null,null,null,null,{"$f":"+IF($K30=0,0,I30/$K30)","v":0}]
[null,null,null,null,null,null,null,null,null,null,null,null,null,null,{"$f":"+IF(#REF!=0,0,#REF!/#REF!)","v":{"$error":"#REF!"}}]