{"text_format":"1","workbook":"xlsx","n_sheets":30,"sheets":["Instructions","Menu","Universal Input Prices","Irr Alfalfa","Irr Canola","Irr Corn","Irr Corn Silage","Irr Cotton","Irr Peanuts","Irr Sorghum","Irr Sorghum Seed","Irr Sorghum Silage","Irr Sorghum Sudangrass","Irr Soybeans","Irr Sunflowers-Confection","Irr Sunflowers-Oilseed","Irr Triticale Silage","Irr Wheat","Irr Other Crop","Dry Canola","Dry Cotton","Dry Sorghum","Dry Sorghum Sudangrass","Dry Sunflowers-Oilseed","Dry Wheat","Dry Other Crop","Break-Even Comparison","Comparative Returns","Irrigation Analysis","Graphs"],"not_rendered":{"charts":2,"images":35,"macros":1,"external_links":0,"defined_names":88,"comments":24,"pivot_tables":0},"unopened":[],"bounds":{"document_bytes":16777216,"sheet_cells":100000,"rows_first":2000,"rows_last":500,"rows_between":2000,"halvings":0,"cell_chars":16384,"cell_head_chars":4096},"cells_cut":0,"cells_raw":0,"read":"whole","date_system":"1900"}

{"sheet":"Instructions","index":0,"n_rows":59,"n_cols":3,"rows_kept":59,"cut":false,"hidden":false,"merged":[[53,0,55,8],[58,0,59,8],[21,0,24,5],[35,0,38,8],[41,0,44,8],[57,1,57,8],[46,1,46,8],[47,0,50,8],[52,1,52,8],[5,9,5,14],[40,1,40,8],[26,1,26,8],[15,0,19,8],[14,1,14,8],[8,2,12,8],[31,0,33,8],[27,0,29,8]]}
[]
[]
[]
[]
[]
[]
[]
[null,"Contact Us","Irrigation Spreadsheet Project"]
{"$rows_left_out":52}
{"sheet":"Menu","index":1,"n_rows":27,"n_cols":4,"rows_kept":27,"cut":false,"hidden":false,"merged":[[2,3,2,9]]}
[]
[]
[null,"Budgets",null,"Analysis Selection"]
[null,{"$f":"'Irr Alfalfa'!$A$3","v":"Irrigated Alfalfa "}]
[null,{"$f":"'Irr Canola'!$A$3","v":"Irrigated Canola"}]
[null,{"$f":"'Irr Corn'!$A$3","v":"Irrigated Corn"}]
[null,{"$f":"'Irr Corn Silage'!$A$3","v":"Irrigated Corn Silage"}]
[null,{"$f":"'Irr Cotton'!$A$3","v":"Irrigated Cotton"}]
{"$rows_left_out":20}
{"sheet":"Universal Input Prices","index":2,"n_rows":46,"n_cols":10,"rows_kept":46,"cut":false,"hidden":false,"merged":[]}
[]
["Basic Universal Input Prices"]
["Commodity","Price","Unit"]
["Alfalfa",354,"ton"]
["Canola",23.4,"cwt"]
["Corn",6.46,"bu"]
["Corn Silage",68.83,"ton"]
["Cotton",0.8,"lb"]
{"$rows_left_out":39}
{"sheet":"Irr Alfalfa","index":3,"n_rows":66,"n_cols":9,"rows_kept":66,"cut":false,"hidden":false,"merged":[[1,0,1,7],[2,0,2,7],[3,0,3,7]]}
[]
[" Estimated Costs and Returns per Acre"]
["Irrigated Alfalfa "]
["Projected for 2023"]
[null,null,null,null,null,null,null,"Rental Agreement","Share"]
["Item ","Quantity","Unit","Price","Landlord"," ",null,"Cash","Cash"]
[null,null,null,null,"Share","Total","Tenant","Landlord"]
["Income"]
{"$rows_left_out":59}
{"sheet":"Irr Canola","index":4,"n_rows":66,"n_cols":9,"rows_kept":66,"cut":false,"hidden":false,"merged":[[1,0,1,7],[2,0,2,7],[3,0,3,7]]}
[]
[" Estimated Costs and Returns per Acre"]
["Irrigated Canola"]
["Projected for 2023"]
[null,null,null,null,null,null,null,"Rental Agreement","Share"]
["Item ","Quantity","Unit","Price","Landlord"," ",null,"Share","Cash"]
[null,null,null,null,"Share","Total","Tenant","Landlord"]
["Income"]
{"$rows_left_out":59}
{"sheet":"Irr Corn","index":5,"n_rows":64,"n_cols":9,"rows_kept":64,"cut":false,"hidden":false,"merged":[[1,0,1,7],[2,0,2,7],[3,0,3,7]]}
[]
[" Estimated Costs and Returns per Acre"]
["Irrigated Corn"]
["Projected for 2023"]
[null,null,null,null,null,null,null,"Rental Agreement","Share"]
["Item ","Quantity","Unit","Price","Landlord"," ",null,"Share","Cash"]
[null,null,null,null,"Share","Total","Tenant","Landlord"]
["Income"]
{"$rows_left_out":57}
{"sheet":"Irr Corn Silage","index":6,"n_rows":64,"n_cols":9,"rows_kept":64,"cut":false,"hidden":false,"merged":[[1,0,1,7],[2,0,2,7],[3,0,3,7]]}
[]
[" Estimated Costs and Returns per Acre"]
["Irrigated Corn Silage"]
["Projected for 2023"]
[null,null,null,null,null,null,null,"Rental Agreement","Share"]
["Item ","Quantity","Unit","Price","Landlord"," ",null,"Share","Cash"]
[null,null,null,null,"Share","Total","Tenant","Landlord"]
["Income"]
{"$rows_left_out":57}
{"sheet":"Irr Cotton","index":7,"n_rows":69,"n_cols":9,"rows_kept":69,"cut":false,"hidden":false,"merged":[[1,0,1,7],[2,0,2,7],[3,0,3,7]]}
[]
[" Estimated Costs and Returns per Acre"]
["Irrigated Cotton"]
["Projected for 2023"]
[null,null,null,null,null,null,null,"Rental Agreement","Share"]
["Item ","Quantity","Unit","Price","Landlord"," ",null,"Share","Cash"]
[null,null,null,null,"Share","Total","Tenant","Landlord"]
["Income"]
{"$rows_left_out":62}
{"sheet":"Irr Peanuts","index":8,"n_rows":68,"n_cols":9,"rows_kept":68,"cut":false,"hidden":false,"merged":[[1,0,1,7],[2,0,2,7],[3,0,3,7]]}
[]
[" Estimated Costs and Returns per Acre"]
["Irrigated Peanuts"]
["Projected for 2023"]
[null,null,null,null,null,null,null,"Rental Agreement","Share"]
["Item ","Quantity","Unit","Price","Landlord"," ",null,null,"Cash"]
[null,null,null,null,"Share","Total","Tenant","Landlord"]
["Income"]
{"$rows_left_out":61}
{"sheet":"Irr Sorghum","index":9,"n_rows":63,"n_cols":9,"rows_kept":63,"cut":false,"hidden":false,"merged":[[1,0,1,7],[2,0,2,7],[3,0,3,7]]}
[]
[" Estimated Costs and Returns per Acre"]
["Irrigated Sorghum"]
["Projected for 2023"]
[null,null,null,null,null,null,null,"Rental Agreement","Share"]
["Item ","Quantity","Unit","Price","Landlord"," ",null,"Share","Cash"]
[null,null,null,null,"Share","Total","Tenant","Landlord"]
["Income"]
{"$rows_left_out":56}
{"sheet":"Irr Sorghum Seed","index":10,"n_rows":63,"n_cols":9,"rows_kept":63,"cut":false,"hidden":false,"merged":[[1,0,1,7],[2,0,2,7],[3,0,3,7]]}
[]
[" Estimated Costs and Returns per Acre"]
["Irrigated Sorghum Seed "]
["Projected for 2023"]
[null,null,null,null,null,null,null,"Rental Agreement","Share"]
["Item ","Quantity","Unit","Price","Landlord"," ",null,"Share","Cash"]
[null,null,null,null,"Share","Total","Tenant","Landlord"]
["Income"]
{"$rows_left_out":56}
{"sheet":"Irr Sorghum Silage","index":11,"n_rows":63,"n_cols":9,"rows_kept":63,"cut":false,"hidden":false,"merged":[[1,0,1,7],[2,0,2,7],[3,0,3,7]]}
[]
[" Estimated Costs and Returns per Acre"]
["Irrigated Sorghum Silage"]
["Projected for 2023"]
[null,null,null,null,null,null,null,"Rental Agreement","Share"]
["Item ","Quantity","Unit","Price","Landlord"," ",null,"Share","Cash"]
[null,null,null,null,"Share","Total","Tenant","Landlord"]
["Income"]
{"$rows_left_out":56}
{"sheet":"Irr Sorghum Sudangrass","index":12,"n_rows":63,"n_cols":9,"rows_kept":63,"cut":false,"hidden":false,"merged":[[1,0,1,7],[2,0,2,7],[3,0,3,7]]}
[]
[" Estimated Costs and Returns per Acre"]
["Irrigated Sorghum Sudangrass"]
["Projected for 2023"]
[null,null,null,null,null,null,null,"Rental Agreement","Share"]
["Item ","Quantity","Unit","Price","Landlord"," ",null,"Share","Cash"]
[null,null,null,null,"Share","Total","Tenant","Landlord"]
["Income"]
{"$rows_left_out":56}
{"sheet":"Irr Soybeans","index":13,"n_rows":66,"n_cols":9,"rows_kept":66,"cut":false,"hidden":false,"merged":[[1,0,1,7],[2,0,2,7],[3,0,3,7]]}
[]
[" Estimated Costs and Returns per Acre"]
["Irrigated Soybeans"]
["Projected for 2023"]
[null,null,null,null,null,null,null,"Rental Agreement","Share"]
["Item ","Quantity","Unit","Price","Landlord"," ",null,"Share","Cash"]
[null,null,null,null,"Share","Total","Tenant","Landlord"]
["Income"]
{"$rows_left_out":59}
{"sheet":"Irr Sunflowers-Confection","index":14,"n_rows":66,"n_cols":9,"rows_kept":66,"cut":false,"hidden":false,"merged":[[1,0,1,7],[2,0,2,7],[3,0,3,7]]}
[]
[" Estimated Costs and Returns per Acre"]
["Irrigated Sunflowers-Confectionary "]
["Projected for 2023"]
[null,null,null,null,null,null,null,"Rental Agreement","Share"]
["Item ","Quantity","Unit","Price","Landlord"," ",null,"Share","Cash"]
[null,null,null,null,"Share","Total","Tenant","Landlord"]
["Income"]
{"$rows_left_out":59}
{"sheet":"Irr Sunflowers-Oilseed","index":15,"n_rows":65,"n_cols":9,"rows_kept":65,"cut":false,"hidden":false,"merged":[[1,0,1,7],[2,0,2,7],[3,0,3,7]]}
[]
[" Estimated Costs and Returns per Acre"]
["Irrigated Sunflowers-Oilseed "]
["Projected for 2023"]
[null,null,null,null,null,null,null,"Rental Agreement","Share"]
["Item ","Quantity","Unit","Price","Landlord"," ",null,"Share","Cash"]
[null,null,null,null,"Share","Total","Tenant","Landlord"]
["Income"]
{"$rows_left_out":58}
{"sheet":"Irr Triticale Silage","index":16,"n_rows":63,"n_cols":9,"rows_kept":63,"cut":false,"hidden":false,"merged":[[1,0,1,7],[2,0,2,7],[3,0,3,7]]}
[]
[" Estimated Costs and Returns per Acre"]
["Irrigated Triticale Silage"]
["Projected for 2023"]
[null,null,null,null,null,null,null,"Rental Agreement","Share"]
["Item ","Quantity","Unit","Price","Landlord"," ",null,"Share","Cash"]
[null,null,null,null,"Share","Total","Tenant","Landlord"]
["Income"]
{"$rows_left_out":56}
{"sheet":"Irr Wheat","index":17,"n_rows":64,"n_cols":9,"rows_kept":64,"cut":false,"hidden":false,"merged":[[1,0,1,7],[2,0,2,7],[3,0,3,7]]}
[]
[" Estimated Costs and Returns per Acre"]
["Irrigated Wheat"]
["Projected for 2023"]
[null,null,null,null,null,null,null,"Rental Agreement","Share"]
["Item ","Quantity","Unit","Price","Landlord"," ",null,"Share","Cash"]
[null,null,null,null,"Share","Total","Tenant","Landlord"]
["Income"]
{"$rows_left_out":57}
{"sheet":"Irr Other Crop","index":18,"n_rows":65,"n_cols":9,"rows_kept":65,"cut":false,"hidden":false,"merged":[[1,0,1,7],[2,0,2,7],[3,0,3,7]]}
[]
[" Estimated Costs and Returns per Acre"]
[{"$f":"'Universal Input Prices'!A19","v":"Irrigated Other Crop"}]
["Projected for 2023"]
[null,null,null,null,null,null,null,"Rental Agreement","Share"]
["Item ","Quantity","Unit","Price","Landlord"," ",null,"Share","Cash"]
[null,null,null,null,"Share","Total","Tenant","Landlord"]
["Income"]
{"$rows_left_out":58}
{"sheet":"Dry Canola","index":19,"n_rows":62,"n_cols":9,"rows_kept":62,"cut":false,"hidden":false,"merged":[[1,0,1,7],[2,0,2,7],[3,0,3,7]]}
[]
[" Estimated Costs and Returns per Acre"]
["Dryland Canola"]
["Projected for 2023"]
[null,null,null,null,null,null,null,"Rental Agreement","Share"]
["Item ","Quantity","Unit","Price","Landlord"," ",null,"Share","Cash"]
[null,null,null,null,"Share","Total","Tenant","Landlord"]
["Income"]
{"$rows_left_out":55}
{"sheet":"Dry Cotton","index":20,"n_rows":66,"n_cols":9,"rows_kept":66,"cut":false,"hidden":false,"merged":[[1,0,1,7],[2,0,2,7],[3,0,3,7]]}
[]
[" Estimated Costs and Returns per Acre"]
["Dryland Cotton"]
["Projected for 2023"]
[null,null,null,null,null,null,null,"Rental Agreement","Share"]
["Item ","Quantity","Unit","Price","Landlord"," ",null,"Share","Cash"]
[null,null,null,null,"Share","Total","Tenant","Landlord"]
["Income"]
{"$rows_left_out":59}
{"sheet":"Dry Sorghum","index":21,"n_rows":60,"n_cols":9,"rows_kept":60,"cut":false,"hidden":false,"merged":[[1,0,1,7],[2,0,2,7],[3,0,3,7]]}
[]
[" Estimated Costs and Returns per Acre"]
["Dryland Sorghum"]
["Projected for 2023"]
[null,null,null,null,null,null,null,"Rental Agreement","Share"]
["Item ","Quantity","Unit","Price","Landlord"," ",null,"Share","Cash"]
[null,null,null,null,"Share","Total","Tenant","Landlord"]
["Income"]
{"$rows_left_out":53}
{"sheet":"Dry Sorghum Sudangrass","index":22,"n_rows":59,"n_cols":9,"rows_kept":59,"cut":false,"hidden":false,"merged":[[1,0,1,7],[2,0,2,7],[3,0,3,7]]}
[]
[" Estimated Costs and Returns per Acre"]
["Dryland Sorghum Sudangrass"]
["Projected for 2023"]
[null,null,null,null,null,null,null,"Rental Agreement","Share"]
["Item ","Quantity","Unit","Price","Landlord"," ",null,"Share","Cash"]
[null,null,null,null,"Share","Total","Tenant","Landlord"]
["Income"]
{"$rows_left_out":52}
{"sheet":"Dry Sunflowers-Oilseed","index":23,"n_rows":61,"n_cols":9,"rows_kept":61,"cut":false,"hidden":false,"merged":[[1,0,1,7],[2,0,2,7],[3,0,3,7]]}
[]
[" Estimated Costs and Returns per Acre"]
["Dryland Sunflowers-Oilseed "]
["Projected for 2023"]
[null,null,null,null,null,null,null,"Rental Agreement","Share"]
["Item ","Quantity","Unit","Price","Landlord"," ",null,"Share","Cash"]
[null,null,null,null,"Share","Total","Tenant","Landlord"]
["Income"]
{"$rows_left_out":54}
{"sheet":"Dry Wheat","index":24,"n_rows":61,"n_cols":9,"rows_kept":61,"cut":false,"hidden":false,"merged":[[1,0,1,7],[2,0,2,7],[3,0,3,7]]}
[]
[" Estimated Costs and Returns per Acre"]
["Dryland Wheat"]
["Projected for 2023"]
[null,null,null,null,null,null,null,"Rental Agreement","Share"]
["Item ","Quantity","Unit","Price","Landlord"," ",null,"Share","Cash"]
[null,null,null,null,"Share","Total","Tenant","Landlord"]
["Income"]
{"$rows_left_out":54}
{"sheet":"Dry Other Crop","index":25,"n_rows":61,"n_cols":9,"rows_kept":61,"cut":false,"hidden":false,"merged":[[1,0,1,7],[2,0,2,7],[3,0,3,7]]}
[]
[" Estimated Costs and Returns per Acre"]
[{"$f":"'Universal Input Prices'!A20","v":"Dryland Other Crop"}]
["Projected for 2023"]
[null,null,null,null,null,null,null,"Rental Agreement","Share"]
["Item ","Quantity","Unit","Price","Landlord"," ",null,"Share","Cash"]
[null,null,null,null,"Share","Total","Tenant","Landlord"]
["Income"]
{"$rows_left_out":54}
{"sheet":"Break-Even Comparison","index":26,"n_rows":210,"n_cols":9,"rows_kept":210,"cut":false,"hidden":false,"merged":[[202,0,202,8],[203,4,203,5],[203,6,203,8],[184,0,184,8],[185,4,185,5],[185,6,185,8],[193,0,193,8],[194,4,194,5],[194,6,194,8],[166,0,166,8],[167,4,167,5],[167,6,167,8],[175,0,175,8],[176,4,176,5],[176,6,176,8],[148,0,148,8],[149,4,149,5],[149,6,149,8],[157,0,157,8],[158,4,158,5],[158,6,158,8],[103,0,103,8],[104,4,104,5],[104,6,104,8],[139,0,139,8],[140,4,140,5],[140,6,140,8],[112,0,112,8],[113,4,113,5],[113,6,113,8],[130,0,130,8],[131,4,131,5],[131,6,131,8],[121,0,121,8],[122,4,122,5],[122,6,122,8],[77,4,77,5],[77,6,77,8],[94,0,94,8],[95,4,95,5],[95,6,95,8],[85,0,85,8],[86,4,86,5],[86,6,86,8],[58,0,58,8],[50,4,50,5],[50,6,50,8],[49,0,49,8],[41,4,41,5],[41,6,41,8],[67,0,67,8],[68,4,68,5],[68,6,68,8],[76,0,76,8],[59,6,59,8],[59,4,59,5],[2,0,2,8],[22,0,22,8],[31,0,31,8],[40,0,40,8],[32,4,32,5],[23,4,23,5],[23,6,23,8],[13,0,13,8],[14,4,14,5],[14,6,14,8],[4,0,4,8],[5,4,5,5],[32,6,32,8],[5,6,5,8]]}
[]
[]
[]
[]
[{"$f":"'Irr Alfalfa'!A3:H3","v":"Irrigated Alfalfa "}]
[null,null,null,null,"BE Price to Cover Variable Costs",null,"BE Price to Cover Total Costs"]
["Yield","TON",null,null,"Total","Tenant","Total","Tenant","Landlord"]
[".o",{"$f":"'Irr Alfalfa'!$B$9*$A8","v":{"$error":"#VALUE!"}},{"$f":"'Irr Alfalfa'!$B$9*(1-'Irr Alfalfa'!$E$9)*$A8","v":{"$error":"#VALUE!"}},{"$f":"'Irr Alfalfa'!$B$9*'Irr Alfalfa'!$E$9*$A8","v":{"$error":"#VALUE!"}},{"$f":"('Irr Alfalfa'!F$48+(B8-B$10)*('Irr Alfalfa'!$D$26))/B8","v":{"$error":"#VALUE!"}},{"$f":"('Irr Alfalfa'!G$48+(C8-C$10)*('Irr Alfalfa'!$D$26))/C8","v":{"$error":"#VALUE!"}},{"$f":"('Irr Alfalfa'!F$63+(B8-B$10)*('Irr Alfalfa'!$D$26))/B8","v":{"$error":"#VALUE!"}},{"$f":"('Irr Alfalfa'!G$63+(C8-C$10)*('Irr Alfalfa'!$D$26))/C8","v":{"$error":"#VALUE!"}},{"$f":"IF($D8=0,\"N/A\",('Irr Alfalfa'!H$63+(D8-D$10)*('Irr Alfalfa'!$D$26))/D8)","v":{"$error":"#VALUE!"}}]
{"$rows_left_out":203}
{"sheet":"Comparative Returns","index":27,"n_rows":29,"n_cols":28,"rows_kept":29,"cut":false,"hidden":false,"merged":[[4,1,4,3],[4,25,4,27],[4,7,4,9],[4,14,4,16],[4,17,4,19],[4,4,4,6],[4,10,4,12],[4,22,4,24]]}
[]
["Comparative Returns"]
["Projected"]
[]
[null,"Total Revenue",null,null,"Total Variable Costs",null,null,"Return Over Variable Costs",null,null,"Total Costs",null,null,null,"Return Over Variable Costs\nper Acre-Inch Applied",null,null,"Return Over Total Costs",null,null,null,null,"Break-Even Yield to Cover \nVariable Costs",null,null,"Break-Even Yield to Cover \nTotal Costs"]
[null,"Total","Tenant","Landlord","Total","Tenant","Landlord","Total","Tenant","Landlord","Total","Tenant","Landlord","ac-in","Total","Tenant","Landlord","Total","Tenant","Landlord","Price","unit","Total","Tenant","Landlord","Total","Tenant","Landlord"]
[{"$f":"'Irr Alfalfa'!$A$3:$H$3","v":"Irrigated Alfalfa "},{"$f":"'Irr Alfalfa'!F$12","v":1947},{"$f":"'Irr Alfalfa'!G$12","v":1304.4899999999998},{"$f":"'Irr Alfalfa'!H$12","v":45.74},{"$f":"'Irr Alfalfa'!F$48","v":792.86983999999984},{"$f":"'Irr Alfalfa'!G$48","v":679.78492519999986},{"$f":"'Irr Alfalfa'!H$48","v":113.08491480000001},{"$f":"B7-E7","v":1154.1301600000002},{"$f":"C7-F7","v":624.70507479999992},{"$f":"D7-G7","v":-67.344914799999998},{"$f":"'Irr Alfalfa'!F$63","v":1096.1298399999998},{"$f":"'Irr Alfalfa'!G$63","v":983.04492519999985},{"$f":"'Irr Alfalfa'!H$63","v":113.08491480000001},{"$f":"'Irr Alfalfa'!B37","v":24},{"$f":"IF($N7=0,\"-\",H7/$N7)","v":48.088756666666676},{"$f":"IF($N7=0,\"-\",I7/$N7)","v":26.029378116666663},{"$f":"IF($N7=0,\"-\",J7/$N7)","v":-2.8060381166666666},{"$f":"B7-K7","v":850.87016000000017},{"$f":"C7-L7","v":321.44507479999993},{"$f":"D7-M7","v":-67.344914799999998},{"$f":"'Irr Alfalfa'!$D$9","v":354},{"$f":"'Irr Alfalfa'!$C$9","v":"ton"},{"$f":"IF($U7=0, 0, E7/$U7)","v":2.2397453107344627},{"$f":"IF($U7=0, 0, IF('Irr Alfalfa'!$E$9=0,0,F7/$U7/(1-'Irr Alfalfa'!$E$9)))","v":2.866114028164263},{"$f":"IF($U7=0, 0, IF('Irr Alfalfa'!$E$9=0,0,G7/$U7/('Irr Alfalfa'!$E$9)))","v":0.96802700564971755},{"$f":"IF($U7=0, 0, K7/$U7)","v":3.0964119774011296},{"$f":"IF($U7=0, 0, IF('Irr Alfalfa'!$E$9=0,0,L7/$U7/(1-'Irr Alfalfa'!$E$9)))","v":4.1447209933383924},{"$f":"IF($U7=0, 0, IF('Irr Alfalfa'!$E$9=0,0,M7/$U7/('Irr Alfalfa'!$E$9)))","v":0.96802700564971755}]
[{"$f":"'Irr Canola'!$A$3:$H$3","v":"Irrigated Canola"},{"$f":"'Irr Canola'!F$12","v":514.79999999999995},{"$f":"'Irr Canola'!G$12","v":344.91599999999994},{"$f":"'Irr Canola'!H$12","v":169.88399999999999},{"$f":"'Irr Canola'!F$49","v":503.39536432800003},{"$f":"'Irr Canola'!G$49","v":393.727734828},{"$f":"'Irr Canola'!H$49","v":109.66762950000002},11.404635671999927,-48.811734828000056,60.216370499999968,{"$f":"'Irr Canola'!F$63","v":679.43536432799999},{"$f":"'Irr Canola'!G$63","v":481.26773482800002},{"$f":"'Irr Canola'!H$63","v":198.16762950000003},{"$f":"'Irr Canola'!B38","v":10},1.1404635671999928,-4.8811734828000057,6.0216370499999972,-164.63536432800004,-136.35173482800008,-28.283629500000046,{"$f":"'Irr Canola'!$D$9","v":23.4},{"$f":"'Irr Canola'!$C$9","v":"cwt"},{"$f":"IF($U8=0, 0, E8/$U8)","v":21.512622407179489},{"$f":"IF($U8=0, 0, IF('Irr Canola'!$E$9=0,0,F8/$U8/(1-'Irr Canola'!$E$9)))","v":25.113390408725603},{"$f":"IF($U8=0, 0, IF('Irr Canola'!$E$9=0,0,G8/$U8/('Irr Canola'!$E$9)))","v":14.201972222222224},{"$f":"IF($U8=0, 0, K8/$U8)","v":29.03569933025641},{"$f":"IF($U8=0, 0, IF('Irr Canola'!$E$9=0,0,L8/$U8/(1-'Irr Canola'!$E$9)))","v":30.697010768465372},{"$f":"IF($U8=0, 0, IF('Irr Canola'!$E$9=0,0,M8/$U8/('Irr Canola'!$E$9)))","v":25.662733682983689}]
{"$rows_left_out":22}
{"sheet":"Irrigation Analysis","index":28,"n_rows":33,"n_cols":23,"rows_kept":33,"cut":false,"hidden":false,"merged":[[2,1,2,5],[8,16,8,22]]}
[]
["Irrigation Analysis"]
["Farm Name","ABC Farm"]
["Total Well GPM to Pivot",500]
["Acres Available for Irrigation",120]
["Minimum Planting Circle Size","None"]
["Allowed Inches per Gross Acre",15]
["Gross Acres",160]
{"$rows_left_out":26}
{"sheet":"Graphs","index":29,"n_rows":2,"n_cols":1,"rows_kept":2,"cut":false,"hidden":false,"merged":[]}
[]
["Irrigation Analysis Graphs"]