{"text_format":"1","workbook":"xlsx","n_sheets":36,"sheets":["Menu","Links","GrapefruitYear1","GrapefruitYear2","GrapefruitYear3","GrapefruitYear4","GrapefruitYear5","GrapefruitYear6","GrapefruitYear7","GrapefruitYear8","OrangesNavel","OrangesValencias","CornConventionalTill","CornRducedTill","CottonConventionalTill","CottonReducedTill","CottonDryland","SorghumConventionalTill","SorghumReducedTill","SorghumDryland","SugarCanePlant","SugarCaneRatoon","HayEstablishment","HayProduction","Cabbage","Cantaloupe","HoneyDew","Onion","Watermelon","WatermelonDryland","Livestock Budget","Crop Budget","Comparative Returns - Cash Rent","Comparative Returns-Share Rent","Your Returns - Cash Rent","Your Returns-Share Rent"],"not_rendered":{"charts":0,"images":8,"macros":1,"external_links":0,"defined_names":890,"comments":30,"pivot_tables":0},"unopened":[],"bounds":{"document_bytes":16777216,"sheet_cells":100000,"rows_first":2000,"rows_last":500,"rows_between":2000,"halvings":0,"cell_chars":16384,"cell_head_chars":4096},"cells_cut":0,"cells_raw":0,"read":"whole","date_system":"1900"}

{"sheet":"Menu","index":0,"n_rows":68,"n_cols":26,"rows_kept":68,"cut":false,"hidden":false,"merged":[[5,0,5,5]]}
[null,null,null,null,null,null,null,null,null,null,null,null,null,null,null,null,null,null,null,null,null,null,null,null,null,2]
[]
[]
[null,null,null,null,null,null,null,null,null,null,null,null,null,null,null,null,null,null,null,null,null,null,null,null,null,2]
[]
["      South Extension District - 12      "]
[]
[null,null,null,"Budgets"]
[]
[]
[null,null,null,"Field Crops"]
[]
[null,null,null,{"$f":"CornConventionalTill!A3","v":"Corn, Conventional Tillage, Furrow Irrigated, Rio Grande Valley"}]
[null,null,null,{"$f":"CornRducedTill!A3","v":"Corn, Reduced Tillage, Furrow Irrigated, Rio Grande Valley"}]
[null,null,null,{"$f":"CottonConventionalTill!A3","v":"Cotton, Conventional Tillage, Furrow Irrigated, Rio Grande Valley"}]
[null,null,null,{"$f":"CottonReducedTill!A3","v":"Cotton, Reduced Tillage, GMO, Furrow Irrigated, Rio Grande Valley"}]
[null,null,null,{"$f":"CottonDryland!A3","v":"Cotton, Conventional Tillage, Dryland, Rio Grande Valley"}]
[null,"Comparative Returns",null,{"$f":"SorghumConventionalTill!A3","v":"Grain Sorghum, Conventional Tillage, Furrow Irrigated, Rio Grande Valley"}]
[null,null,null,{"$f":"SorghumReducedTill!A3","v":"Grain Sorghum, Reduced Tillage, Furrow Irrigated, Rio Grande Valley"}]
[null,"Links",null,{"$f":"SorghumDryland!A3","v":"Grain Sorghum, Conventional Tillage, Dryland, Rio Grande Valley"}]
[null,null,null,{"$f":"SugarCanePlant!A3","v":"Sugar Cane, Planted, Furrow Irrigated, Rio Grande Valley"}]
[null,null,null,{"$f":"SugarCaneRatoon!A3","v":"Sugar Cane, Ratoon, Furrow Irrigated, Rio Grande Valley"}]
[null,null,null,{"$f":"HayProduction!A3","v":"Hay Production, Furrow Irrigated, Rio Grande Valley"}]
[null,null,null,{"$f":"HayEstablishment!A3","v":"Hay Establishment, Furrow Irrigated, Rio Grande Valley"}]
[]
[null,null,null,"Horticultural Crops"]
[]
[null,null,null,{"$f":"Cabbage!A3","v":"Cabbage, Fresh Market, Furrow Irrigated, Rio Grande Valley"}]
[null,null,null,{"$f":"Cantaloupe!A3","v":"Cantaloupe, Plastic Mulch, Drip Irrigated, Rio Grande Valley"}]
[null,null,null,{"$f":"HoneyDew!A3","v":"Honeydew, Plastic Mulch, Drip Irrigated, Rio Grande Valley"}]
[null,null,null,{"$f":"Onion!A3","v":"Onion, Hybrid Yellow Varieties, Furrow Irrigated, Rio Grande Valley"}]
[null,null,null,{"$f":"Watermelon!A3","v":"Watermelon, Seedless, Plastic Mulch, Drip Irrigated, Rio Grande Valley"}]
[null,null,null,{"$f":"WatermelonDryland!A3","v":"Watermelon, Open Pollinated Varieties, Dryland, Rio Grande Valley"}]
[]
[null,null,null,"Citrus Crops"]
[]
[null,null,null,{"$f":"GrapefruitYear1!A3","v":"Grapefruit, Year 1, Orchard Establishment, Flood Irrigated, Rio Grande Valley"}]
[null,null,null,{"$f":"GrapefruitYear2!A3","v":"Grapefruit, Year 2, Orchard Establishment, Flood Irrigated, Rio Grande Valley"}]
[null,null,null,{"$f":"+GrapefruitYear3!A3","v":"Grapefruit, Year 3, Orchard Establishment, Flood Irrigated, Rio Grande Valley"}]
[null,null,null,{"$f":"GrapefruitYear4!A3","v":"Grapefruit, Year 4, Orchard Establishment, Flood Irrigated, Rio Grande Valley"}]
[null,null,null,{"$f":"GrapefruitYear5!A3","v":"Grapefruit, Year 5, Orchard Establishment, Flood Irrigated, Rio Grande Valley"}]
[null,null,null,{"$f":"GrapefruitYear6!A3","v":"Grapefruit, Year 6, Orchard Establishment, Flood Irrigated, Rio Grande Valley"}]
[null,null,null,{"$f":"GrapefruitYear7!A3","v":"Grapefruit, Year 7, Orchard Establishment, Flood Irrigated, Rio Grande Valley"}]
[null,null,null,{"$f":"GrapefruitYear8!A3","v":"Grapefruit, Year 8, Orchard Establishment, Flood Irrigated, Rio Grande Valley"}]
[null,null,null,{"$f":"OrangesNavel!A3","v":"Oranges, Early Orange, Mature Orchard, Flood Irrigated, Rio Grande Valley"}]
[null,null,null,{"$f":"OrangesValencias!A3","v":"Oranges, Valencias, Mature Orchard, Flood Irrigated, Rio Grande Valley"}]
[]
[null,null,null,"Livestock"]
[]
[]
[null,null,null,"Other Budgets"]
[]
[null,null,null,{"$f":"'Livestock Budget'!A3","v":"Livestock Budget"}]
[null,null,null,{"$f":"'Crop Budget'!A3","v":"Crop Enterprise"}]
[]
[]
[]
[]
[]
[]
[]
[]
[]
[]
[]
[]
[]
["  Developed by Samuel Zapata, Assistant Professor and Extension Economist, Texas A&M AgriLife Extension, 956-968-5581.  "]

{"sheet":"Links","index":1,"n_rows":26,"n_cols":7,"rows_kept":26,"cut":false,"hidden":false,"merged":[[21,1,21,2],[1,1,1,8],[2,1,2,8],[3,1,3,8],[5,1,5,8],[11,1,11,2],[7,1,7,2],[13,1,13,2],[9,1,9,2],[19,1,19,2],[17,1,17,2],[15,1,15,2]]}
[]
[null,"Texas Crop and Livestock Budgets"]
[null,"A Program of the Texas A&M AgriLife Extension Service"]
[null,"Agricultural Economics Department, The Texas A&M University System"]
[]
[null,"Developed by Texas A&M AgriLife Extension Service Economists and Other Specialists"]
[]
[null,"Contact Us",null,null,null,null,"Clickable Logos"]
[]
[null,"Resources"]
[]
[null,"Decision Aids (includes Machinery Cost Estimator)"]
[]
[null,"Custom Rate Survey"]
[]
[null,"Basis Data"]
[]
[null,"Master Marketer"]
[]
[null,"Extension Ag Economics"]
[]
[null,"Department of Agricultural Economics"]
[]
[null,"Menu Page"]
[]
[null,"Links last checked 4/17/2020"]

{"sheet":"GrapefruitYear1","index":2,"n_rows":111,"n_cols":18,"rows_kept":111,"cut":false,"hidden":false,"merged":[[98,3,98,8],[110,0,110,11],[0,0,0,11],[1,0,1,11],[2,0,2,11],[3,0,3,11]]}
["Projections for Planning Purposes Only -- Not to be Used without Updating"]
["2023 Estimated Costs and Returns per Acre"]
["Grapefruit, Year 1, Orchard Establishment, Flood Irrigated, Rio Grande Valley"]
["Enter your name for this budget in the cell above."]
["Enter  Your Values in the cells highlighed in MAROON."]
[null,null,null,null,"Your Acres",null,null,null,null,null,null,null,null,null,null,null,null,"Your"]
[null,null,"Crop Acres",100,null,null,null,null,null,null,null,"Your",null,null,null,null,"Enterprise","Enterprise"]
[null,null,null,null,"Your",null,null,"Your","Cash","Your","Landlord","Landlord",null,"Your",null,"Your","Total","Total"]
["REVENUE",null,null,"Quantity","Quantity","Units","$/Unit","$/Unit","Total","Total","Share","Share","Landlord","Landlord","Tenant","Tenant","(100 acres)",{"$f":"\"(\" & E7 & \" acres)\"","v":"( acres)"}]
[null,"Grapefruit (Rio Red)",null,0,null,"",0,null,0,{"$f":"E10*H10","v":0},0,null,0,{"$f":"J10*L10","v":0},0,{"$f":"+J10-N10","v":0},0,{"$f":"+J10*E$7","v":0}]
[null,null,null,0,null,null,0,null,0,0,0,null,0,0,0,{"$f":"+J11-N11","v":0},0,0]
[null,null,null,0,null,null,0,null,0,0,0,null,0,0,0,0,0,0]
["Total Revenue",null,null,null,null,null,null,null,0,{"$f":"SUM(J10:J12)","v":0},null,null,0,{"$f":"SUM(N10:N12)","v":0},0,{"$f":"SUM(P10:P12)","v":0},0,{"$f":"SUM(R10:R12)","v":0}]
[null,null,null,null,null,null,null,null,null,null,null,null,null,null,null,null,"Enterprise","Enterprise"]
["VARIABLE COSTS",null,null,"Quantity","Quantity","Units","$/Unit","$/Unit","Total","Total","Share","Share","Landlord","Landlord","Tenant","Tenant","Total","Total"]
["Production Costs"]
[null,"Seed"]
[null,"","Young Citrus Trees",150,null,"Tree",15,null,2250,{"$f":"E18*H18","v":0},0,null,0,{"$f":"J18*L18","v":0},2250,{"$f":"+J18-N18","v":0},225000,{"$f":"+J18*E$7","v":0}]
[null,"","Layout and Plant",150,null,"Tree",5,null,750,0,0,null,0,0,750,0,75000,0]
[null,"","Tree Wrap/Unwrap",150,null,"Tree",2,null,300,0,0,null,0,0,300,0,30000,0]
[null,"Fertilizer"]
[null,"","Urea (46%)",0.62,null,"CTW",44.75,null,27.745000000000001,0,0,null,0,0,27.745000000000001,0,2774.5,0]
[null,"","Foliar Zn",0.67,null,"Pound",3.4998,null,2.3448660000000001,0,0,null,0,0,2.3448660000000001,0,234.48660000000001,0]
[null,"","Foliar 18-8-5",1.32,null,"Gallon",15.5,null,20.46,0,0,null,0,0,20.46,0,2046,0]
[null,"Herbicide"]
[null,"","Simazine 4L",1.25,null,"Gallon",38,null,47.5,0,0,null,0,0,47.5,0,4750,0]
[null,"","Krovar I 80 DF",3,null,"Pound",17.68,null,53.04,0,0,null,0,0,53.04,0,5304,0]
[null,"","Glyphosate",20,null,"Pint",6.25,null,125,0,0,null,0,0,125,0,12500,0]
[null,"Insecticide"]
[null,"","Sivanto",10,null,"Ounce",3.2808593749999999,null,32.80859375,0,0,null,0,0,32.80859375,0,3280.859375,0]
[null,"","Danitol",16,null,"Ounce",1.0078125,null,16.125,0,0,null,0,0,16.125,0,1612.5,0]
[null,"Miscellaneous"]
[null,"","Citrus Assessment",1,null,"Acre",5,null,5,0,0,null,0,0,5,0,500,0]
[null,"","Insurance, Young citrus trees",150,null,"Tree",0.22,null,33,0,0,null,0,0,33,0,3300,0]
[null,"Custom"]
[null,"","Citrus Land Prep: Disk",1,null,"Acre",35,null,35,0,0,null,0,0,35,0,3500,0]
[null,"","Citrus Land Prep: Level",1,null,"Acre",40,null,40,0,0,null,0,0,40,0,4000,0]
[null,"","Foliar Application",2,null,"Acre",50,null,100,0,0,null,0,0,100,0,10000,0]
[null,"","Sucker (Yr 1-3 Year)",1,null,"Acre",50,null,50,0,0,null,0,0,50,0,5000,0]
[null,"","Land Prep. Remove Old Orchard",1,null,"Acre",378,null,378,0,0,null,0,0,378,0,37800,0]
[null,"","Citrus Land Prep: Root chisel",1,null,"Acre",35,null,35,0,0,null,0,0,35,0,3500,0]
[null,"Other Labor"]
[null,"","Costum Soil Fert. Citrus",6,null,"Hour",15,null,90,0,0,null,0,0,90,0,9000,0]
[null,"","Unallocated Labor",1,null,"Hour",15,null,15,0,0,null,0,0,15,0,1500,0]
[null,"Other Chemicals"]
[null,"","Surfactant",8.2799999999999994,null,"Pint",7.4749999999999996,null,61.892999999999994,0,0,null,0,0,61.892999999999994,0,6189.2999999999993,0]
[null,null,null,0,null,null,0,null,0,0,0,null,0,0,0,0,0,0]
[null,null,null,0,null,null,0,null,0,0,0,null,0,0,0,0,0,0]
[null,null,null,0,null,null,0,null,0,{"$f":"E49*H49","v":0},0,null,0,{"$f":"J49*L49","v":0},0,{"$f":"+J49-N49","v":0},0,{"$f":"+J49*E$7","v":0}]
[null,"Irrigation"]
[null,null,"Water Cost",1.5600000000000005,null,"Acre/Foot",28.8205128205128,null,44.95999999999998,{"$f":"E51*H51","v":0},0,null,0,{"$f":"J51*L51","v":0},44.95999999999998,{"$f":"+J51-N51","v":0},4495.9999999999982,{"$f":"+J51*E$7","v":0}]
[null,null,"Irrigation Labor",13,null,"Hour",17.5,null,227.5,0,0,null,0,0,227.5,0,22750,0]
[null,"Machinery Labor"]
[null,null,"Tractors/Self-Propelled",0.8,null,"Hour",17.21,null,13.768000000000001,{"$f":"E54*H54","v":0},0,null,0,{"$f":"J54*L54","v":0},13.768000000000001,{"$f":"+J54-N54","v":0},1376.8000000000002,{"$f":"+J54*E$7","v":0}]
[null,null,"Other Labor",0.4,null,"Hour",17.21,null,6.8840000000000003,{"$f":"E55*H55","v":0},0,null,0,{"$f":"J55*L55","v":0},6.8840000000000003,{"$f":"+J55-N55","v":0},688.40000000000009,{"$f":"+J55*E$7","v":0}]
[]
[null,"Diesel Fuel"]
[null,null,"Pickup/General Use Equipment",1,null,"Acre",0,null,0,{"$f":"E58*H58","v":0},0,null,0,{"$f":"J58*L58","v":0},0,{"$f":"+J58-N58","v":0},0,{"$f":"+J58*E$7","v":0}]
[null,null,"Tractors/Self-Propelled",3.66,null,"Gallon",2.2400000000000002,null,8.1984000000000012,{"$f":"E59*H59","v":0},0,null,0,{"$f":"J59*L59","v":0},8.1984000000000012,{"$f":"+J59-N59","v":0},819.84000000000015,{"$f":"+J59*E$7","v":0}]
[]
[null,"Gasoline"]
[null,null,"Pickup/General Use Equipment",1,null,"Acre",0,null,0,{"$f":"E62*H62","v":0},0,null,0,{"$f":"J62*L62","v":0},0,{"$f":"+J62-N62","v":0},0,{"$f":"+J62*E$7","v":0}]
[null,null,"Tractors/Self-Propelled",0,null,"Gallon",2.09,null,0,{"$f":"E63*H63","v":0},0,null,0,{"$f":"J63*L63","v":0},0,{"$f":"+J63-N63","v":0},0,{"$f":"+J63*E$7","v":0}]
[]
[null,"Repairs & Maintenance"]
[null,null,"Pickup/General Use Equipment",1,null,"Acre",0,null,0,{"$f":"E66*H66","v":0},0,null,0,{"$f":"J66*L66","v":0},0,{"$f":"+J66-N66","v":0},0,{"$f":"+J66*E$7","v":0}]
[null,null,"Irrigation Equipment",1,null,"Acre",0,null,0,0,0,null,0,0,0,0,0,0]
[null,null,"Tractors/Self-Propelled",1,null,"Acre",8.7851213094412053,null,8.7851213094412053,0,0,null,0,0,8.7851213094412053,0,878.51213094412049,0]
[null,null,"Implements",1,null,"Acre",2.8569806404862446,null,2.8569806404862446,0,0,null,0,0,2.8569806404862446,0,285.69806404862447,0]
[null,null,null,null,null,null,null,null,0,0,0,null,0,0,0,0,0,0]
[null,null,null,null,null,null,null,null,0,0,0,null,0,0,0,0,0,0]
[null,"Interest on Credit Line",null,null,null,null,0.08,null,313.68840712059819,{"$f":"+SUM(J17:J71)/2*H72","v":0},null,null,0,{"$f":"+SUM(N17:N71)/2*L72","v":0},313.68840712059819,{"$f":"+SUM(P17:P71)/2*L72","v":0},31368.84071205982,{"$f":"+J72*E$7","v":0}]
["Total Variable Costs",null,null,null,null,null,null,null,5094.5573688205259,{"$f":"SUM(J18:J72)","v":0},null,null,0,{"$f":"SUM(N18:N72)","v":0},5094.5573688205259,{"$f":"SUM(P18:P72)","v":0},509455.73688205256,{"$f":"SUM(R18:R72)","v":0}]
["Planned Returns Above Variable Costs:",null,null,null,null,null,null,null,-5094.5573688205259,{"$f":"+J13-J73","v":0},null,null,0,{"$f":"+N13-N73","v":0},-5094.5573688205259,{"$f":"+P13-P73","v":0},-509455.73688205256,{"$f":"+R13-R73","v":0}]
[null,"Breakeven Price to Cover Variable Costs",null,null,null,null,"n/a",{"$f":"IF(E10=0,\"n/a\",(YVarExp-(YTotExp+YTotRet-J10))/E10)","v":"n/a"},""]
[null,null,null,null,null,null,null,null,null,null,null,null,null,null,null,null,"Enterprise","Enterprise"]
["FIXED COSTS",null,null,"Quantity","Quantity","Units","$/Unit","$/Unit","Total","Total","Share","Share","Landlord","Landlord","Tenant","Tenant","Total","Total"]
[null,"Machinery Depreciation"]
[null,null,"Tractors/Self-Propelled",1,null,"Acre",9.0779586864225799,null,9.0779586864225799,{"$f":"E79*H79","v":0},0,null,0,{"$f":"J79*L79","v":0},9.0779586864225799,{"$f":"+J79-N79","v":0},907.79586864225803,{"$f":"+J79*E$7","v":0}]
[null,null,"Implements",1,null,"Acre",3.0475010297676128,null,3.0475010297676128,0,0,null,0,{"$f":"J80*L80","v":0},3.0475010297676128,0,304.7501029767613,0]
[null,"Equipment Investment"]
[null,null,"Tractors/Self-Propelled",70.720226541001708,null,"Dollars",0.08,null,5.6576181232801366,{"$f":"E82*H82","v":0},0,null,0,{"$f":"J82*L82","v":0},5.6576181232801366,{"$f":"+J82-N82","v":0},565.76181232801366,{"$f":"+J82*E$7","v":0}]
[null,null,"Implements",13.036532182894792,null,"Dollars",0.08,null,1.0429225746315833,0,0,null,0,{"$f":"J83*L83","v":0},1.0429225746315833,0,104.29225746315834,0]
[null,"Salaried Labor",null,1,null,"Acre",0,null,0,0,0,null,0,{"$f":"J84*L84","v":0},0,{"$f":"+J84-N84","v":0},0,{"$f":"+J84*E$7","v":0}]
[null,"Management Fee, Owner/Operator Labor",null,1,null,"Acre",0,null,0,0,0,null,0,0,0,0,0,0]
[null,"Allocated Establishment Cost",null,1,null,"Acre",0,null,0,0,0,null,0,0,0,0,0,0]
[null,"Land Cost, Orchard",null,1,null,"Acre",100,null,100,0,0,null,0,0,100,0,10000,0]
[null,"Property Taxes",null,1,null,"Acre",0,null,0,0,0,null,0,0,0,0,0,0]
[null,"Whole Farm Insurance",null,1,null,"Acre",0,null,0,0,0,null,0,0,0,0,0,0]
[null,null,null,1,null,null,0,null,0,0,0,null,0,0,0,0,0,0]
[null,null,null,1,null,null,0,null,0,{"$f":"E91*H91","v":0},0,null,0,0,0,0,0,0]
["Total Fixed Costs",null,null,null,null,null,null,null,118.82600041410191,{"$f":"+SUM(J79:J91)","v":0},null,null,0,{"$f":"+SUM(N79:N91)","v":0},118.82600041410191,{"$f":"+SUM(P79:P91)","v":0},11882.600041410191,{"$f":"+SUM(R79:R91)","v":0}]
["Total Specified Costs",null,null,null,null,null,null,null,5213.3833692346279,{"$f":"+J73+J92","v":0},null,null,0,{"$f":"+N73+N92","v":0},5213.3833692346279,{"$f":"+P73+P92","v":0},521338.33692346275,{"$f":"+R73+R92","v":0}]
[]
["Returns Above Specified Costs",null,null,null,null,null,null,null,-5213.3833692346279,{"$f":"+J13-J93","v":0},null,null,0,{"$f":"+N13-N93","v":0},-5213.3833692346279,{"$f":"+P13-P93","v":0},-521338.33692346275,{"$f":"+R13-R93","v":0}]
[]
["    Breakeven Price to Cover Total Costs",null,null,null,null,null,"n/a",{"$f":"IF(E10=0,\"n/a\",(YTotExp-(YTotExp+YTotRet-J10))/E10)","v":"n/a"},""]
[]
[null,null,null,"Example Breakeven Prices"]
[null,"Example","Example","To Cover",null,null,"To Cover"]
[null,"Yield","Yield","Variable",null,null,"Total"]
[null,"Percent","","Costs",null,null,"Costs"]
[null,0.75,0,0,null,null,0]
[null,0.9,0,0,null,null,0]
[null,1,0,0,null,null,0]
[null,1.1000000000000001,0,0,null,null,0]
[null,1.25,0,0,null,null,0]
[]
["  Developed by Samuel Zapata, Assistant Professor and Extension Economist, Texas A&M AgriLife Extension, 956-968-5581.  "]
[0]
["Information presented is prepared solely as a general guide and not intended to recognize or predict the costs and returns from any one operation.  Brand names are mentioned only as examples and imply no endorsement."]

{"sheet":"GrapefruitYear2","index":3,"n_rows":107,"n_cols":18,"rows_kept":107,"cut":false,"hidden":false,"merged":[[94,3,94,8],[106,0,106,11],[0,0,0,11],[1,0,1,11],[2,0,2,11],[3,0,3,11]]}
["Projections for Planning Purposes Only -- Not to be Used without Updating"]
["2023 Estimated Costs and Returns per Acre"]
["Grapefruit, Year 2, Orchard Establishment, Flood Irrigated, Rio Grande Valley"]
["Enter your name for this budget in the cell above."]
["Enter  Your Values in the cells highlighed in MAROON."]
[null,null,null,null,"Your Acres",null,null,null,null,null,null,null,null,null,null,null,null,"Your"]
[null,null,"Crop Acres",100,null,null,null,null,null,null,null,"Your",null,null,null,null,"Enterprise","Enterprise"]
[null,null,null,null,"Your",null,null,"Your","Cash","Your","Landlord","Landlord",null,"Your",null,"Your","Total","Total"]
["REVENUE",null,null,"Quantity","Quantity","Units","$/Unit","$/Unit","Total","Total","Share","Share","Landlord","Landlord","Tenant","Tenant","(100 acres)",{"$f":"\"(\" & E7 & \" acres)\"","v":"( acres)"}]
[null,0,null,0,null,"",0,null,0,{"$f":"E10*H10","v":0},0,null,0,{"$f":"J10*L10","v":0},0,{"$f":"+J10-N10","v":0},0,{"$f":"+J10*E$7","v":0}]
[null,null,null,0,null,null,0,null,0,0,0,null,0,0,0,{"$f":"+J11-N11","v":0},0,0]
[null,null,null,0,null,null,0,null,0,0,0,null,0,0,0,0,0,0]
["Total Revenue",null,null,null,null,null,null,null,0,{"$f":"SUM(J10:J12)","v":0},null,null,0,{"$f":"SUM(N10:N12)","v":0},0,{"$f":"SUM(P10:P12)","v":0},0,{"$f":"SUM(R10:R12)","v":0}]
[null,null,null,null,null,null,null,null,null,null,null,null,null,null,null,null,"Enterprise","Enterprise"]
["VARIABLE COSTS",null,null,"Quantity","Quantity","Units","$/Unit","$/Unit","Total","Total","Share","Share","Landlord","Landlord","Tenant","Tenant","Total","Total"]
["Production Costs"]
[null,"Seed"]
[null,"","Young Citrus Trees",3,null,"Tree",15,null,45,{"$f":"E18*H18","v":0},0,null,0,{"$f":"J18*L18","v":0},45,{"$f":"+J18-N18","v":0},4500,{"$f":"+J18*E$7","v":0}]
[null,"","Layout and Plant",3,null,"Tree",5,null,15,0,0,null,0,0,15,0,1500,0]
[null,"","Tree Wrap/Unwrap",3,null,"Tree",2,null,6,0,0,null,0,0,6,0,600,0]
[null,"Fertilizer"]
[null,"","Urea (46%)",1.25,null,"CTW",44.75,null,55.9375,0,0,null,0,0,55.9375,0,5593.75,0]
[null,"","Foliar 18-8-5",1.32,null,"Gallon",15.5,null,20.46,0,0,null,0,0,20.46,0,2046,0]
[null,"","Foliar Zn",0.67,null,"Pound",3.4998,null,2.3448660000000001,0,0,null,0,0,2.3448660000000001,0,234.48660000000001,0]
[null,"Herbicide"]
[null,"","Simazine 4L",1.25,null,"Gallon",38,null,47.5,0,0,null,0,0,47.5,0,4750,0]
[null,"","Krovar I 80 DF",3,null,"Pound",17.68,null,53.04,0,0,null,0,0,53.04,0,5304,0]
[null,"","Glyphosate",20,null,"Pint",6.25,null,125,0,0,null,0,0,125,0,12500,0]
[null,"Insecticide"]
[null,"","Sivanto",10,null,"Ounce",3.2808593749999999,null,32.80859375,0,0,null,0,0,32.80859375,0,3280.859375,0]
[null,"","Danitol",16,null,"Ounce",1.0078125,null,16.125,0,0,null,0,0,16.125,0,1612.5,0]
[null,"Miscellaneous"]
[null,"","Citrus Assessment",1,null,"Acre",5,null,5,0,0,null,0,0,5,0,500,0]
[null,"","Insurance, Young citrus trees",150,null,"Tree",0.22,null,33,0,0,null,0,0,33,0,3300,0]
[null,"Custom"]
[null,"","Foliar Application",2,null,"Acre",50,null,100,0,0,null,0,0,100,0,10000,0]
[null,"","Sucker (Yr 1-3 Year)",1,null,"Acre",50,null,50,0,0,null,0,0,50,0,5000,0]
[null,"Other Labor"]
[null,"","Costum Soil Fert. Citrus",6,null,"Hour",15,null,90,0,0,null,0,0,90,0,9000,0]
[null,"","Unallocated Labor",1,null,"Hour",15,null,15,0,0,null,0,0,15,0,1500,0]
[null,"Other Chemicals"]
[null,"","Surfactant",8.2799999999999994,null,"Pint",7.4749999999999996,null,61.892999999999994,0,0,null,0,0,61.892999999999994,0,6189.2999999999993,0]
[null,null,null,0,null,null,0,null,0,0,0,null,0,0,0,0,0,0]
[null,null,null,0,null,null,0,null,0,0,0,null,0,0,0,0,0,0]
[null,null,null,0,null,null,0,null,0,{"$f":"E45*H45","v":0},0,null,0,{"$f":"J45*L45","v":0},0,{"$f":"+J45-N45","v":0},0,{"$f":"+J45*E$7","v":0}]
[null,"Irrigation"]
[null,null,"Water Cost",4,null,"Acre/Foot",21,null,84,{"$f":"E47*H47","v":0},0,null,0,{"$f":"J47*L47","v":0},84,{"$f":"+J47-N47","v":0},8400,{"$f":"+J47*E$7","v":0}]
[null,null,"Irrigation Labor",14,null,"Hour",17.5,null,245,0,0,null,0,0,245,0,24500,0]
[null,"Machinery Labor"]
[null,null,"Tractors/Self-Propelled",0.8,null,"Hour",17.21,null,13.768000000000001,{"$f":"E50*H50","v":0},0,null,0,{"$f":"J50*L50","v":0},13.768000000000001,{"$f":"+J50-N50","v":0},1376.8000000000002,{"$f":"+J50*E$7","v":0}]
[null,null,"Other Labor",0.4,null,"Hour",17.21,null,6.8840000000000003,{"$f":"E51*H51","v":0},0,null,0,{"$f":"J51*L51","v":0},6.8840000000000003,{"$f":"+J51-N51","v":0},688.40000000000009,{"$f":"+J51*E$7","v":0}]
[]
[null,"Diesel Fuel"]
[null,null,"Pickup/General Use Equipment",1,null,"Acre",0,null,0,{"$f":"E54*H54","v":0},0,null,0,{"$f":"J54*L54","v":0},0,{"$f":"+J54-N54","v":0},0,{"$f":"+J54*E$7","v":0}]
[null,null,"Tractors/Self-Propelled",3.66,null,"Gallon",2.2400000000000002,null,8.1984000000000012,{"$f":"E55*H55","v":0},0,null,0,{"$f":"J55*L55","v":0},8.1984000000000012,{"$f":"+J55-N55","v":0},819.84000000000015,{"$f":"+J55*E$7","v":0}]
[]
[null,"Gasoline"]
[null,null,"Pickup/General Use Equipment",1,null,"Acre",0,null,0,{"$f":"E58*H58","v":0},0,null,0,{"$f":"J58*L58","v":0},0,{"$f":"+J58-N58","v":0},0,{"$f":"+J58*E$7","v":0}]
[null,null,"Tractors/Self-Propelled",0,null,"Gallon",2.09,null,0,{"$f":"E59*H59","v":0},0,null,0,{"$f":"J59*L59","v":0},0,{"$f":"+J59-N59","v":0},0,{"$f":"+J59*E$7","v":0}]
[]
[null,"Repairs & Maintenance"]
[null,null,"Pickup/General Use Equipment",1,null,"Acre",0,null,0,{"$f":"E62*H62","v":0},0,null,0,{"$f":"J62*L62","v":0},0,{"$f":"+J62-N62","v":0},0,{"$f":"+J62*E$7","v":0}]
[null,null,"Irrigation Equipment",1,null,"Acre",0,null,0,0,0,null,0,0,0,0,0,0]
[null,null,"Tractors/Self-Propelled",1,null,"Acre",8.7851213094412053,null,8.7851213094412053,0,0,null,0,0,8.7851213094412053,0,878.51213094412049,0]
[null,null,"Implements",1,null,"Acre",2.8569806404862446,null,2.8569806404862446,0,0,null,0,0,2.8569806404862446,0,285.69806404862447,0]
[null,null,null,null,null,null,null,null,0,0,0,null,0,0,0,0,0,0]
[null,null,null,null,null,null,null,null,0,0,0,null,0,0,0,0,0,0]
[null,"Interest on Credit Line",null,null,null,null,0.08,null,54.356366572653002,{"$f":"+SUM(J17:J67)/2*H68","v":0},null,null,0,{"$f":"+SUM(N17:N67)/2*L68","v":0},54.356366572653002,{"$f":"+SUM(P17:P67)/2*L68","v":0},5435.6366572653005,{"$f":"+J68*E$7","v":0}]
["Total Variable Costs",null,null,null,null,null,null,null,1197.9578282725804,{"$f":"SUM(J18:J68)","v":0},null,null,0,{"$f":"SUM(N18:N68)","v":0},1197.9578282725804,{"$f":"SUM(P18:P68)","v":0},119795.78282725805,{"$f":"SUM(R18:R68)","v":0}]
["Planned Returns Above Variable Costs:",null,null,null,null,null,null,null,-1197.9578282725804,{"$f":"+J13-J69","v":0},null,null,0,{"$f":"+N13-N69","v":0},-1197.9578282725804,{"$f":"+P13-P69","v":0},-119795.78282725805,{"$f":"+R13-R69","v":0}]
[null,"Breakeven Price to Cover Variable Costs",null,null,null,null,"n/a",{"$f":"IF(E10=0,\"n/a\",(YVarExp-(YTotExp+YTotRet-J10))/E10)","v":"n/a"},""]
[null,null,null,null,null,null,null,null,null,null,null,null,null,null,null,null,"Enterprise","Enterprise"]
["FIXED COSTS",null,null,"Quantity","Quantity","Units","$/Unit","$/Unit","Total","Total","Share","Share","Landlord","Landlord","Tenant","Tenant","Total","Total"]
[null,"Machinery Depreciation"]
[null,null,"Tractors/Self-Propelled",1,null,"Acre",9.0779586864225799,null,9.0779586864225799,{"$f":"E75*H75","v":0},0,null,0,{"$f":"J75*L75","v":0},9.0779586864225799,{"$f":"+J75-N75","v":0},907.79586864225803,{"$f":"+J75*E$7","v":0}]
[null,null,"Implements",1,null,"Acre",3.0475010297676128,null,3.0475010297676128,0,0,null,0,{"$f":"J76*L76","v":0},3.0475010297676128,0,304.7501029767613,0]
[null,"Equipment Investment"]
[null,null,"Tractors/Self-Propelled",70.720226541001708,null,"Dollars",0.08,null,5.6576181232801366,{"$f":"E78*H78","v":0},0,null,0,{"$f":"J78*L78","v":0},5.6576181232801366,{"$f":"+J78-N78","v":0},565.76181232801366,{"$f":"+J78*E$7","v":0}]
[null,null,"Implements",13.036532182894792,null,"Dollars",0.08,null,1.0429225746315833,0,0,null,0,{"$f":"J79*L79","v":0},1.0429225746315833,0,104.29225746315834,0]
[null,"Salaried Labor",null,1,null,"Acre",0,null,0,0,0,null,0,{"$f":"J80*L80","v":0},0,{"$f":"+J80-N80","v":0},0,{"$f":"+J80*E$7","v":0}]
[null,"Management Fee, Owner/Operator Labor",null,1,null,"Acre",0,null,0,0,0,null,0,0,0,0,0,0]
[null,"Allocated Establishment Cost",null,1,null,"Acre",0,null,0,0,0,null,0,0,0,0,0,0]
[null,"Land Cost, Orchard",null,1,null,"Acre",100,null,100,0,0,null,0,0,100,0,10000,0]
[null,"Property Taxes",null,1,null,"Acre",0,null,0,0,0,null,0,0,0,0,0,0]
[null,"Whole Farm Insurance",null,1,null,"Acre",0,null,0,0,0,null,0,0,0,0,0,0]
[null,null,null,1,null,null,0,null,0,0,0,null,0,0,0,0,0,0]
[null,null,null,1,null,null,0,null,0,{"$f":"E87*H87","v":0},0,null,0,0,0,0,0,0]
["Total Fixed Costs",null,null,null,null,null,null,null,118.82600041410191,{"$f":"+SUM(J75:J87)","v":0},null,null,0,{"$f":"+SUM(N75:N87)","v":0},118.82600041410191,{"$f":"+SUM(P75:P87)","v":0},11882.600041410191,{"$f":"+SUM(R75:R87)","v":0}]
["Total Specified Costs",null,null,null,null,null,null,null,1316.7838286866822,{"$f":"+J69+J88","v":0},null,null,0,{"$f":"+N69+N88","v":0},1316.7838286866822,{"$f":"+P69+P88","v":0},131678.38286866824,{"$f":"+R69+R88","v":0}]
[]
["Returns Above Specified Costs",null,null,null,null,null,null,null,-1316.7838286866822,{"$f":"+J13-J89","v":0},null,null,0,{"$f":"+N13-N89","v":0},-1316.7838286866822,{"$f":"+P13-P89","v":0},-131678.38286866824,{"$f":"+R13-R89","v":0}]
[]
["    Breakeven Price to Cover Total Costs",null,null,null,null,null,"n/a",{"$f":"IF(E10=0,\"n/a\",(YTotExp-(YTotExp+YTotRet-J10))/E10)","v":"n/a"},""]
[]
[null,null,null,"Example Breakeven Prices"]
[null,"Example","Example","To Cover",null,null,"To Cover"]
[null,"Yield","Yield","Variable",null,null,"Total"]
[null,"Percent","","Costs",null,null,"Costs"]
[null,0.75,0,0,null,null,0]
[null,0.9,0,0,null,null,0]
[null,1,0,0,null,null,0]
[null,1.1000000000000001,0,0,null,null,0]
[null,1.25,0,0,null,null,0]
[]
["  Developed by Samuel Zapata, Assistant Professor and Extension Economist, Texas A&M AgriLife Extension, 956-968-5581.  "]
[0]
["Information presented is prepared solely as a general guide and not intended to recognize or predict the costs and returns from any one operation.  Brand names are mentioned only as examples and imply no endorsement."]

{"sheet":"GrapefruitYear3","index":4,"n_rows":122,"n_cols":18,"rows_kept":122,"cut":false,"hidden":false,"merged":[[109,3,109,8],[121,0,121,11],[0,0,0,11],[1,0,1,11],[2,0,2,11],[3,0,3,11]]}
["Projections for Planning Purposes Only -- Not to be Used without Updating"]
["2023 Estimated Costs and Returns per Acre"]
["Grapefruit, Year 3, Orchard Establishment, Flood Irrigated, Rio Grande Valley"]
["Enter your name for this budget in the cell above."]
["Enter  Your Values in the cells highlighed in MAROON."]
[null,null,null,null,"Your Acres",null,null,null,null,null,null,null,null,null,null,null,null,"Your"]
[null,null,"Crop Acres",100,null,null,null,null,null,null,null,"Your",null,null,null,null,"Enterprise","Enterprise"]
[null,null,null,null,"Your",null,null,"Your","Cash","Your","Landlord","Landlord",null,"Your",null,"Your","Total","Total"]
["REVENUE",null,null,"Quantity","Quantity","Units","$/Unit","$/Unit","Total","Total","Share","Share","Landlord","Landlord","Tenant","Tenant","(100 acres)",{"$f":"\"(\" & E7 & \" acres)\"","v":"( acres)"}]
[null,"Grapefruit (Rio Red)",null,3,null,"Ton",298.25,null,894.75,{"$f":"E10*H10","v":0},0,null,0,{"$f":"J10*L10","v":0},894.75,{"$f":"+J10-N10","v":0},89475,{"$f":"+J10*E$7","v":0}]
[null,null,null,0,null,null,0,null,0,0,0,null,0,0,0,0,0,0]
[null,null,null,0,null,null,0,null,0,0,0,null,0,0,0,0,0,0]
["Total Revenue",null,null,null,null,null,null,null,894.75,{"$f":"SUM(J10:J12)","v":0},null,null,0,{"$f":"SUM(N10:N12)","v":0},894.75,{"$f":"SUM(P10:P12)","v":0},89475,{"$f":"SUM(R10:R12)","v":0}]
[null,null,null,null,null,null,null,null,null,null,null,null,null,null,null,null,"Enterprise","Enterprise"]
["VARIABLE COSTS",null,null,"Quantity","Quantity","Units","$/Unit","$/Unit","Total","Total","Share","Share","Landlord","Landlord","Tenant","Tenant","Total","Total"]
["Production Costs"]
[null,"Custom"]
[null,"","Foliar Application",7,null,"Acre",50,null,350,{"$f":"E18*H18","v":0},0,null,0,{"$f":"J18*L18","v":0},350,{"$f":"+J18-N18","v":0},35000,{"$f":"+J18*E$7","v":0}]
[null,"","Sucker (Yr 1-3 Year)",1,null,"Acre",50,null,50,0,0,null,0,0,50,0,5000,0]
[null,"Fertilizer"]
[null,"","Urea (46%)",2.5,null,"CTW",44.75,null,111.875,0,0,null,0,0,111.875,0,11187.5,0]
[null,"","Foliar 3-18-18",1,null,"Gallon",34,null,34,0,0,null,0,0,34,0,3400,0]
[null,"","Foliar Zn",2,null,"Pound",3.4998,null,6.9996,0,0,null,0,0,6.9996,0,699.96,0]
[null,"","Foliar 18-8-5",2,null,"Gallon",15.5,null,31,0,0,null,0,0,31,0,3100,0]
[null,"","Foliar N",5,null,"Pound",0.61,null,3.05,0,0,null,0,0,3.05,0,305,0]
[null,"Herbicide"]
[null,"","Simazine 4L",1.25,null,"Gallon",38,null,47.5,0,0,null,0,0,47.5,0,4750,0]
[null,"","Krovar I 80 DF",3,null,"Pound",17.68,null,53.04,0,0,null,0,0,53.04,0,5304,0]
[null,"","Glyphosate",20,null,"Pint",6.25,null,125,0,0,null,0,0,125,0,12500,0]
[null,"Seed"]
[null,"","Young Citrus Trees",3,null,"Tree",15,null,45,0,0,null,0,0,45,0,4500,0]
[null,"","Layout and Plant",3,null,"Tree",5,null,15,0,0,null,0,0,15,0,1500,0]
[null,"","Removal Citrus",3,null,"Tree",25,null,75,0,0,null,0,0,75,0,7500,0]
[null,"","Treatment Removed citrus",3,null,"Tree",5,null,15,0,0,null,0,0,15,0,1500,0]
[null,"","Tree Wrap/Unwrap",3,null,"Tree",2,null,6,0,0,null,0,0,6,0,600,0]
[null,"Other Labor"]
[null,"","Costum Soil Fert. Citrus",6,null,"Hour",15,null,90,0,0,null,0,0,90,0,9000,0]
[null,"","Unallocated Labor",1,null,"Hour",15,null,15,0,0,null,0,0,15,0,1500,0]
[null,"Insecticide"]
[null,"","Movento",30,null,"Ounce",7.7886718750000004,null,233.66015625,0,0,null,0,0,233.66015625,0,23366.015625,0]
[null,"","Micromite",18.850000000000001,null,"Ounce",1.6328125,null,30.778515625000001,0,0,null,0,0,30.778515625000001,0,3077.8515625,0]
[null,"","Vendex ",8,null,"Pound",60.69,null,485.52,0,0,null,0,0,485.52,0,48552,0]
[null,"","Agri-Mek SC",0.32,null,"Gallon",89.95,null,28.784000000000002,0,0,null,0,0,28.784000000000002,0,2878.4,0]
[null,"","Actara",11,null,"Ounce",4.3316666666666661,null,47.648333333333326,0,0,null,0,0,47.648333333333326,0,4764.833333333333,0]
[null,"","Sivanto",10,null,"Ounce",3.2808593749999999,null,32.80859375,0,0,null,0,0,32.80859375,0,3280.859375,0]
[null,"","Esteem",10,null,"Ounce",13,null,130,0,0,null,0,0,130,0,13000,0]
[null,"","Danitol",16,null,"Ounce",1.0078125,null,16.125,0,0,null,0,0,16.125,0,1612.5,0]
[null,"","Admire Pro",0.44,null,"Pint",26.279999999999998,null,11.563199999999998,0,0,null,0,0,11.563199999999998,0,1156.32,0]
[null,"Miscellaneous"]
[null,"","Citrus Assessment",1,null,"Acre",5,null,5,0,0,null,0,0,5,0,500,0]
[null,"","Insurance, Young citrus trees",150,null,"Tree",0.22,null,33,0,0,null,0,0,33,0,3300,0]
[null,"Other Chemicals"]
[null,"","Surfactant",7.4099999999999984,null,"Pint",7.4749999999999996,null,55.389749999999985,0,0,null,0,0,55.389749999999985,0,5538.9749999999985,0]
[null,"Fungicides"]
[null,"","Quadris Top",10,null,"Ounce",1.5621093749999999,null,15.62109375,0,0,null,0,0,15.62109375,0,1562.109375,0]
[null,"","GEM",3.8,null,"Ounce",8.1234374999999996,null,30.869062499999998,0,0,null,0,0,30.869062499999998,0,3086.90625,0]
[null,"","Headline",24,null,"Ounce",1.859375,null,44.625,0,0,null,0,0,44.625,0,4462.5,0]
[null,null,null,16,null,null,3.2912499999999998,null,52.66,0,0,null,0,0,52.66,0,5266,0]
[null,null,null,0,null,null,0,null,0,0,0,null,0,0,0,0,0,0]
[null,null,null,0,null,null,0,null,0,{"$f":"E60*H60","v":0},0,null,0,{"$f":"J60*L60","v":0},0,{"$f":"+J60-N60","v":0},0,{"$f":"+J60*E$7","v":0}]
[null,"Irrigation"]
[null,null,"Water Cost",4,null,"Acre/Foot",21,null,84,{"$f":"E62*H62","v":0},0,null,0,{"$f":"J62*L62","v":0},84,{"$f":"+J62-N62","v":0},8400,{"$f":"+J62*E$7","v":0}]
[null,null,"Irrigation Labor",14,null,"Hour",17.5,null,245,0,0,null,0,0,245,0,24500,0]
[null,"Machinery Labor"]
[null,null,"Tractors/Self-Propelled",0.8,null,"Hour",17.21,null,13.768000000000001,{"$f":"E65*H65","v":0},0,null,0,{"$f":"J65*L65","v":0},13.768000000000001,{"$f":"+J65-N65","v":0},1376.8000000000002,{"$f":"+J65*E$7","v":0}]
[null,null,"Other Labor",0.4,null,"Hour",17.21,null,6.8840000000000003,{"$f":"E66*H66","v":0},0,null,0,{"$f":"J66*L66","v":0},6.8840000000000003,{"$f":"+J66-N66","v":0},688.40000000000009,{"$f":"+J66*E$7","v":0}]
[]
[null,"Diesel Fuel"]
[null,null,"Pickup/General Use Equipment",1,null,"Acre",0,null,0,{"$f":"E69*H69","v":0},0,null,0,{"$f":"J69*L69","v":0},0,{"$f":"+J69-N69","v":0},0,{"$f":"+J69*E$7","v":0}]
[null,null,"Tractors/Self-Propelled",3.66,null,"Gallon",2.2400000000000002,null,8.1984000000000012,{"$f":"E70*H70","v":0},0,null,0,{"$f":"J70*L70","v":0},8.1984000000000012,{"$f":"+J70-N70","v":0},819.84000000000015,{"$f":"+J70*E$7","v":0}]
[]
[null,"Gasoline"]
[null,null,"Pickup/General Use Equipment",1,null,"Acre",0,null,0,{"$f":"E73*H73","v":0},0,null,0,{"$f":"J73*L73","v":0},0,{"$f":"+J73-N73","v":0},0,{"$f":"+J73*E$7","v":0}]
[null,null,"Tractors/Self-Propelled",0,null,"Gallon",2.09,null,0,{"$f":"E74*H74","v":0},0,null,0,{"$f":"J74*L74","v":0},0,{"$f":"+J74-N74","v":0},0,{"$f":"+J74*E$7","v":0}]
[]
[null,"Repairs & Maintenance"]
[null,null,"Pickup/General Use Equipment",1,null,"Acre",0,null,0,{"$f":"E77*H77","v":0},0,null,0,{"$f":"J77*L77","v":0},0,{"$f":"+J77-N77","v":0},0,{"$f":"+J77*E$7","v":0}]
[null,null,"Irrigation Equipment",1,null,"Acre",0,null,0,0,0,null,0,0,0,0,0,0]
[null,null,"Tractors/Self-Propelled",1,null,"Acre",8.7851213094412053,null,8.7851213094412053,0,0,null,0,0,8.7851213094412053,0,878.51213094412049,0]
[null,null,"Implements",1,null,"Acre",2.8569806404862446,null,2.8569806404862446,0,0,null,0,0,2.8569806404862446,0,285.69806404862447,0]
[null,null,null,null,null,null,null,null,0,0,0,null,0,0,0,0,0,{"$f":"+J81*E$7","v":0}]
[null,null,null,null,null,null,null,null,0,0,0,null,0,0,0,0,0,0]
[null,"Interest on Credit Line",null,null,null,null,0.08,null,114.0596981893014,{"$f":"+SUM(J17:J82)/2*H83","v":0},null,null,0,{"$f":"+SUM(N17:N82)/2*L83","v":0},114.0596981893014,{"$f":"+SUM(P17:P82)/2*L83","v":0},11405.96981893014,{"$f":"+J83*E$7","v":0}]
["Total Variable Costs",null,null,null,null,null,null,null,2811.069505347562,{"$f":"SUM(J18:J83)","v":0},null,null,0,{"$f":"SUM(N18:N83)","v":0},2811.069505347562,{"$f":"SUM(P18:P83)","v":0},281106.95053475624,{"$f":"SUM(R18:R83)","v":0}]
["Planned Returns Above Variable Costs:",null,null,null,null,null,null,null,-1916.319505347562,{"$f":"+J13-J84","v":0},null,null,0,{"$f":"+N13-N84","v":0},-1916.319505347562,{"$f":"+P13-P84","v":0},-191631.95053475624,{"$f":"+R13-R84","v":0}]
[null,"Breakeven Price to Cover Variable Costs",null,null,null,null,937.02316844918732,{"$f":"IF(E10=0,\"n/a\",(YVarExp-(YTotExp+YTotRet-J10))/E10)","v":"n/a"},"Ton"]
[null,null,null,null,null,null,null,null,null,null,null,null,null,null,null,null,"Enterprise","Enterprise"]
["FIXED COSTS",null,null,"Quantity","Quantity","Units","$/Unit","$/Unit",null,"Total","Share","Share","Landlord","Landlord","Tenant","Tenant","Total","Total"]
[null,"Machinery Depreciation"]
[null,null,"Tractors/Self-Propelled",1,null,"Acre",9.0779586864225799,null,9.0779586864225799,{"$f":"E90*H90","v":0},0,null,0,{"$f":"J90*L90","v":0},9.0779586864225799,{"$f":"+J90-N90","v":0},907.79586864225803,{"$f":"+J90*E$7","v":0}]
[null,null,"Implements",1,null,"Acre",3.0475010297676128,null,3.0475010297676128,0,0,null,0,{"$f":"J91*L91","v":0},3.0475010297676128,0,304.7501029767613,0]
[null,"Equipment Investment"]
[null,null,"Tractors/Self-Propelled",70.720226541001708,null,"Dollars",0.08,null,5.6576181232801366,{"$f":"E93*H93","v":0},0,null,0,{"$f":"J93*L93","v":0},5.6576181232801366,{"$f":"+J93-N93","v":0},565.76181232801366,{"$f":"+J93*E$7","v":0}]
[null,null,"Implements",13.036532182894792,null,"Dollars",0.08,null,1.0429225746315833,0,0,null,0,{"$f":"J94*L94","v":0},1.0429225746315833,0,104.29225746315834,0]
[null,"Salaried Labor",null,1,null,"Acre",0,null,0,0,0,null,0,{"$f":"J95*L95","v":0},0,{"$f":"+J95-N95","v":0},0,{"$f":"+J95*E$7","v":0}]
[null,"Management Fee, Owner/Operator Labor",null,1,null,"Acre",0,null,0,0,0,null,0,0,0,0,0,0]
[null,"Allocated Establishment Cost",null,1,null,"Acre",142.47424883349353,null,142.47424883349353,0,0,null,0,0,142.47424883349353,0,14247.424883349353,0]
[null,"Land Cost, Orchard",null,1,null,"Acre",100,null,100,0,0,null,0,0,100,0,10000,0]
[null,"Property Taxes",null,1,null,"Acre",0,null,0,{"$f":"E99*H99","v":0},0,null,0,0,0,0,0,{"$f":"+J99*E$7","v":0}]
[null,"Whole Farm Insurance",null,1,null,"Acre",0,null,0,0,0,null,0,0,0,0,0,0]
[null,null,null,1,null,null,0,null,0,0,0,null,0,0,0,0,0,0]
[null,null,null,1,null,null,0,null,0,0,0,null,0,0,0,0,0,0]
["Total Fixed Costs",null,null,null,null,null,null,null,261.30024924759545,{"$f":"+SUM(J90:J102)","v":0},null,null,0,{"$f":"+SUM(N90:N102)","v":0},261.30024924759545,{"$f":"+SUM(P90:P102)","v":0},26130.024924759542,{"$f":"+SUM(R90:R102)","v":0}]
["Total Specified Costs",null,null,null,null,null,null,null,3072.3697545951572,{"$f":"+J84+J103","v":0},null,null,0,{"$f":"+N84+N103","v":0},3072.3697545951572,{"$f":"+P84+P103","v":0},307236.97545951576,{"$f":"+R84+R103","v":0}]
[]
["Returns Above Specified Costs",null,null,null,null,null,null,null,-2177.6197545951572,{"$f":"+J13-J104","v":0},null,null,0,{"$f":"+N13-N104","v":0},-2177.6197545951572,{"$f":"+P13-P104","v":0},-217761.97545951576,{"$f":"+R13-R104","v":0}]
[]
["    Breakeven Price to Cover Total Costs",null,null,null,null,null,1024.123251531719,{"$f":"IF(E10=0,\"n/a\",(YTotExp-(YTotExp+YTotRet-J10))/E10)","v":"n/a"},"Ton"]
[]
[null,null,null,"Example Breakeven Prices"]
[null,"Example","Example","To Cover",null,null,"To Cover"]
[null,"Yield","Yield","Variable",null,null,"Total"]
[null,"Percent","Ton","Costs",null,null,"Costs"]
[null,0.75,2.25,1249.3642245989165,null,null,1365.4976687089588]
[null,0.9,2.7,1041.1368538324302,null,null,1137.9147239241322]
[null,1,3,937.02316844918732,null,null,1024.123251531719]
[null,1.1000000000000001,3.3000000000000003,851.83924404471566,null,null,931.02113775610815]
[null,1.25,3.75,749.61853475934981,null,null,819.29860122537525]
[]
["  Developed by Samuel Zapata, Assistant Professor and Extension Economist, Texas A&M AgriLife Extension, 956-968-5581.  "]
[]
["Information presented is prepared solely as a general guide and not intended to recognize or predict the costs and returns from any one operation.  Brand names are mentioned only as examples and imply no endorsement."]

{"sheet":"GrapefruitYear4","index":5,"n_rows":122,"n_cols":18,"rows_kept":122,"cut":false,"hidden":false,"merged":[[109,3,109,8],[121,0,121,11],[0,0,0,11],[1,0,1,11],[2,0,2,11],[3,0,3,11]]}
["Projections for Planning Purposes Only -- Not to be Used without Updating"]
["2023 Estimated Costs and Returns per Acre"]
["Grapefruit, Year 4, Orchard Establishment, Flood Irrigated, Rio Grande Valley"]
["Enter your name for this budget in the cell above."]
["Enter  Your Values in the cells highlighed in MAROON."]
[null,null,null,null,"Your Acres",null,null,null,null,null,null,null,null,null,null,null,null,"Your"]
[null,null,"Crop Acres",100,null,null,null,null,null,null,null,"Your",null,null,null,null,"Enterprise","Enterprise"]
[null,null,null,null,"Your",null,null,"Your","Cash","Your","Landlord","Landlord",null,"Your",null,"Your","Total","Total"]
["REVENUE",null,null,"Quantity","Quantity","Units","$/Unit","$/Unit","Total","Total","Share","Share","Landlord","Landlord","Tenant","Tenant","(100 acres)",{"$f":"\"(\" & E7 & \" acres)\"","v":"( acres)"}]
[null,"Grapefruit (Rio Red)",null,6,null,"Ton",298.25,null,1789.5,{"$f":"E10*H10","v":0},0,null,0,{"$f":"J10*L10","v":0},1789.5,{"$f":"+J10-N10","v":0},178950,{"$f":"+J10*E$7","v":0}]
[null,null,null,0,null,null,0,null,0,0,0,null,0,0,0,{"$f":"+J11-N11","v":0},0,0]
[null,null,null,0,null,null,0,null,0,0,0,null,0,0,0,0,0,0]
["Total Revenue",null,null,null,null,null,null,null,1789.5,{"$f":"SUM(J10:J12)","v":0},null,null,0,{"$f":"SUM(N10:N12)","v":0},1789.5,{"$f":"SUM(P10:P12)","v":0},178950,{"$f":"SUM(R10:R12)","v":0}]
[null,null,null,null,null,null,null,null,null,null,null,null,null,null,null,null,"Enterprise","Enterprise"]
["VARIABLE COSTS",null,null,"Quantity","Quantity","Units","$/Unit","$/Unit","Total","Total","Share","Share","Landlord","Landlord","Tenant","Tenant","Total","Total"]
["Production Costs"]
[null,"Custom"]
[null,"","Foliar Application",7,null,"Acre",50,null,350,{"$f":"E18*H18","v":0},0,null,0,{"$f":"J18*L18","v":0},350,{"$f":"+J18-N18","v":0},35000,{"$f":"+J18*E$7","v":0}]
[null,"","Prune (Yr 3-6 Year)",1,null,"Acre",60,null,60,0,0,null,0,0,60,0,6000,0]
[null,"Fertilizer"]
[null,"","Urea (46%)",2.5,null,"CTW",44.75,null,111.875,0,0,null,0,0,111.875,0,11187.5,0]
[null,"","Foliar 3-18-18",1,null,"Gallon",34,null,34,0,0,null,0,0,34,0,3400,0]
[null,"","Foliar Zn",2,null,"Pound",3.4998,null,6.9996,0,0,null,0,0,6.9996,0,699.96,0]
[null,"","Foliar 18-8-5",2,null,"Gallon",15.5,null,31,0,0,null,0,0,31,0,3100,0]
[null,"","Foliar N",5,null,"Pound",0.61,null,3.05,0,0,null,0,0,3.05,0,305,0]
[null,"Herbicide"]
[null,"","Simazine 4L",1.25,null,"Gallon",38,null,47.5,0,0,null,0,0,47.5,0,4750,0]
[null,"","Krovar I 80 DF",3,null,"Pound",17.68,null,53.04,0,0,null,0,0,53.04,0,5304,0]
[null,"","Glyphosate",20,null,"Pint",6.25,null,125,0,0,null,0,0,125,0,12500,0]
[null,"Insecticide"]
[null,"","Movento",30,null,"Ounce",7.7886718750000004,null,233.66015625,0,0,null,0,0,233.66015625,0,23366.015625,0]
[null,"","Micromite",18.8,null,"Ounce",1.6328125,null,30.696875000000002,0,0,null,0,0,30.696875000000002,0,3069.6875,0]
[null,"","Vendex ",8,null,"Pound",60.69,null,485.52,0,0,null,0,0,485.52,0,48552,0]
[null,"","Agri-Mek SC",0.32,null,"Gallon",89.95,null,28.784000000000002,0,0,null,0,0,28.784000000000002,0,2878.4,0]
[null,"","Actara",11,null,"Ounce",4.3316666666666661,null,47.648333333333326,0,0,null,0,0,47.648333333333326,0,4764.833333333333,0]
[null,"","Sivanto",10,null,"Ounce",3.2808593749999999,null,32.80859375,0,0,null,0,0,32.80859375,0,3280.859375,0]
[null,"","Esteem",10,null,"Ounce",13,null,130,0,0,null,0,0,130,0,13000,0]
[null,"","Danitol",16,null,"Ounce",1.0078125,null,16.125,0,0,null,0,0,16.125,0,1612.5,0]
[null,"","Admire Pro",0.44,null,"Pint",26.279999999999998,null,11.563199999999998,0,0,null,0,0,11.563199999999998,0,1156.32,0]
[null,"Seed"]
[null,"","Young Citrus Trees",3,null,"Tree",15,null,45,0,0,null,0,0,45,0,4500,0]
[null,"","Layout and Plant",3,null,"Tree",5,null,15,0,0,null,0,0,15,0,1500,0]
[null,"","Removal Citrus",3,null,"Tree",25,null,75,0,0,null,0,0,75,0,7500,0]
[null,"","Treatment Removed citrus",3,null,"Tree",5,null,15,0,0,null,0,0,15,0,1500,0]
[null,"","Tree Wrap/Unwrap",3,null,"Tree",2,null,6,0,0,null,0,0,6,0,600,0]
[null,"Other Labor"]
[null,"","Costum Soil Fert. Citrus",6,null,"Hour",15,null,90,0,0,null,0,0,90,0,9000,0]
[null,"","Unallocated Labor",1,null,"Hour",15,null,15,0,0,null,0,0,15,0,1500,0]
[null,"Miscellaneous"]
[null,"","Citrus Assessment",1,null,"Acre",5,null,5,0,0,null,0,0,5,0,500,0]
[null,"","Insurance, Grapefruit",1,null,"Acre",128.66627033830355,null,128.66627033830355,0,0,null,0,0,128.66627033830355,0,12866.627033830355,0]
[null,"Other Chemicals"]
[null,"","Surfactant",7.9799999999999986,null,"Pint",7.4749999999999996,null,59.650499999999987,0,0,null,0,0,59.650499999999987,0,5965.0499999999984,0]
[null,"Fungicides"]
[null,"","Quadris Top",10,null,"Ounce",1.5621093749999999,null,15.62109375,0,0,null,0,0,15.62109375,0,1562.109375,0]
[null,"","GEM",3.8,null,"Ounce",8.1234374999999996,null,30.869062499999998,0,0,null,0,0,30.869062499999998,0,3086.90625,0]
[null,"","Headline",24,null,"Ounce",1.859375,null,44.625,0,0,null,0,0,44.625,0,4462.5,0]
[null,null,null,16,null,null,3.2912499999999998,null,52.66,0,0,null,0,0,52.66,0,5266,0]
[null,null,null,0,null,null,0,null,0,0,0,null,0,0,0,0,0,0]
[null,null,null,0,null,null,0,null,0,{"$f":"E60*H60","v":0},0,null,0,{"$f":"J60*L60","v":0},0,{"$f":"+J60-N60","v":0},0,{"$f":"+J60*E$7","v":0}]
[null,"Irrigation"]
[null,null,"Water Cost",4,null,"Acre/Foot",21,null,84,{"$f":"E62*H62","v":0},0,null,0,{"$f":"J62*L62","v":0},84,{"$f":"+J62-N62","v":0},8400,{"$f":"+J62*E$7","v":0}]
[null,null,"Irrigation Labor",14,null,"Hour",17.5,null,245,0,0,null,0,0,245,0,24500,0]
[null,"Machinery Labor"]
[null,null,"Tractors/Self-Propelled",0.8,null,"Hour",17.21,null,13.768000000000001,{"$f":"E65*H65","v":0},0,null,0,{"$f":"J65*L65","v":0},13.768000000000001,{"$f":"+J65-N65","v":0},1376.8000000000002,{"$f":"+J65*E$7","v":0}]
[null,null,"Other Labor",0.4,null,"Hour",17.21,null,6.8840000000000003,{"$f":"E66*H66","v":0},0,null,0,{"$f":"J66*L66","v":0},6.8840000000000003,{"$f":"+J66-N66","v":0},688.40000000000009,{"$f":"+J66*E$7","v":0}]
[]
[null,"Diesel Fuel"]
[null,null,"Pickup/General Use Equipment",1,null,"Acre",0,null,0,{"$f":"E69*H69","v":0},0,null,0,{"$f":"J69*L69","v":0},0,{"$f":"+J69-N69","v":0},0,{"$f":"+J69*E$7","v":0}]
[null,null,"Tractors/Self-Propelled",3.66,null,"Gallon",2.2400000000000002,null,8.1984000000000012,{"$f":"E70*H70","v":0},0,null,0,{"$f":"J70*L70","v":0},8.1984000000000012,{"$f":"+J70-N70","v":0},819.84000000000015,{"$f":"+J70*E$7","v":0}]
[]
[null,"Gasoline"]
[null,null,"Pickup/General Use Equipment",1,null,"Acre",0,null,0,{"$f":"E73*H73","v":0},0,null,0,{"$f":"J73*L73","v":0},0,{"$f":"+J73-N73","v":0},0,{"$f":"+J73*E$7","v":0}]
[null,null,"Tractors/Self-Propelled",0,null,"Gallon",2.09,null,0,{"$f":"E74*H74","v":0},0,null,0,{"$f":"J74*L74","v":0},0,{"$f":"+J74-N74","v":0},0,{"$f":"+J74*E$7","v":0}]
[]
[null,"Repairs & Maintenance"]
[null,null,"Pickup/General Use Equipment",1,null,"Acre",0,null,0,{"$f":"E77*H77","v":0},0,null,0,{"$f":"J77*L77","v":0},0,{"$f":"+J77-N77","v":0},0,{"$f":"+J77*E$7","v":0}]
[null,null,"Irrigation Equipment",1,null,"Acre",0,null,0,0,0,null,0,0,0,0,0,0]
[null,null,"Tractors/Self-Propelled",1,null,"Acre",8.7851213094412053,null,8.7851213094412053,0,0,null,0,0,8.7851213094412053,0,878.51213094412049,0]
[null,null,"Implements",1,null,"Acre",2.8569806404862446,null,2.8569806404862446,0,0,null,0,0,2.8569806404862446,0,285.69806404862447,0]
[null,null,null,null,null,null,null,null,0,0,0,null,0,0,0,0,0,0]
[null,null,null,null,null,null,null,null,0,0,0,null,0,0,0,0,0,0]
[null,"Interest on Credit Line",null,null,null,null,0.08,null,120.04419448632541,{"$f":"+SUM(J17:J82)/2*H83","v":0},null,null,0,{"$f":"+SUM(N17:N82)/2*L83","v":0},120.04419448632541,{"$f":"+SUM(P17:P82)/2*L83","v":0},12004.419448632541,{"$f":"+J83*E$7","v":0}]
["Total Variable Costs",null,null,null,null,null,null,null,2926.89938135789,{"$f":"SUM(J18:J83)","v":0},null,null,0,{"$f":"SUM(N18:N83)","v":0},2926.89938135789,{"$f":"SUM(P18:P83)","v":0},292689.93813578895,{"$f":"SUM(R18:R83)","v":0}]
["Planned Returns Above Variable Costs:",null,null,null,null,null,null,null,-1137.39938135789,{"$f":"+J13-J84","v":0},null,null,0,{"$f":"+N13-N84","v":0},-1137.39938135789,{"$f":"+P13-P84","v":0},-113739.93813578895,{"$f":"+R13-R84","v":0}]
[null,"Breakeven Price to Cover Variable Costs",null,null,null,null,487.81656355964833,{"$f":"IF(E10=0,\"n/a\",(YVarExp-(YTotExp+YTotRet-J10))/E10)","v":"n/a"},"Ton"]
[null,null,null,null,null,null,null,null,null,null,null,null,null,null,null,null,"Enterprise","Enterprise"]
["FIXED COSTS",null,null,"Quantity","Quantity","Units","$/Unit","$/Unit","Total","Total","Share","Share","Landlord","Landlord","Tenant","Tenant","Total","Total"]
[null,"Machinery Depreciation"]
[null,null,"Tractors/Self-Propelled",1,null,"Acre",9.0779586864225799,null,9.0779586864225799,{"$f":"E90*H90","v":0},0,null,0,{"$f":"J90*L90","v":0},9.0779586864225799,{"$f":"+J90-N90","v":0},907.79586864225803,{"$f":"+J90*E$7","v":0}]
[null,null,"Implements",1,null,"Acre",3.0475010297676128,null,3.0475010297676128,0,0,null,0,{"$f":"J91*L91","v":0},3.0475010297676128,0,304.7501029767613,0]
[null,"Equipment Investment"]
[null,null,"Tractors/Self-Propelled",70.720226541001708,null,"Dollars",0.08,null,5.6576181232801366,{"$f":"E93*H93","v":0},0,null,0,{"$f":"J93*L93","v":0},5.6576181232801366,{"$f":"+J93-N93","v":0},565.76181232801366,{"$f":"+J93*E$7","v":0}]
[null,null,"Implements",13.036532182894792,null,"Dollars",0.08,null,1.0429225746315833,0,0,null,0,{"$f":"J94*L94","v":0},1.0429225746315833,0,104.29225746315834,0]
[null,"Salaried Labor",null,1,null,"Acre",0,null,0,0,0,null,0,{"$f":"J95*L95","v":0},0,{"$f":"+J95-N95","v":0},0,{"$f":"+J95*E$7","v":0}]
[null,"Management Fee, Owner/Operator Labor",null,1,null,"Acre",0,null,0,0,0,null,0,0,0,0,0,0]
[null,"Allocated Establishment Cost",null,1,null,"Acre",142.47424883349353,null,142.47424883349353,0,0,null,0,0,142.47424883349353,0,14247.424883349353,0]
[null,"Land Cost, Orchard",null,1,null,"Acre",100,null,100,0,0,null,0,0,100,0,10000,0]
[null,"Property Taxes",null,1,null,"Acre",0,null,0,0,0,null,0,0,0,0,0,0]
[null,"Whole Farm Insurance",null,1,null,"Acre",0,null,0,0,0,null,0,0,0,0,0,0]
[null,null,null,1,null,null,0,null,0,0,0,null,0,0,0,0,0,0]
[null,null,null,1,null,null,0,null,0,{"$f":"E102*H102","v":0},0,null,0,0,0,0,0,0]
["Total Fixed Costs",null,null,null,null,null,null,null,261.30024924759545,{"$f":"+SUM(J90:J102)","v":0},null,null,0,{"$f":"+SUM(N90:N102)","v":0},261.30024924759545,{"$f":"+SUM(P90:P102)","v":0},26130.024924759542,{"$f":"+SUM(R90:R102)","v":0}]
["Total Specified Costs",null,null,null,null,null,null,null,3188.1996306054853,{"$f":"+J84+J103","v":0},null,null,0,{"$f":"+N84+N103","v":0},3188.1996306054853,{"$f":"+P84+P103","v":0},318819.96306054847,{"$f":"+R84+R103","v":0}]
[]
["Returns Above Specified Costs",null,null,null,null,null,null,null,-1398.6996306054853,{"$f":"+J13-J104","v":0},null,null,0,{"$f":"+N13-N104","v":0},-1398.6996306054853,{"$f":"+P13-P104","v":0},-139869.96306054847,{"$f":"+R13-R104","v":0}]
[]
["    Breakeven Price to Cover Total Costs",null,null,null,null,null,531.36660510091417,{"$f":"IF(E10=0,\"n/a\",(YTotExp-(YTotExp+YTotRet-J10))/E10)","v":"n/a"},"Ton"]
[]
[null,null,null,"Example Breakeven Prices"]
[null,"Example","Example","To Cover",null,null,"To Cover"]
[null,"Yield","Yield","Variable",null,null,"Total"]
[null,"Percent","Ton","Costs",null,null,"Costs"]
[null,0.75,4.5,650.42208474619781,null,null,708.48880680121897]
[null,0.9,5.4,542.01840395516479,null,null,590.40733900101577]
[null,1,6,487.81656355964833,null,null,531.36660510091417]
[null,1.1000000000000001,6.6000000000000005,443.46960323604389,null,null,483.06055009174014]
[null,1.25,7.5,390.25325084771868,null,null,425.09328408073139]
[]
["  Developed by Samuel Zapata, Assistant Professor and Extension Economist, Texas A&M AgriLife Extension, 956-968-5581.  "]
[]
["Information presented is prepared solely as a general guide and not intended to recognize or predict the costs and returns from any one operation.  Brand names are mentioned only as examples and imply no endorsement."]

{"sheet":"GrapefruitYear5","index":6,"n_rows":122,"n_cols":18,"rows_kept":122,"cut":false,"hidden":false,"merged":[[109,3,109,8],[121,0,121,11],[0,0,0,11],[1,0,1,11],[2,0,2,11],[3,0,3,11]]}
["Projections for Planning Purposes Only -- Not to be Used without Updating"]
["2023 Estimated Costs and Returns per Acre"]
["Grapefruit, Year 5, Orchard Establishment, Flood Irrigated, Rio Grande Valley"]
["Enter your name for this budget in the cell above."]
["Enter  Your Values in the cells highlighed in MAROON."]
[null,null,null,null,"Your Acres",null,null,null,null,null,null,null,null,null,null,null,null,"Your"]
[null,null,"Crop Acres",100,null,null,null,null,null,null,null,"Your",null,null,null,null,"Enterprise","Enterprise"]
[null,null,null,null,"Your",null,null,"Your","Cash","Your","Landlord","Landlord",null,"Your",null,"Your","Total","Total"]
["REVENUE",null,null,"Quantity","Quantity","Units","$/Unit","$/Unit","Total","Total","Share","Share","Landlord","Landlord","Tenant","Tenant","(100 acres)",{"$f":"\"(\" & E7 & \" acres)\"","v":"( acres)"}]
[null,"Grapefruit (Rio Red)",null,9,null,"Ton",298.25,null,2684.25,{"$f":"E10*H10","v":0},0,null,0,{"$f":"J10*L10","v":0},2684.25,{"$f":"+J10-N10","v":0},268425,{"$f":"+J10*E$7","v":0}]
[null,null,null,0,null,null,0,null,0,0,0,null,0,0,0,{"$f":"+J11-N11","v":0},0,0]
[null,null,null,0,null,null,0,null,0,0,0,null,0,0,0,0,0,0]
["Total Revenue",null,null,null,null,null,null,null,2684.25,{"$f":"SUM(J10:J12)","v":0},null,null,0,{"$f":"SUM(N10:N12)","v":0},2684.25,{"$f":"SUM(P10:P12)","v":0},268425,{"$f":"SUM(R10:R12)","v":0}]
[null,null,null,null,null,null,null,null,null,null,null,null,null,null,null,null,"Enterprise","Enterprise"]
["VARIABLE COSTS",null,null,"Quantity","Quantity","Units","$/Unit","$/Unit","Total","Total","Share","Share","Landlord","Landlord","Tenant","Tenant","Total","Total"]
["Production Costs"]
[null,"Custom"]
[null,"","Foliar Application",7,null,"Acre",50,null,350,{"$f":"E18*H18","v":0},0,null,0,{"$f":"J18*L18","v":0},350,{"$f":"+J18-N18","v":0},35000,{"$f":"+J18*E$7","v":0}]
[null,"","Prune (Yr 3-6 Year)",1,null,"Acre",60,null,60,0,0,null,0,0,60,0,6000,0]
[null,"Fertilizer"]
[null,"","Urea (46%)",2.5,null,"CTW",44.75,null,111.875,0,0,null,0,0,111.875,0,11187.5,0]
[null,"","Foliar 3-18-18",1,null,"Gallon",34,null,34,0,0,null,0,0,34,0,3400,0]
[null,"","Foliar Zn",2,null,"Pound",3.4998,null,6.9996,0,0,null,0,0,6.9996,0,699.96,0]
[null,"","Foliar 18-8-5",2,null,"Gallon",15.5,null,31,0,0,null,0,0,31,0,3100,0]
[null,"","Foliar N",5,null,"Pound",0.61,null,3.05,0,0,null,0,0,3.05,0,305,0]
[null,"Herbicide"]
[null,"","Simazine 4L",1.25,null,"Gallon",38,null,47.5,0,0,null,0,0,47.5,0,4750,0]
[null,"","Krovar I 80 DF",3,null,"Pound",17.68,null,53.04,0,0,null,0,0,53.04,0,5304,0]
[null,"","Glyphosate",20,null,"Pint",6.25,null,125,0,0,null,0,0,125,0,12500,0]
[null,"Insecticide"]
[null,"","Movento",30,null,"Ounce",7.7886718750000004,null,233.66015625,0,0,null,0,0,233.66015625,0,23366.015625,0]
[null,"","Micromite",18.8,null,"Ounce",1.6328125,null,30.696875000000002,0,0,null,0,0,30.696875000000002,0,3069.6875,0]
[null,"","Vendex ",8,null,"Pound",60.69,null,485.52,0,0,null,0,0,485.52,0,48552,0]
[null,"","Agri-Mek SC",0.32,null,"Gallon",89.95,null,28.784000000000002,0,0,null,0,0,28.784000000000002,0,2878.4,0]
[null,"","Actara",11,null,"Ounce",4.3316666666666661,null,47.648333333333326,0,0,null,0,0,47.648333333333326,0,4764.833333333333,0]
[null,"","Sivanto",10,null,"Ounce",3.2808593749999999,null,32.80859375,0,0,null,0,0,32.80859375,0,3280.859375,0]
[null,"","Danitol",16,null,"Ounce",1.0078125,null,16.125,0,0,null,0,0,16.125,0,1612.5,0]
[null,"","Admire Pro",0.44,null,"Pint",26.279999999999998,null,11.563199999999998,0,0,null,0,0,11.563199999999998,0,1156.32,0]
[null,"","Esteem ",10,null,"Ounce",9.9190000000000005,null,99.19,0,0,null,0,0,99.19,0,9919,0]
[null,"Miscellaneous"]
[null,"","Citrus Assessment",1,null,"Acre",5,null,5,0,0,null,0,0,5,0,500,0]
[null,"","Insurance, Grapefruit",1,null,"Acre",128.66627033830355,null,128.66627033830355,0,0,null,0,0,128.66627033830355,0,12866.627033830355,0]
[null,"Seed"]
[null,"","Young Citrus Trees",3,null,"Tree",15,null,45,0,0,null,0,0,45,0,4500,0]
[null,"","Layout and Plant",3,null,"Tree",5,null,15,0,0,null,0,0,15,0,1500,0]
[null,"","Removal Citrus",3,null,"Tree",25,null,75,0,0,null,0,0,75,0,7500,0]
[null,"","Treatment Removed citrus",3,null,"Tree",5,null,15,0,0,null,0,0,15,0,1500,0]
[null,"","Tree Wrap/Unwrap",3,null,"Tree",2,null,6,0,0,null,0,0,6,0,600,0]
[null,"Other Labor"]
[null,"","Costum Soil Fert. Citrus",6,null,"Hour",15,null,90,0,0,null,0,0,90,0,9000,0]
[null,"","Unallocated Labor",1,null,"Hour",15,null,15,0,0,null,0,0,15,0,1500,0]
[null,"Other Chemicals"]
[null,"","Surfactant",7.9799999999999986,null,"Pint",7.4749999999999996,null,59.650499999999987,0,0,null,0,0,59.650499999999987,0,5965.0499999999984,0]
[null,"Fungicides"]
[null,"","Quadris Top",10,null,"Ounce",1.5621093749999999,null,15.62109375,0,0,null,0,0,15.62109375,0,1562.109375,0]
[null,"","GEM",3.8,null,"Ounce",8.1234374999999996,null,30.869062499999998,0,0,null,0,0,30.869062499999998,0,3086.90625,0]
[null,"","Headline",24,null,"Ounce",1.859375,null,44.625,0,0,null,0,0,44.625,0,4462.5,0]
[null,null,null,16,null,null,3.2912499999999998,null,52.66,0,0,null,0,0,52.66,0,5266,0]
[null,null,null,0,null,null,0,null,0,0,0,null,0,0,0,0,0,0]
[null,null,null,0,null,null,0,null,0,{"$f":"E60*H60","v":0},0,null,0,{"$f":"J60*L60","v":0},0,{"$f":"+J60-N60","v":0},0,{"$f":"+J60*E$7","v":0}]
[null,"Irrigation"]
[null,null,"Water Cost",4,null,"Acre/Foot",21,null,84,{"$f":"E62*H62","v":0},0,null,0,{"$f":"J62*L62","v":0},84,{"$f":"+J62-N62","v":0},8400,{"$f":"+J62*E$7","v":0}]
[null,null,"Irrigation Labor",14,null,"Hour",17.5,null,245,0,0,null,0,0,245,0,24500,0]
[null,"Machinery Labor"]
[null,null,"Tractors/Self-Propelled",0.8,null,"Hour",17.21,null,13.768000000000001,{"$f":"E65*H65","v":0},0,null,0,{"$f":"J65*L65","v":0},13.768000000000001,{"$f":"+J65-N65","v":0},1376.8000000000002,{"$f":"+J65*E$7","v":0}]
[null,null,"Other Labor",0.4,null,"Hour",17.21,null,6.8840000000000003,{"$f":"E66*H66","v":0},0,null,0,{"$f":"J66*L66","v":0},6.8840000000000003,{"$f":"+J66-N66","v":0},688.40000000000009,{"$f":"+J66*E$7","v":0}]
[]
[null,"Diesel Fuel"]
[null,null,"Pickup/General Use Equipment",1,null,"Acre",0,null,0,{"$f":"E69*H69","v":0},0,null,0,{"$f":"J69*L69","v":0},0,{"$f":"+J69-N69","v":0},0,{"$f":"+J69*E$7","v":0}]
[null,null,"Tractors/Self-Propelled",3.66,null,"Gallon",2.2400000000000002,null,8.1984000000000012,{"$f":"E70*H70","v":0},0,null,0,{"$f":"J70*L70","v":0},8.1984000000000012,{"$f":"+J70-N70","v":0},819.84000000000015,{"$f":"+J70*E$7","v":0}]
[]
[null,"Gasoline"]
[null,null,"Pickup/General Use Equipment",1,null,"Acre",0,null,0,{"$f":"E73*H73","v":0},0,null,0,{"$f":"J73*L73","v":0},0,{"$f":"+J73-N73","v":0},0,{"$f":"+J73*E$7","v":0}]
[null,null,"Tractors/Self-Propelled",0,null,"Gallon",2.09,null,0,{"$f":"E74*H74","v":0},0,null,0,{"$f":"J74*L74","v":0},0,{"$f":"+J74-N74","v":0},0,{"$f":"+J74*E$7","v":0}]
[]
[null,"Repairs & Maintenance"]
[null,null,"Pickup/General Use Equipment",1,null,"Acre",0,null,0,{"$f":"E77*H77","v":0},0,null,0,{"$f":"J77*L77","v":0},0,{"$f":"+J77-N77","v":0},0,{"$f":"+J77*E$7","v":0}]
[null,null,"Irrigation Equipment",1,null,"Acre",0,null,0,0,0,null,0,0,0,0,0,0]
[null,null,"Tractors/Self-Propelled",1,null,"Acre",8.7851213094412053,null,8.7851213094412053,0,0,null,0,0,8.7851213094412053,0,878.51213094412049,0]
[null,null,"Implements",1,null,"Acre",2.8569806404862446,null,2.8569806404862446,0,0,null,0,0,2.8569806404862446,0,285.69806404862447,0]
[null,null,null,null,null,null,null,null,0,0,0,null,0,0,0,0,0,0]
[null,null,null,null,null,null,null,null,0,0,0,null,0,0,0,0,0,0]
[null,"Interest on Credit Line",null,null,null,null,0.08,null,119.12580325344871,{"$f":"+SUM(J17:J82)/2*H83","v":0},null,null,0,{"$f":"+SUM(N17:N82)/2*L83","v":0},119.12580325344871,{"$f":"+SUM(P17:P82)/2*L83","v":0},11912.58032534487,{"$f":"+J83*E$7","v":0}]
["Total Variable Costs",null,null,null,null,null,null,null,2895.1709901250138,{"$f":"SUM(J18:J83)","v":0},null,null,0,{"$f":"SUM(N18:N83)","v":0},2895.1709901250138,{"$f":"SUM(P18:P83)","v":0},289517.0990125013,{"$f":"SUM(R18:R83)","v":0}]
["Planned Returns Above Variable Costs:",null,null,null,null,null,null,null,-210.92099012501376,{"$f":"+J13-J84","v":0},null,null,0,{"$f":"+N13-N84","v":0},-210.92099012501376,{"$f":"+P13-P84","v":0},-21092.099012501305,{"$f":"+R13-R84","v":0}]
[null,"Breakeven Price to Cover Variable Costs",null,null,null,null,321.68566556944597,{"$f":"IF(E10=0,\"n/a\",(YVarExp-(YTotExp+YTotRet-J10))/E10)","v":"n/a"},"Ton"]
[null,null,null,null,null,null,null,null,null,null,null,null,null,null,null,null,"Enterprise","Enterprise"]
["FIXED COSTS",null,null,"Quantity","Quantity","Units","$/Unit","$/Unit","Total","Total","Share","Share","Landlord","Landlord","Tenant","Tenant","Total","Total"]
[null,"Machinery Depreciation"]
[null,null,"Tractors/Self-Propelled",1,null,"Acre",9.0779586864225799,null,9.0779586864225799,{"$f":"E90*H90","v":0},0,null,0,{"$f":"J90*L90","v":0},9.0779586864225799,{"$f":"+J90-N90","v":0},907.79586864225803,{"$f":"+J90*E$7","v":0}]
[null,null,"Implements",1,null,"Acre",3.0475010297676128,null,3.0475010297676128,0,0,null,0,{"$f":"J91*L91","v":0},3.0475010297676128,0,304.7501029767613,0]
[null,"Equipment Investment"]
[null,null,"Tractors/Self-Propelled",70.720226541001708,null,"Dollars",0.08,null,5.6576181232801366,{"$f":"E93*H93","v":0},0,null,0,{"$f":"J93*L93","v":0},5.6576181232801366,{"$f":"+J93-N93","v":0},565.76181232801366,{"$f":"+J93*E$7","v":0}]
[null,null,"Implements",13.036532182894792,null,"Dollars",0.08,null,1.0429225746315833,0,0,null,0,{"$f":"J94*L94","v":0},1.0429225746315833,0,104.29225746315834,0]
[null,"Salaried Labor",null,1,null,"Acre",0,null,0,0,0,null,0,{"$f":"J95*L95","v":0},0,{"$f":"+J95-N95","v":0},0,{"$f":"+J95*E$7","v":0}]
[null,"Management Fee, Owner/Operator Labor",null,1,null,"Acre",0,null,0,0,0,null,0,0,0,0,0,0]
[null,"Allocated Establishment Cost",null,1,null,"Acre",142.47424883349353,null,142.47424883349353,0,0,null,0,0,142.47424883349353,0,14247.424883349353,0]
[null,"Land Cost, Orchard",null,1,null,"Acre",100,null,100,0,0,null,0,0,100,0,10000,0]
[null,"Property Taxes",null,1,null,"Acre",0,null,0,0,0,null,0,0,0,0,0,0]
[null,"Whole Farm Insurance",null,1,null,"Acre",0,null,0,0,0,null,0,0,0,0,0,0]
[null,null,null,1,null,null,0,null,0,0,0,null,0,0,0,0,0,0]
[null,null,null,1,null,null,0,null,0,{"$f":"E102*H102","v":0},0,null,0,0,0,0,0,0]
["Total Fixed Costs",null,null,null,null,null,null,null,261.30024924759545,{"$f":"+SUM(J90:J102)","v":0},null,null,0,{"$f":"+SUM(N90:N102)","v":0},261.30024924759545,{"$f":"+SUM(P90:P102)","v":0},26130.024924759542,{"$f":"+SUM(R90:R102)","v":0}]
["Total Specified Costs",null,null,null,null,null,null,null,3156.471239372609,{"$f":"+J84+J103","v":0},null,null,0,{"$f":"+N84+N103","v":0},3156.471239372609,{"$f":"+P84+P103","v":0},315647.12393726083,{"$f":"+R84+R103","v":0}]
[]
["Returns Above Specified Costs",null,null,null,null,null,null,null,-472.22123937260903,{"$f":"+J13-J104","v":0},null,null,0,{"$f":"+N13-N104","v":0},-472.22123937260903,{"$f":"+P13-P104","v":0},-47222.123937260825,{"$f":"+R13-R104","v":0}]
[]
["    Breakeven Price to Cover Total Costs",null,null,null,null,null,350.71902659695655,{"$f":"IF(E10=0,\"n/a\",(YTotExp-(YTotExp+YTotRet-J10))/E10)","v":"n/a"},"Ton"]
[]
[null,null,null,"Example Breakeven Prices"]
[null,"Example","Example","To Cover",null,null,"To Cover"]
[null,"Yield","Yield","Variable",null,null,"Total"]
[null,"Percent","Ton","Costs",null,null,"Costs"]
[null,0.75,6.75,428.9142207592613,null,null,467.62536879594205]
[null,0.9,8.1,357.42851729938445,null,null,389.68780732995174]
[null,1,9,321.68566556944597,null,null,350.71902659695655]
[null,1.1000000000000001,9.9,292.44151415404178,null,null,318.83547872450595]
[null,1.25,11.25,257.34853245555678,null,null,280.57522127756522]
[]
["  Developed by Samuel Zapata, Assistant Professor and Extension Economist, Texas A&M AgriLife Extension, 956-968-5581.  "]
[]
["Information presented is prepared solely as a general guide and not intended to recognize or predict the costs and returns from any one operation.  Brand names are mentioned only as examples and imply no endorsement."]

{"sheet":"GrapefruitYear6","index":7,"n_rows":122,"n_cols":18,"rows_kept":122,"cut":false,"hidden":false,"merged":[[109,3,109,8],[121,0,121,11],[0,0,0,11],[1,0,1,11],[2,0,2,11],[3,0,3,11]]}
["Projections for Planning Purposes Only -- Not to be Used without Updating"]
["2023 Estimated Costs and Returns per Acre"]
["Grapefruit, Year 6, Orchard Establishment, Flood Irrigated, Rio Grande Valley"]
["Enter your name for this budget in the cell above."]
["Enter  Your Values in the cells highlighed in MAROON."]
[null,null,null,null,"Your Acres",null,null,null,null,null,null,null,null,null,null,null,null,"Your"]
[null,null,"Crop Acres",100,null,null,null,null,null,null,null,"Your",null,null,null,null,"Enterprise","Enterprise"]
[null,null,null,null,"Your",null,null,"Your","Cash","Your","Landlord","Landlord",null,"Your",null,"Your","Total","Total"]
["REVENUE",null,null,"Quantity","Quantity","Units","$/Unit","$/Unit","Total","Total","Share","Share","Landlord","Landlord","Tenant","Tenant","(100 acres)",{"$f":"\"(\" & E7 & \" acres)\"","v":"( acres)"}]
[null,"Grapefruit (Rio Red)",null,14,null,"Ton",298.25,null,4175.5,{"$f":"E10*H10","v":0},0,null,0,{"$f":"J10*L10","v":0},4175.5,{"$f":"+J10-N10","v":0},417550,{"$f":"+J10*E$7","v":0}]
[null,null,null,0,null,null,0,null,0,0,0,null,0,0,0,{"$f":"+J11-N11","v":0},0,0]
[null,null,null,0,null,null,0,null,0,0,0,null,0,0,0,0,0,0]
["Total Revenue",null,null,null,null,null,null,null,4175.5,{"$f":"SUM(J10:J12)","v":0},null,null,0,{"$f":"SUM(N10:N12)","v":0},4175.5,{"$f":"SUM(P10:P12)","v":0},417550,{"$f":"SUM(R10:R12)","v":0}]
[null,null,null,null,null,null,null,null,null,null,null,null,null,null,null,null,"Enterprise","Enterprise"]
["VARIABLE COSTS",null,null,"Quantity","Quantity","Units","$/Unit","$/Unit","Total","Total","Share","Share","Landlord","Landlord","Tenant","Tenant","Total","Total"]
["Production Costs"]
[null,"Custom"]
[null,"","Foliar Application",7,null,"Acre",50,null,350,{"$f":"E18*H18","v":0},0,null,0,{"$f":"J18*L18","v":0},350,{"$f":"+J18-N18","v":0},35000,{"$f":"+J18*E$7","v":0}]
[null,"","Prune (Yr 3-6 Year)",1,null,"Acre",60,null,60,0,0,null,0,0,60,0,6000,0]
[null,"Fertilizer"]
[null,"","Urea (46%)",2.5,null,"CTW",44.75,null,111.875,0,0,null,0,0,111.875,0,11187.5,0]
[null,"","Foliar 3-18-18",1,null,"Gallon",34,null,34,0,0,null,0,0,34,0,3400,0]
[null,"","Foliar Zn",2,null,"Pound",3.4998,null,6.9996,0,0,null,0,0,6.9996,0,699.96,0]
[null,"","Foliar 18-8-5",2,null,"Gallon",15.5,null,31,0,0,null,0,0,31,0,3100,0]
[null,"","Foliar N",5,null,"Pound",0.61,null,3.05,0,0,null,0,0,3.05,0,305,0]
[null,"Herbicide"]
[null,"","Simazine 4L",1.25,null,"Gallon",38,null,47.5,0,0,null,0,0,47.5,0,4750,0]
[null,"","Krovar I 80 DF",3,null,"Pound",17.68,null,53.04,0,0,null,0,0,53.04,0,5304,0]
[null,"","Glyphosate",20,null,"Pint",6.25,null,125,0,0,null,0,0,125,0,12500,0]
[null,"Insecticide"]
[null,"","Movento",30,null,"Ounce",7.7886718750000004,null,233.66015625,0,0,null,0,0,233.66015625,0,23366.015625,0]
[null,"","Micromite",18.8,null,"Ounce",1.6328125,null,30.696875000000002,0,0,null,0,0,30.696875000000002,0,3069.6875,0]
[null,"","Vendex ",8,null,"Pound",60.69,null,485.52,0,0,null,0,0,485.52,0,48552,0]
[null,"","Agri-Mek SC",0.32,null,"Gallon",89.95,null,28.784000000000002,0,0,null,0,0,28.784000000000002,0,2878.4,0]
[null,"","Actara",11,null,"Ounce",4.3316666666666661,null,47.648333333333326,0,0,null,0,0,47.648333333333326,0,4764.833333333333,0]
[null,"","Sivanto",10,null,"Ounce",3.2808593749999999,null,32.80859375,0,0,null,0,0,32.80859375,0,3280.859375,0]
[null,"","Esteem",10,null,"Ounce",13,null,130,0,0,null,0,0,130,0,13000,0]
[null,"","Danitol",16,null,"Ounce",1.0078125,null,16.125,0,0,null,0,0,16.125,0,1612.5,0]
[null,"","Admire Pro",0.44,null,"Pint",26.279999999999998,null,11.563199999999998,0,0,null,0,0,11.563199999999998,0,1156.32,0]
[null,"Miscellaneous"]
[null,"","Citrus Assessment",1,null,"Acre",5,null,5,0,0,null,0,0,5,0,500,0]
[null,"","Insurance, Grapefruit",1,null,"Acre",128.66627033830355,null,128.66627033830355,0,0,null,0,0,128.66627033830355,0,12866.627033830355,0]
[null,"Seed"]
[null,"","Young Citrus Trees",3,null,"Tree",15,null,45,0,0,null,0,0,45,0,4500,0]
[null,"","Layout and Plant",3,null,"Tree",5,null,15,0,0,null,0,0,15,0,1500,0]
[null,"","Removal Citrus",3,null,"Tree",25,null,75,0,0,null,0,0,75,0,7500,0]
[null,"","Treatment Removed citrus",3,null,"Tree",5,null,15,0,0,null,0,0,15,0,1500,0]
[null,"","Tree Wrap/Unwrap",3,null,"Tree",2,null,6,0,0,null,0,0,6,0,600,0]
[null,"Other Labor"]
[null,"","Costum Soil Fert. Citrus",6,null,"Hour",15,null,90,0,0,null,0,0,90,0,9000,0]
[null,"","Unallocated Labor",1,null,"Hour",15,null,15,0,0,null,0,0,15,0,1500,0]
[null,"Other Chemicals"]
[null,"","Surfactant",7.9799999999999986,null,"Pint",7.4749999999999996,null,59.650499999999987,0,0,null,0,0,59.650499999999987,0,5965.0499999999984,0]
[null,"Fungicides"]
[null,"","Quadris Top",10,null,"Ounce",1.5621093749999999,null,15.62109375,0,0,null,0,0,15.62109375,0,1562.109375,0]
[null,"","GEM",3.8,null,"Ounce",8.1234374999999996,null,30.869062499999998,0,0,null,0,0,30.869062499999998,0,3086.90625,0]
[null,"","Headline",24,null,"Ounce",1.859375,null,44.625,0,0,null,0,0,44.625,0,4462.5,0]
[null,null,null,16,null,null,3.2912499999999998,null,52.66,0,0,null,0,0,52.66,0,5266,0]
[null,null,null,0,null,null,0,null,0,0,0,null,0,0,0,0,0,0]
[null,null,null,0,null,null,0,null,0,{"$f":"E60*H60","v":0},0,null,0,{"$f":"J60*L60","v":0},0,{"$f":"+J60-N60","v":0},0,{"$f":"+J60*E$7","v":0}]
[null,"Irrigation"]
[null,null,"Water Cost",4,null,"Acre/Foot",21,null,84,{"$f":"E62*H62","v":0},0,null,0,{"$f":"J62*L62","v":0},84,{"$f":"+J62-N62","v":0},8400,{"$f":"+J62*E$7","v":0}]
[null,null,"Irrigation Labor",14,null,"Hour",17.5,null,245,0,0,null,0,0,245,0,24500,0]
[null,"Machinery Labor"]
[null,null,"Tractors/Self-Propelled",0.8,null,"Hour",17.21,null,13.768000000000001,{"$f":"E65*H65","v":0},0,null,0,{"$f":"J65*L65","v":0},13.768000000000001,{"$f":"+J65-N65","v":0},1376.8000000000002,{"$f":"+J65*E$7","v":0}]
[null,null,"Other Labor",0.4,null,"Hour",17.21,null,6.8840000000000003,{"$f":"E66*H66","v":0},0,null,0,{"$f":"J66*L66","v":0},6.8840000000000003,{"$f":"+J66-N66","v":0},688.40000000000009,{"$f":"+J66*E$7","v":0}]
[]
[null,"Diesel Fuel"]
[null,null,"Pickup/General Use Equipment",1,null,"Acre",0,null,0,{"$f":"E69*H69","v":0},0,null,0,{"$f":"J69*L69","v":0},0,{"$f":"+J69-N69","v":0},0,{"$f":"+J69*E$7","v":0}]
[null,null,"Tractors/Self-Propelled",3.66,null,"Gallon",2.2400000000000002,null,8.1984000000000012,{"$f":"E70*H70","v":0},0,null,0,{"$f":"J70*L70","v":0},8.1984000000000012,{"$f":"+J70-N70","v":0},819.84000000000015,{"$f":"+J70*E$7","v":0}]
[]
[null,"Gasoline"]
[null,null,"Pickup/General Use Equipment",1,null,"Acre",0,null,0,{"$f":"E73*H73","v":0},0,null,0,{"$f":"J73*L73","v":0},0,{"$f":"+J73-N73","v":0},0,{"$f":"+J73*E$7","v":0}]
[null,null,"Tractors/Self-Propelled",0,null,"Gallon",2.09,null,0,{"$f":"E74*H74","v":0},0,null,0,{"$f":"J74*L74","v":0},0,{"$f":"+J74-N74","v":0},0,{"$f":"+J74*E$7","v":0}]
[]
[null,"Repairs & Maintenance"]
[null,null,"Pickup/General Use Equipment",1,null,"Acre",0,null,0,{"$f":"E77*H77","v":0},0,null,0,{"$f":"J77*L77","v":0},0,{"$f":"+J77-N77","v":0},0,{"$f":"+J77*E$7","v":0}]
[null,null,"Irrigation Equipment",1,null,"Acre",0,null,0,0,0,null,0,0,0,0,0,0]
[null,null,"Tractors/Self-Propelled",1,null,"Acre",8.7851213094412053,null,8.7851213094412053,0,0,null,0,0,8.7851213094412053,0,878.51213094412049,0]
[null,null,"Implements",1,null,"Acre",2.8569806404862446,null,2.8569806404862446,0,0,null,0,0,2.8569806404862446,0,285.69806404862447,0]
[null,null,null,null,null,null,null,null,0,0,0,null,0,0,0,0,0,0]
[null,null,null,null,null,null,null,null,0,0,0,null,0,0,0,0,0,0]
[null,"Interest on Credit Line",null,null,null,null,0.08,null,120.04419448632541,{"$f":"+SUM(J17:J82)/2*H83","v":0},null,null,0,{"$f":"+SUM(N17:N82)/2*L83","v":0},120.04419448632541,{"$f":"+SUM(P17:P82)/2*L83","v":0},12004.419448632541,{"$f":"+J83*E$7","v":0}]
["Total Variable Costs",null,null,null,null,null,null,null,2926.89938135789,{"$f":"SUM(J18:J83)","v":0},null,null,0,{"$f":"SUM(N18:N83)","v":0},2926.89938135789,{"$f":"SUM(P18:P83)","v":0},292689.93813578895,{"$f":"SUM(R18:R83)","v":0}]
["Planned Returns Above Variable Costs:",null,null,null,null,null,null,null,1248.60061864211,{"$f":"+J13-J84","v":0},null,null,0,{"$f":"+N13-N84","v":0},1248.60061864211,{"$f":"+P13-P84","v":0},124860.06186421105,{"$f":"+R13-R84","v":0}]
[null,"Breakeven Price to Cover Variable Costs",null,null,null,null,209.06424152556357,{"$f":"IF(E10=0,\"n/a\",(YVarExp-(YTotExp+YTotRet-J10))/E10)","v":"n/a"},"Ton"]
[null,null,null,null,null,null,null,null,null,null,null,null,null,null,null,null,"Enterprise","Enterprise"]
["FIXED COSTS",null,null,"Quantity","Quantity","Units","$/Unit","$/Unit","Total","Total","Share","Share","Landlord","Landlord","Tenant","Tenant","Total","Total"]
[null,"Machinery Depreciation"]
[null,null,"Tractors/Self-Propelled",1,null,"Acre",9.0779586864225799,null,9.0779586864225799,{"$f":"E90*H90","v":0},0,null,0,{"$f":"J90*L90","v":0},9.0779586864225799,{"$f":"+J90-N90","v":0},907.79586864225803,{"$f":"+J90*E$7","v":0}]
[null,null,"Implements",1,null,"Acre",3.0475010297676128,null,3.0475010297676128,0,0,null,0,{"$f":"J91*L91","v":0},3.0475010297676128,0,304.7501029767613,0]
[null,"Equipment Investment"]
[null,null,"Tractors/Self-Propelled",70.720226541001708,null,"Dollars",0.08,null,5.6576181232801366,{"$f":"E93*H93","v":0},0,null,0,{"$f":"J93*L93","v":0},5.6576181232801366,{"$f":"+J93-N93","v":0},565.76181232801366,{"$f":"+J93*E$7","v":0}]
[null,null,"Implements",13.036532182894792,null,"Dollars",0.08,null,1.0429225746315833,0,0,null,0,{"$f":"J94*L94","v":0},1.0429225746315833,0,104.29225746315834,0]
[null,"Salaried Labor",null,1,null,"Acre",0,null,0,0,0,null,0,{"$f":"J95*L95","v":0},0,{"$f":"+J95-N95","v":0},0,{"$f":"+J95*E$7","v":0}]
[null,"Management Fee, Owner/Operator Labor",null,1,null,"Acre",0,null,0,0,0,null,0,0,0,0,0,0]
[null,"Allocated Establishment Cost",null,1,null,"Acre",142.47424883349353,null,142.47424883349353,0,0,null,0,0,142.47424883349353,0,14247.424883349353,0]
[null,"Land Cost, Orchard",null,1,null,"Acre",100,null,100,0,0,null,0,0,100,0,10000,0]
[null,"Property Taxes",null,1,null,"Acre",0,null,0,0,0,null,0,0,0,0,0,0]
[null,"Whole Farm Insurance",null,1,null,"Acre",0,null,0,0,0,null,0,0,0,0,0,0]
[null,null,null,1,null,null,0,null,0,0,0,null,0,0,0,0,0,0]
[null,null,null,1,null,null,0,null,0,{"$f":"E102*H102","v":0},0,null,0,0,0,0,0,0]
["Total Fixed Costs",null,null,null,null,null,null,null,261.30024924759545,{"$f":"+SUM(J90:J102)","v":0},null,null,0,{"$f":"+SUM(N90:N102)","v":0},261.30024924759545,{"$f":"+SUM(P90:P102)","v":0},26130.024924759542,{"$f":"+SUM(R90:R102)","v":0}]
["Total Specified Costs",null,null,null,null,null,null,null,3188.1996306054853,{"$f":"+J84+J103","v":0},null,null,0,{"$f":"+N84+N103","v":0},3188.1996306054853,{"$f":"+P84+P103","v":0},318819.96306054847,{"$f":"+R84+R103","v":0}]
[]
["Returns Above Specified Costs",null,null,null,null,null,null,null,987.30036939451475,{"$f":"+J13-J104","v":0},null,null,0,{"$f":"+N13-N104","v":0},987.30036939451475,{"$f":"+P13-P104","v":0},98730.036939451529,{"$f":"+R13-R104","v":0}]
[]
["    Breakeven Price to Cover Total Costs",null,null,null,null,null,227.72854504324894,{"$f":"IF(E10=0,\"n/a\",(YTotExp-(YTotExp+YTotRet-J10))/E10)","v":"n/a"},"Ton"]
[]
[null,null,null,"Example Breakeven Prices"]
[null,"Example","Example","To Cover",null,null,"To Cover"]
[null,"Yield","Yield","Variable",null,null,"Total"]
[null,"Percent","Ton","Costs",null,null,"Costs"]
[null,0.75,10.5,278.75232203408478,null,null,303.63806005766526]
[null,0.9,12.6,232.29360169507063,null,null,253.03171671472106]
[null,1,14,209.06424152556357,null,null,227.72854504324894]
[null,1.1000000000000001,15.400000000000002,190.05840138687594,null,null,207.02595003931719]
[null,1.25,17.5,167.25139322045086,null,null,182.18283603459915]
[]
["  Developed by Samuel Zapata, Assistant Professor and Extension Economist, Texas A&M AgriLife Extension, 956-968-5581.  "]
[]
["Information presented is prepared solely as a general guide and not intended to recognize or predict the costs and returns from any one operation.  Brand names are mentioned only as examples and imply no endorsement."]

{"sheet":"GrapefruitYear7","index":8,"n_rows":122,"n_cols":18,"rows_kept":122,"cut":false,"hidden":false,"merged":[[109,3,109,8],[121,0,121,11],[0,0,0,11],[1,0,1,11],[2,0,2,11],[3,0,3,11]]}
["Projections for Planning Purposes Only -- Not to be Used without Updating"]
["2023 Estimated Costs and Returns per Acre"]
["Grapefruit, Year 7, Orchard Establishment, Flood Irrigated, Rio Grande Valley"]
["Enter your name for this budget in the cell above."]
["Enter  Your Values in the cells highlighed in MAROON."]
[null,null,null,null,"Your Acres",null,null,null,null,null,null,null,null,null,null,null,null,"Your"]
[null,null,"Crop Acres",100,null,null,null,null,null,null,null,"Your",null,null,null,null,"Enterprise","Enterprise"]
[null,null,null,null,"Your",null,null,"Your","Cash","Your","Landlord","Landlord",null,"Your",null,"Your","Total","Total"]
["REVENUE",null,null,"Quantity","Quantity","Units","$/Unit","$/Unit","Total","Total","Share","Share","Landlord","Landlord","Tenant","Tenant","(100 acres)",{"$f":"\"(\" & E7 & \" acres)\"","v":"( acres)"}]
[null,"Grapefruit (Rio Red)",null,18,null,"Ton",298.25,null,5368.5,{"$f":"E10*H10","v":0},0,null,0,{"$f":"J10*L10","v":0},5368.5,{"$f":"+J10-N10","v":0},536850,{"$f":"+J10*E$7","v":0}]
[null,null,null,0,null,null,0,null,0,0,0,null,0,0,0,{"$f":"+J11-N11","v":0},0,0]
[null,null,null,0,null,null,0,null,0,0,0,null,0,0,0,0,0,0]
["Total Revenue",null,null,null,null,null,null,null,5368.5,{"$f":"SUM(J10:J12)","v":0},null,null,0,{"$f":"SUM(N10:N12)","v":0},5368.5,{"$f":"SUM(P10:P12)","v":0},536850,{"$f":"SUM(R10:R12)","v":0}]
[null,null,null,null,null,null,null,null,null,null,null,null,null,null,null,null,"Enterprise","Enterprise"]
["VARIABLE COSTS",null,null,"Quantity","Quantity","Units","$/Unit","$/Unit","Total","Total","Share","Share","Landlord","Landlord","Tenant","Tenant","Total","Total"]
["Production Costs"]
[null,"Custom"]
[null,"","Foliar Application",7,null,"Acre",50,null,350,{"$f":"E18*H18","v":0},0,null,0,{"$f":"J18*L18","v":0},350,{"$f":"+J18-N18","v":0},35000,{"$f":"+J18*E$7","v":0}]
[null,"","Topping and Hedging",1,null,"Acre",120,null,120,0,0,null,0,0,120,0,12000,0]
[null,"Fertilizer"]
[null,"","Urea (46%)",2.5,null,"CTW",44.75,null,111.875,0,0,null,0,0,111.875,0,11187.5,0]
[null,"","Foliar 3-18-18",1,null,"Gallon",34,null,34,0,0,null,0,0,34,0,3400,0]
[null,"","Foliar Zn",2,null,"Pound",3.4998,null,6.9996,0,0,null,0,0,6.9996,0,699.96,0]
[null,"","Foliar 18-8-5",2,null,"Gallon",15.5,null,31,0,0,null,0,0,31,0,3100,0]
[null,"","Foliar N",5,null,"Pound",0.61,null,3.05,0,0,null,0,0,3.05,0,305,0]
[null,"Herbicide"]
[null,"","Simazine 4L",1.25,null,"Gallon",38,null,47.5,0,0,null,0,0,47.5,0,4750,0]
[null,"","Krovar I 80 DF",3,null,"Pound",17.68,null,53.04,0,0,null,0,0,53.04,0,5304,0]
[null,"","Glyphosate",20,null,"Pint",6.25,null,125,0,0,null,0,0,125,0,12500,0]
[null,"Insecticide"]
[null,"","Movento",30,null,"Ounce",7.7886718750000004,null,233.66015625,0,0,null,0,0,233.66015625,0,23366.015625,0]
[null,"","Micromite",18.8,null,"Ounce",1.6328125,null,30.696875000000002,0,0,null,0,0,30.696875000000002,0,3069.6875,0]
[null,"","Vendex ",8,null,"Pound",60.69,null,485.52,0,0,null,0,0,485.52,0,48552,0]
[null,"","Agri-Mek SC",0.32,null,"Gallon",89.95,null,28.784000000000002,0,0,null,0,0,28.784000000000002,0,2878.4,0]
[null,"","Actara",11,null,"Ounce",4.3316666666666661,null,47.648333333333326,0,0,null,0,0,47.648333333333326,0,4764.833333333333,0]
[null,"","Sivanto",10,null,"Ounce",3.2808593749999999,null,32.80859375,0,0,null,0,0,32.80859375,0,3280.859375,0]
[null,"","Esteem ",10,null,"Ounce",9.9190000000000005,null,99.19,0,0,null,0,0,99.19,0,9919,0]
[null,"","Danitol",16,null,"Ounce",1.0078125,null,16.125,0,0,null,0,0,16.125,0,1612.5,0]
[null,"","Admire Pro",0.44,null,"Pint",26.279999999999998,null,11.563199999999998,0,0,null,0,0,11.563199999999998,0,1156.32,0]
[null,"Miscellaneous"]
[null,"","Citrus Assessment",1,null,"Acre",5,null,5,0,0,null,0,0,5,0,500,0]
[null,"","Insurance, Grapefruit",1,null,"Acre",128.66627033830355,null,128.66627033830355,0,0,null,0,0,128.66627033830355,0,12866.627033830355,0]
[null,"Seed"]
[null,"","Young Citrus Trees",3,null,"Tree",15,null,45,0,0,null,0,0,45,0,4500,0]
[null,"","Layout and Plant",3,null,"Tree",5,null,15,0,0,null,0,0,15,0,1500,0]
[null,"","Removal Citrus",3,null,"Tree",25,null,75,0,0,null,0,0,75,0,7500,0]
[null,"","Treatment Removed citrus",3,null,"Tree",5,null,15,0,0,null,0,0,15,0,1500,0]
[null,"","Tree Wrap/Unwrap",3,null,"Tree",2,null,6,0,0,null,0,0,6,0,600,0]
[null,"Other Labor"]
[null,"","Costum Soil Fert. Citrus",6,null,"Hour",15,null,90,0,0,null,0,0,90,0,9000,0]
[null,"","Unallocated Labor",1,null,"Hour",15,null,15,0,0,null,0,0,15,0,1500,0]
[null,"Other Chemicals"]
[null,"","Surfactant",7.9799999999999986,null,"Pint",7.4749999999999996,null,59.650499999999987,0,0,null,0,0,59.650499999999987,0,5965.0499999999984,0]
[null,"Fungicides"]
[null,"","Quadris Top",10,null,"Ounce",1.5621093749999999,null,15.62109375,0,0,null,0,0,15.62109375,0,1562.109375,0]
[null,"","GEM",3.8,null,"Ounce",8.1234374999999996,null,30.869062499999998,0,0,null,0,0,30.869062499999998,0,3086.90625,0]
[null,"","Headline",24,null,"Ounce",1.859375,null,44.625,0,0,null,0,0,44.625,0,4462.5,0]
[null,null,null,16,null,null,3.2912499999999998,null,52.66,0,0,null,0,0,52.66,0,5266,0]
[null,null,null,0,null,null,0,null,0,0,0,null,0,0,0,0,0,0]
[null,null,null,0,null,null,0,null,0,{"$f":"E60*H60","v":0},0,null,0,{"$f":"J60*L60","v":0},0,{"$f":"+J60-N60","v":0},0,{"$f":"+J60*E$7","v":0}]
[null,"Irrigation"]
[null,null,"Water Cost",4,null,"Acre/Foot",21,null,84,{"$f":"E62*H62","v":0},0,null,0,{"$f":"J62*L62","v":0},84,{"$f":"+J62-N62","v":0},8400,{"$f":"+J62*E$7","v":0}]
[null,null,"Irrigation Labor",14,null,"Hour",17.5,null,245,0,0,null,0,0,245,0,24500,0]
[null,"Machinery Labor"]
[null,null,"Tractors/Self-Propelled",0.8,null,"Hour",17.21,null,13.768000000000001,{"$f":"E65*H65","v":0},0,null,0,{"$f":"J65*L65","v":0},13.768000000000001,{"$f":"+J65-N65","v":0},1376.8000000000002,{"$f":"+J65*E$7","v":0}]
[null,null,"Other Labor",0.4,null,"Hour",17.21,null,6.8840000000000003,{"$f":"E66*H66","v":0},0,null,0,{"$f":"J66*L66","v":0},6.8840000000000003,{"$f":"+J66-N66","v":0},688.40000000000009,{"$f":"+J66*E$7","v":0}]
[]
[null,"Diesel Fuel"]
[null,null,"Pickup/General Use Equipment",1,null,"Acre",0,null,0,{"$f":"E69*H69","v":0},0,null,0,{"$f":"J69*L69","v":0},0,{"$f":"+J69-N69","v":0},0,{"$f":"+J69*E$7","v":0}]
[null,null,"Tractors/Self-Propelled",3.66,null,"Gallon",2.2400000000000002,null,8.1984000000000012,{"$f":"E70*H70","v":0},0,null,0,{"$f":"J70*L70","v":0},8.1984000000000012,{"$f":"+J70-N70","v":0},819.84000000000015,{"$f":"+J70*E$7","v":0}]
[]
[null,"Gasoline"]
[null,null,"Pickup/General Use Equipment",1,null,"Acre",0,null,0,{"$f":"E73*H73","v":0},0,null,0,{"$f":"J73*L73","v":0},0,{"$f":"+J73-N73","v":0},0,{"$f":"+J73*E$7","v":0}]
[null,null,"Tractors/Self-Propelled",0,null,"Gallon",2.09,null,0,{"$f":"E74*H74","v":0},0,null,0,{"$f":"J74*L74","v":0},0,{"$f":"+J74-N74","v":0},0,{"$f":"+J74*E$7","v":0}]
[]
[null,"Repairs & Maintenance"]
[null,null,"Pickup/General Use Equipment",1,null,"Acre",0,null,0,{"$f":"E77*H77","v":0},0,null,0,{"$f":"J77*L77","v":0},0,{"$f":"+J77-N77","v":0},0,{"$f":"+J77*E$7","v":0}]
[null,null,"Irrigation Equipment",1,null,"Acre",0,null,0,0,0,null,0,0,0,0,0,0]
[null,null,"Tractors/Self-Propelled",1,null,"Acre",8.7851213094412053,null,8.7851213094412053,0,0,null,0,0,8.7851213094412053,0,878.51213094412049,0]
[null,null,"Implements",1,null,"Acre",2.8569806404862446,null,2.8569806404862446,0,0,null,0,0,2.8569806404862446,0,285.69806404862447,0]
[null,null,null,null,null,null,null,null,0,0,0,null,0,0,0,0,0,0]
[null,null,null,null,null,null,null,null,0,0,0,null,0,0,0,0,0,0]
[null,"Interest on Credit Line",null,null,null,null,0.08,null,124.14936489728433,{"$f":"+SUM(J17:J82)/2*H83","v":0},null,null,0,{"$f":"+SUM(N17:N82)/2*L83","v":0},124.14936489728433,{"$f":"+SUM(P17:P82)/2*L83","v":0},12414.936489728432,{"$f":"+J83*E$7","v":0}]
["Total Variable Costs",null,null,null,null,null,null,null,2960.1945517688491,{"$f":"SUM(J18:J83)","v":0},null,null,0,{"$f":"SUM(N18:N83)","v":0},2960.1945517688491,{"$f":"SUM(P18:P83)","v":0},296019.45517688489,{"$f":"SUM(R18:R83)","v":0}]
["Planned Returns Above Variable Costs:",null,null,null,null,null,null,null,2408.3054482311509,{"$f":"+J13-J84","v":0},null,null,0,{"$f":"+N13-N84","v":0},2408.3054482311509,{"$f":"+P13-P84","v":0},240830.54482311511,{"$f":"+R13-R84","v":0}]
[null,"Breakeven Price to Cover Variable Costs",null,null,null,null,164.45525287604718,{"$f":"IF(E10=0,\"n/a\",(YVarExp-(YTotExp+YTotRet-J10))/E10)","v":"n/a"},"Ton"]
[null,null,null,null,null,null,null,null,null,null,null,null,null,null,null,null,"Enterprise","Enterprise"]
["FIXED COSTS",null,null,"Quantity","Quantity","Units","$/Unit","$/Unit","Total","Total","Share","Share","Landlord","Landlord","Tenant","Tenant","Total","Total"]
[null,"Machinery Depreciation"]
[null,null,"Tractors/Self-Propelled",1,null,"Acre",9.0779586864225799,null,9.0779586864225799,{"$f":"E90*H90","v":0},0,null,0,{"$f":"J90*L90","v":0},9.0779586864225799,{"$f":"+J90-N90","v":0},907.79586864225803,{"$f":"+J90*E$7","v":0}]
[null,null,"Implements",1,null,"Acre",3.0475010297676128,null,3.0475010297676128,0,0,null,0,{"$f":"J91*L91","v":0},3.0475010297676128,0,304.7501029767613,0]
[null,"Equipment Investment"]
[null,null,"Tractors/Self-Propelled",70.720226541001708,null,"Dollars",0.08,null,5.6576181232801366,{"$f":"E93*H93","v":0},0,null,0,{"$f":"J93*L93","v":0},5.6576181232801366,{"$f":"+J93-N93","v":0},565.76181232801366,{"$f":"+J93*E$7","v":0}]
[null,null,"Implements",13.036532182894792,null,"Dollars",0.08,null,1.0429225746315833,0,0,null,0,{"$f":"J94*L94","v":0},1.0429225746315833,0,104.29225746315834,0]
[null,"Salaried Labor",null,1,null,"Acre",0,null,0,0,0,null,0,{"$f":"J95*L95","v":0},0,{"$f":"+J95-N95","v":0},0,{"$f":"+J95*E$7","v":0}]
[null,"Management Fee, Owner/Operator Labor",null,1,null,"Acre",0,null,0,0,0,null,0,0,0,0,0,0]
[null,"Allocated Establishment Cost",null,1,null,"Acre",142.47424883349353,null,142.47424883349353,0,0,null,0,0,142.47424883349353,0,14247.424883349353,0]
[null,"Land Cost, Orchard",null,1,null,"Acre",100,null,100,0,0,null,0,0,100,0,10000,0]
[null,"Property Taxes",null,1,null,"Acre",0,null,0,0,0,null,0,0,0,0,0,0]
[null,"Whole Farm Insurance",null,1,null,"Acre",0,null,0,0,0,null,0,0,0,0,0,0]
[null,null,null,1,null,null,0,null,0,0,0,null,0,0,0,0,0,0]
[null,null,null,1,null,null,0,null,0,{"$f":"E102*H102","v":0},0,null,0,0,0,0,0,0]
["Total Fixed Costs",null,null,null,null,null,null,null,261.30024924759545,{"$f":"+SUM(J90:J102)","v":0},null,null,0,{"$f":"+SUM(N90:N102)","v":0},261.30024924759545,{"$f":"+SUM(P90:P102)","v":0},26130.024924759542,{"$f":"+SUM(R90:R102)","v":0}]
["Total Specified Costs",null,null,null,null,null,null,null,3221.4948010164444,{"$f":"+J84+J103","v":0},null,null,0,{"$f":"+N84+N103","v":0},3221.4948010164444,{"$f":"+P84+P103","v":0},322149.48010164441,{"$f":"+R84+R103","v":0}]
[]
["Returns Above Specified Costs",null,null,null,null,null,null,null,2147.0051989835556,{"$f":"+J13-J104","v":0},null,null,0,{"$f":"+N13-N104","v":0},2147.0051989835556,{"$f":"+P13-P104","v":0},214700.51989835559,{"$f":"+R13-R104","v":0}]
[]
["    Breakeven Price to Cover Total Costs",null,null,null,null,null,178.97193338980247,{"$f":"IF(E10=0,\"n/a\",(YTotExp-(YTotExp+YTotRet-J10))/E10)","v":"n/a"},"Ton"]
[]
[null,null,null,"Example Breakeven Prices"]
[null,"Example","Example","To Cover",null,null,"To Cover"]
[null,"Yield","Yield","Variable",null,null,"Total"]
[null,"Percent","Ton","Costs",null,null,"Costs"]
[null,0.75,13.5,219.27367050139623,null,null,238.62924451973663]
[null,0.9,16.2,182.72805875116353,null,null,198.8577037664472]
[null,1,18,164.45525287604718,null,null,178.97193338980247]
[null,1.1000000000000001,19.8,149.50477534186106,null,null,162.70175762709314]
[null,1.25,22.5,131.56420230083774,null,null,143.17754671184198]
[]
["  Developed by Samuel Zapata, Assistant Professor and Extension Economist, Texas A&M AgriLife Extension, 956-968-5581.  "]
[]
["Information presented is prepared solely as a general guide and not intended to recognize or predict the costs and returns from any one operation.  Brand names are mentioned only as examples and imply no endorsement."]

{"sheet":"GrapefruitYear8","index":9,"n_rows":122,"n_cols":18,"rows_kept":122,"cut":false,"hidden":false,"merged":[[109,3,109,8],[121,0,121,11],[0,0,0,11],[1,0,1,11],[2,0,2,11],[3,0,3,11]]}
["Projections for Planning Purposes Only -- Not to be Used without Updating"]
["2023 Estimated Costs and Returns per Acre"]
["Grapefruit, Year 8, Orchard Establishment, Flood Irrigated, Rio Grande Valley"]
["Enter your name for this budget in the cell above."]
["Enter  Your Values in the cells highlighed in MAROON."]
[null,null,null,null,"Your Acres",null,null,null,null,null,null,null,null,null,null,null,null,"Your"]
[null,null,"Crop Acres",100,null,null,null,null,null,null,null,"Your",null,null,null,null,"Enterprise","Enterprise"]
[null,null,null,null,"Your",null,null,"Your","Cash","Your","Landlord","Landlord",null,"Your",null,"Your","Total","Total"]
["REVENUE",null,null,"Quantity","Quantity","Units","$/Unit","$/Unit","Total","Total","Share","Share","Landlord","Landlord","Tenant","Tenant","(100 acres)",{"$f":"\"(\" & E7 & \" acres)\"","v":"( acres)"}]
[null,"Grapefruit (Rio Red)",null,20,null,"Ton",298.25,null,5965,{"$f":"E10*H10","v":0},0,null,0,{"$f":"J10*L10","v":0},5965,{"$f":"+J10-N10","v":0},596500,{"$f":"+J10*E$7","v":0}]
[null,null,null,0,null,null,0,null,0,0,0,null,0,0,0,{"$f":"+J11-N11","v":0},0,0]
[null,null,null,0,null,null,0,null,0,0,0,null,0,0,0,0,0,0]
["Total Revenue",null,null,null,null,null,null,null,5965,{"$f":"SUM(J10:J12)","v":0},null,null,0,{"$f":"SUM(N10:N12)","v":0},5965,{"$f":"SUM(P10:P12)","v":0},596500,{"$f":"SUM(R10:R12)","v":0}]
[null,null,null,null,null,null,null,null,null,null,null,null,null,null,null,null,"Enterprise","Enterprise"]
["VARIABLE COSTS",null,null,"Quantity","Quantity","Units","$/Unit","$/Unit","Total","Total","Share","Share","Landlord","Landlord","Tenant","Tenant","Total","Total"]
["Production Costs"]
[null,"Custom"]
[null,"","Topping and Hedging",1,null,"Acre",120,null,120,{"$f":"E18*H18","v":0},0,null,0,{"$f":"J18*L18","v":0},120,{"$f":"+J18-N18","v":0},12000,{"$f":"+J18*E$7","v":0}]
[null,"","Foliar Application",7,null,"Acre",50,null,350,0,0,null,0,0,350,0,35000,0]
[null,"Fertilizer"]
[null,"","Urea (46%)",2.5,null,"CTW",44.75,null,111.875,0,0,null,0,0,111.875,0,11187.5,0]
[null,"","Foliar 3-18-18",1,null,"Gallon",34,null,34,0,0,null,0,0,34,0,3400,0]
[null,"","Foliar Zn",2,null,"Pound",3.4998,null,6.9996,0,0,null,0,0,6.9996,0,699.96,0]
[null,"","Foliar 18-8-5",2,null,"Gallon",15.5,null,31,0,0,null,0,0,31,0,3100,0]
[null,"","Foliar N",5,null,"Pound",0.61,null,3.05,0,0,null,0,0,3.05,0,305,0]
[null,"Herbicide"]
[null,"","Simazine 4L",1.25,null,"Gallon",38,null,47.5,0,0,null,0,0,47.5,0,4750,0]
[null,"","Krovar I 80 DF",3,null,"Pound",17.68,null,53.04,0,0,null,0,0,53.04,0,5304,0]
[null,"","Glyphosate",20,null,"Pint",6.25,null,125,0,0,null,0,0,125,0,12500,0]
[null,"Insecticide"]
[null,"","Movento",30,null,"Ounce",7.7886718750000004,null,233.66015625,0,0,null,0,0,233.66015625,0,23366.015625,0]
[null,"","Micromite",18.8,null,"Ounce",1.6328125,null,30.696875000000002,0,0,null,0,0,30.696875000000002,0,3069.6875,0]
[null,"","Vendex ",8,null,"Pound",60.69,null,485.52,0,0,null,0,0,485.52,0,48552,0]
[null,"","Agri-Mek SC",0.32,null,"Gallon",89.95,null,28.784000000000002,0,0,null,0,0,28.784000000000002,0,2878.4,0]
[null,"","Actara",11,null,"Ounce",4.3316666666666661,null,47.648333333333326,0,0,null,0,0,47.648333333333326,0,4764.833333333333,0]
[null,"","Sivanto",10,null,"Ounce",3.2808593749999999,null,32.80859375,0,0,null,0,0,32.80859375,0,3280.859375,0]
[null,"","Esteem ",10,null,"Ounce",9.9190000000000005,null,99.19,0,0,null,0,0,99.19,0,9919,0]
[null,"","Danitol",16,null,"Ounce",1.0078125,null,16.125,0,0,null,0,0,16.125,0,1612.5,0]
[null,"","Admire Pro",0.44,null,"Pint",26.279999999999998,null,11.563199999999998,0,0,null,0,0,11.563199999999998,0,1156.32,0]
[null,"Miscellaneous"]
[null,"","Citrus Assessment",1,null,"Acre",5,null,5,0,0,null,0,0,5,0,500,0]
[null,"","Insurance, Grapefruit",1,null,"Acre",128.66627033830355,null,128.66627033830355,0,0,null,0,0,128.66627033830355,0,12866.627033830355,0]
[null,"Seed"]
[null,"","Young Citrus Trees",3,null,"Tree",15,null,45,0,0,null,0,0,45,0,4500,0]
[null,"","Layout and Plant",3,null,"Tree",5,null,15,0,0,null,0,0,15,0,1500,0]
[null,"","Removal Citrus",3,null,"Tree",25,null,75,0,0,null,0,0,75,0,7500,0]
[null,"","Treatment Removed citrus",3,null,"Tree",5,null,15,0,0,null,0,0,15,0,1500,0]
[null,"","Tree Wrap/Unwrap",3,null,"Tree",2,null,6,0,0,null,0,0,6,0,600,0]
[null,"Other Chemicals"]
[null,"","Surfactant",7.9799999999999986,null,"Pint",7.4749999999999996,null,59.650499999999987,0,0,null,0,0,59.650499999999987,0,5965.0499999999984,0]
[null,"Other Labor"]
[null,"","Costum Soil Fert. Citrus",6,null,"Hour",15,null,90,0,0,null,0,0,90,0,9000,0]
[null,"","Unallocated Labor",1,null,"Hour",15,null,15,0,0,null,0,0,15,0,1500,0]
[null,"Fungicides"]
[null,"","Quadris Top",10,null,"Ounce",1.5621093749999999,null,15.62109375,0,0,null,0,0,15.62109375,0,1562.109375,0]
[null,"","GEM",3.8,null,"Ounce",8.1234374999999996,null,30.869062499999998,0,0,null,0,0,30.869062499999998,0,3086.90625,0]
[null,"","Headline",24,null,"Ounce",1.859375,null,44.625,0,0,null,0,0,44.625,0,4462.5,0]
[null,null,null,16,null,null,3.2912499999999998,null,52.66,0,0,null,0,0,52.66,0,5266,0]
[null,null,null,0,null,null,0,null,0,0,0,null,0,0,0,0,0,0]
[null,null,null,0,null,null,0,null,0,{"$f":"E60*H60","v":0},0,null,0,{"$f":"J60*L60","v":0},0,{"$f":"+J60-N60","v":0},0,{"$f":"+J60*E$7","v":0}]
[null,"Irrigation"]
[null,null,"Water Cost",4,null,"Acre/Foot",21,null,84,{"$f":"E62*H62","v":0},0,null,0,{"$f":"J62*L62","v":0},84,{"$f":"+J62-N62","v":0},8400,{"$f":"+J62*E$7","v":0}]
[null,null,"Irrigation Labor",14,null,"Hour",17.5,null,245,0,0,null,0,0,245,0,24500,0]
[null,"Machinery Labor"]
[null,null,"Tractors/Self-Propelled",0.8,null,"Hour",17.21,null,13.768000000000001,{"$f":"E65*H65","v":0},0,null,0,{"$f":"J65*L65","v":0},13.768000000000001,{"$f":"+J65-N65","v":0},1376.8000000000002,{"$f":"+J65*E$7","v":0}]
[null,null,"Other Labor",0.4,null,"Hour",17.21,null,6.8840000000000003,{"$f":"E66*H66","v":0},0,null,0,{"$f":"J66*L66","v":0},6.8840000000000003,{"$f":"+J66-N66","v":0},688.40000000000009,{"$f":"+J66*E$7","v":0}]
[]
[null,"Diesel Fuel"]
[null,null,"Pickup/General Use Equipment",1,null,"Acre",0,null,0,{"$f":"E69*H69","v":0},0,null,0,{"$f":"J69*L69","v":0},0,{"$f":"+J69-N69","v":0},0,{"$f":"+J69*E$7","v":0}]
[null,null,"Tractors/Self-Propelled",3.66,null,"Gallon",2.2400000000000002,null,8.1984000000000012,{"$f":"E70*H70","v":0},0,null,0,{"$f":"J70*L70","v":0},8.1984000000000012,{"$f":"+J70-N70","v":0},819.84000000000015,{"$f":"+J70*E$7","v":0}]
[]
[null,"Gasoline"]
[null,null,"Pickup/General Use Equipment",1,null,"Acre",0,null,0,{"$f":"E73*H73","v":0},0,null,0,{"$f":"J73*L73","v":0},0,{"$f":"+J73-N73","v":0},0,{"$f":"+J73*E$7","v":0}]
[null,null,"Tractors/Self-Propelled",0,null,"Gallon",2.09,null,0,{"$f":"E74*H74","v":0},0,null,0,{"$f":"J74*L74","v":0},0,{"$f":"+J74-N74","v":0},0,{"$f":"+J74*E$7","v":0}]
[]
[null,"Repairs & Maintenance"]
[null,null,"Pickup/General Use Equipment",1,null,"Acre",0,null,0,{"$f":"E77*H77","v":0},0,null,0,{"$f":"J77*L77","v":0},0,{"$f":"+J77-N77","v":0},0,{"$f":"+J77*E$7","v":0}]
[null,null,"Irrigation Equipment",1,null,"Acre",0,null,0,0,0,null,0,0,0,0,0,0]
[null,null,"Tractors/Self-Propelled",1,null,"Acre",8.7851213094412053,null,8.7851213094412053,0,0,null,0,0,8.7851213094412053,0,878.51213094412049,0]
[null,null,"Implements",1,null,"Acre",2.8569806404862446,null,2.8569806404862446,0,0,null,0,0,2.8569806404862446,0,285.69806404862447,0]
[null,null,null,null,null,null,null,null,0,0,0,null,0,0,0,0,0,0]
[null,null,null,null,null,null,null,null,0,0,0,null,0,0,0,0,0,0]
[null,"Interest on Credit Line",null,null,null,null,0.08,null,124.14936489728433,{"$f":"+SUM(J17:J82)/2*H83","v":0},null,null,0,{"$f":"+SUM(N17:N82)/2*L83","v":0},124.14936489728433,{"$f":"+SUM(P17:P82)/2*L83","v":0},12414.936489728432,{"$f":"+J83*E$7","v":0}]
["Total Variable Costs",null,null,null,null,null,null,null,2960.1945517688491,{"$f":"SUM(J18:J83)","v":0},null,null,0,{"$f":"SUM(N18:N83)","v":0},2960.1945517688491,{"$f":"SUM(P18:P83)","v":0},296019.45517688489,{"$f":"SUM(R18:R83)","v":0}]
["Planned Returns Above Variable Costs:",null,null,null,null,null,null,null,3004.8054482311509,{"$f":"+J13-J84","v":0},null,null,0,{"$f":"+N13-N84","v":0},3004.8054482311509,{"$f":"+P13-P84","v":0},300480.54482311511,{"$f":"+R13-R84","v":0}]
[null,"Breakeven Price to Cover Variable Costs",null,null,null,null,148.00972758844244,{"$f":"IF(E10=0,\"n/a\",(YVarExp-(YTotExp+YTotRet-J10))/E10)","v":"n/a"},"Ton"]
[null,null,null,null,null,null,null,null,null,null,null,null,null,null,null,null,"Enterprise","Enterprise"]
["FIXED COSTS",null,null,"Quantity","Quantity","Units","$/Unit","$/Unit","Total","Total","Share","Share","Landlord","Landlord","Tenant","Tenant","Total","Total"]
[null,"Machinery Depreciation"]
[null,null,"Tractors/Self-Propelled",1,null,"Acre",9.0779586864225799,null,9.0779586864225799,{"$f":"E90*H90","v":0},0,null,0,{"$f":"J90*L90","v":0},9.0779586864225799,{"$f":"+J90-N90","v":0},907.79586864225803,{"$f":"+J90*E$7","v":0}]
[null,null,"Implements",1,null,"Acre",3.0475010297676128,null,3.0475010297676128,0,0,null,0,{"$f":"J91*L91","v":0},3.0475010297676128,0,304.7501029767613,0]
[null,"Equipment Investment"]
[null,null,"Tractors/Self-Propelled",70.720226541001708,null,"Dollars",0.08,null,5.6576181232801366,{"$f":"E93*H93","v":0},0,null,0,{"$f":"J93*L93","v":0},5.6576181232801366,{"$f":"+J93-N93","v":0},565.76181232801366,{"$f":"+J93*E$7","v":0}]
[null,null,"Implements",13.036532182894792,null,"Dollars",0.08,null,1.0429225746315833,0,0,null,0,{"$f":"J94*L94","v":0},1.0429225746315833,0,104.29225746315834,0]
[null,"Salaried Labor",null,1,null,"Acre",0,null,0,0,0,null,0,{"$f":"J95*L95","v":0},0,{"$f":"+J95-N95","v":0},0,{"$f":"+J95*E$7","v":0}]
[null,"Management Fee, Owner/Operator Labor",null,1,null,"Acre",0,null,0,0,0,null,0,0,0,0,0,0]
[null,"Allocated Establishment Cost",null,1,null,"Acre",142.47424883349353,null,142.47424883349353,0,0,null,0,0,142.47424883349353,0,14247.424883349353,0]
[null,"Land Cost, Orchard",null,1,null,"Acre",100,null,100,0,0,null,0,0,100,0,10000,0]
[null,"Property Taxes",null,1,null,"Acre",0,null,0,0,0,null,0,0,0,0,0,0]
[null,"Whole Farm Insurance",null,1,null,"Acre",0,null,0,0,0,null,0,0,0,0,0,0]
[null,null,null,1,null,null,0,null,0,0,0,null,0,0,0,0,0,0]
[null,null,null,1,null,null,0,null,0,{"$f":"E102*H102","v":0},0,null,0,0,0,0,0,0]
["Total Fixed Costs",null,null,null,null,null,null,null,261.30024924759545,{"$f":"+SUM(J90:J102)","v":0},null,null,0,{"$f":"+SUM(N90:N102)","v":0},261.30024924759545,{"$f":"+SUM(P90:P102)","v":0},26130.024924759542,{"$f":"+SUM(R90:R102)","v":0}]
["Total Specified Costs",null,null,null,null,null,null,null,3221.4948010164444,{"$f":"+J84+J103","v":0},null,null,0,{"$f":"+N84+N103","v":0},3221.4948010164444,{"$f":"+P84+P103","v":0},322149.48010164441,{"$f":"+R84+R103","v":0}]
[]
["Returns Above Specified Costs",null,null,null,null,null,null,null,2743.5051989835556,{"$f":"+J13-J104","v":0},null,null,0,{"$f":"+N13-N104","v":0},2743.5051989835556,{"$f":"+P13-P104","v":0},274350.51989835559,{"$f":"+R13-R104","v":0}]
[]
["    Breakeven Price to Cover Total Costs",null,null,null,null,null,161.07474005082221,{"$f":"IF(E10=0,\"n/a\",(YTotExp-(YTotExp+YTotRet-J10))/E10)","v":"n/a"},"Ton"]
[]
[null,null,null,"Example Breakeven Prices"]
[null,"Example","Example","To Cover",null,null,"To Cover"]
[null,"Yield","Yield","Variable",null,null,"Total"]
[null,"Percent","Ton","Costs",null,null,"Costs"]
[null,0.75,15,197.3463034512566,null,null,214.76632006776296]
[null,0.9,18,164.45525287604718,null,null,178.97193338980247]
[null,1,20,148.00972758844244,null,null,161.07474005082221]
[null,1.1000000000000001,22,134.55429780767497,null,null,146.43158186438384]
[null,1.25,25,118.40778207075397,null,null,128.85979204065777]
[]
["  Developed by Samuel Zapata, Assistant Professor and Extension Economist, Texas A&M AgriLife Extension, 956-968-5581.  "]
[]
["Information presented is prepared solely as a general guide and not intended to recognize or predict the costs and returns from any one operation.  Brand names are mentioned only as examples and imply no endorsement."]

{"sheet":"OrangesNavel","index":10,"n_rows":122,"n_cols":18,"rows_kept":122,"cut":false,"hidden":false,"merged":[[109,3,109,8],[121,0,121,11],[0,0,0,11],[1,0,1,11],[2,0,2,11],[3,0,3,11]]}
["Projections for Planning Purposes Only -- Not to be Used without Updating"]
["2023 Estimated Costs and Returns per Acre"]
["Oranges, Early Orange, Mature Orchard, Flood Irrigated, Rio Grande Valley"]
["Enter your name for this budget in the cell above."]
["Enter  Your Values in the cells highlighed in MAROON."]
[null,null,null,null,"Your Acres",null,null,null,null,null,null,null,null,null,null,null,null,"Your"]
[null,null,"Crop Acres",100,null,null,null,null,null,null,null,"Your",null,null,null,null,"Enterprise","Enterprise"]
[null,null,null,null,"Your",null,null,"Your","Cash","Your","Landlord","Landlord",null,"Your",null,"Your","Total","Total"]
["REVENUE",null,null,"Quantity","Quantity","Units","$/Unit","$/Unit","Total","Total","Share","Share","Landlord","Landlord","Tenant","Tenant","(100 acres)",{"$f":"\"(\" & E7 & \" acres)\"","v":"( acres)"}]
[null,"Early Oranges",null,18,null,"Ton",306.21176470588233,null,5511.8117647058816,{"$f":"E10*H10","v":0},0,null,0,{"$f":"J10*L10","v":0},5511.8117647058816,{"$f":"+J10-N10","v":0},551181.17647058819,{"$f":"+J10*E$7","v":0}]
[null,null,null,0,null,null,0,null,0,0,0,null,0,0,0,{"$f":"+J11-N11","v":0},0,0]
[null,null,null,0,null,null,0,null,0,0,0,null,0,0,0,0,0,0]
["Total Revenue",null,null,null,null,null,null,null,5511.8117647058816,{"$f":"SUM(J10:J12)","v":0},null,null,0,{"$f":"SUM(N10:N12)","v":0},5511.8117647058816,{"$f":"SUM(P10:P12)","v":0},551181.17647058819,{"$f":"SUM(R10:R12)","v":0}]
[null,null,null,null,null,null,null,null,null,null,null,null,null,null,null,null,"Enterprise","Enterprise"]
["VARIABLE COSTS",null,null,"Quantity","Quantity","Units","$/Unit","$/Unit","Total","Total","Share","Share","Landlord","Landlord","Tenant","Tenant","Total","Total"]
["Production Costs"]
[null,"Custom"]
[null,"","Foliar Application",7,null,"Acre",50,null,350,{"$f":"E18*H18","v":0},0,null,0,{"$f":"J18*L18","v":0},350,{"$f":"+J18-N18","v":0},35000,{"$f":"+J18*E$7","v":0}]
[null,"","Topping and Hedging",1,null,"Acre",120,null,120,0,0,null,0,0,120,0,12000,0]
[null,"Fertilizer"]
[null,"","Urea (46%)",2.5,null,"CTW",44.75,null,111.875,0,0,null,0,0,111.875,0,11187.5,0]
[null,"","Foliar 3-18-18",1,null,"Gallon",34,null,34,0,0,null,0,0,34,0,3400,0]
[null,"","Foliar Zn",2,null,"Pound",3.4998,null,6.9996,0,0,null,0,0,6.9996,0,699.96,0]
[null,"","Foliar 18-8-5",2,null,"Gallon",15.5,null,31,0,0,null,0,0,31,0,3100,0]
[null,"","Foliar N",5,null,"Pound",0.61,null,3.05,0,0,null,0,0,3.05,0,305,0]
[null,"Herbicide"]
[null,"","Simazine 4L",1.25,null,"Gallon",38,null,47.5,0,0,null,0,0,47.5,0,4750,0]
[null,"","Krovar I 80 DF",3,null,"Pound",17.68,null,53.04,0,0,null,0,0,53.04,0,5304,0]
[null,"","Glyphosate",20,null,"Pint",6.25,null,125,0,0,null,0,0,125,0,12500,0]
[null,"Insecticide"]
[null,"","Movento",30,null,"Ounce",7.7886718750000004,null,233.66015625,0,0,null,0,0,233.66015625,0,23366.015625,0]
[null,"","Micromite",18.8,null,"Ounce",1.6328125,null,30.696875000000002,0,0,null,0,0,30.696875000000002,0,3069.6875,0]
[null,"","Vendex ",8,null,"Pound",60.69,null,485.52,0,0,null,0,0,485.52,0,48552,0]
[null,"","Agri-Mek SC",0.32,null,"Gallon",89.95,null,28.784000000000002,0,0,null,0,0,28.784000000000002,0,2878.4,0]
[null,"","Actara",11,null,"Ounce",4.3316666666666661,null,47.648333333333326,0,0,null,0,0,47.648333333333326,0,4764.833333333333,0]
[null,"","Sivanto",10,null,"Ounce",3.2808593749999999,null,32.80859375,0,0,null,0,0,32.80859375,0,3280.859375,0]
[null,"","Esteem",10,null,"Ounce",13,null,130,0,0,null,0,0,130,0,13000,0]
[null,"","Danitol",16,null,"Ounce",1.0078125,null,16.125,0,0,null,0,0,16.125,0,1612.5,0]
[null,"","Admire Pro",0.44,null,"Pint",26.279999999999998,null,11.563199999999998,0,0,null,0,0,11.563199999999998,0,1156.32,0]
[null,"Miscellaneous"]
[null,"","Citrus Assessment",1,null,"Acre",5,null,5,0,0,null,0,0,5,0,500,0]
[null,"","Insurance, Oranges",1,null,"Acre",121.2752024712758,null,121.2752024712758,0,0,null,0,0,121.2752024712758,0,12127.520247127581,0]
[null,"Seed"]
[null,"","Young Citrus Trees",4,null,"Tree",15,null,60,0,0,null,0,0,60,0,6000,0]
[null,"","Layout and Plant",4,null,"Tree",5,null,20,0,0,null,0,0,20,0,2000,0]
[null,"","Removal Citrus",4,null,"Tree",25,null,100,0,0,null,0,0,100,0,10000,0]
[null,"","Treatment Removed citrus",4,null,"Tree",5,null,20,0,0,null,0,0,20,0,2000,0]
[null,"","Tree Wrap/Unwrap",4,null,"Tree",2,null,8,0,0,null,0,0,8,0,800,0]
[null,"Other Chemicals"]
[null,"","Surfactant",7.9799999999999986,null,"Pint",7.4749999999999996,null,59.650499999999987,0,0,null,0,0,59.650499999999987,0,5965.0499999999984,0]
[null,"Other Labor"]
[null,"","Costum Soil Fert. Citrus",6,null,"Hour",15,null,90,0,0,null,0,0,90,0,9000,0]
[null,"","Unallocated Labor",1,null,"Hour",15,null,15,0,0,null,0,0,15,0,1500,0]
[null,"Fungicides"]
[null,"","Quadris Top",10,null,"Ounce",1.5621093749999999,null,15.62109375,0,0,null,0,0,15.62109375,0,1562.109375,0]
[null,"","GEM",3.8,null,"Ounce",8.1234374999999996,null,30.869062499999998,0,0,null,0,0,30.869062499999998,0,3086.90625,0]
[null,"","Headline",24,null,"Ounce",1.859375,null,44.625,0,0,null,0,0,44.625,0,4462.5,0]
[null,null,null,16,null,null,3.2912499999999998,null,52.66,0,0,null,0,0,52.66,0,5266,0]
[null,null,null,0,null,null,0,null,0,0,0,null,0,0,0,0,0,0]
[null,null,null,0,null,null,0,null,0,{"$f":"E60*H60","v":0},0,null,0,{"$f":"J60*L60","v":0},0,{"$f":"+J60-N60","v":0},0,{"$f":"+J60*E$7","v":0}]
[null,"Irrigation"]
[null,null,"Water Cost",4,null,"Acre/Foot",21,null,84,{"$f":"E62*H62","v":0},0,null,0,{"$f":"J62*L62","v":0},84,{"$f":"+J62-N62","v":0},8400,{"$f":"+J62*E$7","v":0}]
[null,null,"Irrigation Labor",14,null,"Hour",17.5,null,245,0,0,null,0,0,245,0,24500,0]
[null,"Machinery Labor"]
[null,null,"Tractors/Self-Propelled",0.8,null,"Hour",17.21,null,13.768000000000001,{"$f":"E65*H65","v":0},0,null,0,{"$f":"J65*L65","v":0},13.768000000000001,{"$f":"+J65-N65","v":0},1376.8000000000002,{"$f":"+J65*E$7","v":0}]
[null,null,"Other Labor",0.4,null,"Hour",17.21,null,6.8840000000000003,{"$f":"E66*H66","v":0},0,null,0,{"$f":"J66*L66","v":0},6.8840000000000003,{"$f":"+J66-N66","v":0},688.40000000000009,{"$f":"+J66*E$7","v":0}]
[]
[null,"Diesel Fuel"]
[null,null,"Pickup/General Use Equipment",1,null,"Acre",0,null,0,{"$f":"E69*H69","v":0},0,null,0,{"$f":"J69*L69","v":0},0,{"$f":"+J69-N69","v":0},0,{"$f":"+J69*E$7","v":0}]
[null,null,"Tractors/Self-Propelled",3.66,null,"Gallon",2.2400000000000002,null,8.1984000000000012,{"$f":"E70*H70","v":0},0,null,0,{"$f":"J70*L70","v":0},8.1984000000000012,{"$f":"+J70-N70","v":0},819.84000000000015,{"$f":"+J70*E$7","v":0}]
[]
[null,"Gasoline"]
[null,null,"Pickup/General Use Equipment",1,null,"Acre",0,null,0,{"$f":"E73*H73","v":0},0,null,0,{"$f":"J73*L73","v":0},0,{"$f":"+J73-N73","v":0},0,{"$f":"+J73*E$7","v":0}]
[null,null,"Tractors/Self-Propelled",0,null,"Gallon",2.09,null,0,{"$f":"E74*H74","v":0},0,null,0,{"$f":"J74*L74","v":0},0,{"$f":"+J74-N74","v":0},0,{"$f":"+J74*E$7","v":0}]
[]
[null,"Repairs & Maintenance"]
[null,null,"Pickup/General Use Equipment",1,null,"Acre",0,null,0,{"$f":"E77*H77","v":0},0,null,0,{"$f":"J77*L77","v":0},0,{"$f":"+J77-N77","v":0},0,{"$f":"+J77*E$7","v":0}]
[null,null,"Irrigation Equipment",1,null,"Acre",0,null,0,0,0,null,0,0,0,0,0,0]
[null,null,"Tractors/Self-Propelled",1,null,"Acre",8.7851213094412053,null,8.7851213094412053,0,0,null,0,0,8.7851213094412053,0,878.51213094412049,0]
[null,null,"Implements",1,null,"Acre",2.8569806404862446,null,2.8569806404862446,0,0,null,0,0,2.8569806404862446,0,285.69806404862447,0]
[null,null,null,null,null,null,null,null,0,0,0,null,0,0,0,0,0,0]
[null,null,null,null,null,null,null,null,0,0,0,null,0,0,0,0,0,0]
[null,"Interest on Credit Line",null,null,null,null,0.08,null,128.39464517930202,{"$f":"+SUM(J17:J82)/2*H83","v":0},null,null,0,{"$f":"+SUM(N17:N82)/2*L83","v":0},128.39464517930202,{"$f":"+SUM(P17:P82)/2*L83","v":0},12839.464517930202,{"$f":"+J83*E$7","v":0}]
["Total Variable Costs",null,null,null,null,null,null,null,3039.8587641838394,{"$f":"SUM(J18:J83)","v":0},null,null,0,{"$f":"SUM(N18:N83)","v":0},3039.8587641838394,{"$f":"SUM(P18:P83)","v":0},303985.87641838379,{"$f":"SUM(R18:R83)","v":0}]
["Planned Returns Above Variable Costs:",null,null,null,null,null,null,null,2471.9530005220422,{"$f":"+J13-J84","v":0},null,null,0,{"$f":"+N13-N84","v":0},2471.9530005220422,{"$f":"+P13-P84","v":0},247195.3000522044,{"$f":"+R13-R84","v":0}]
[null,"Breakeven Price to Cover Variable Costs",null,null,null,null,168.88104245465775,{"$f":"IF(E10=0,\"n/a\",(YVarExp-(YTotExp+YTotRet-J10))/E10)","v":"n/a"},"Ton"]
[null,null,null,null,null,null,null,null,null,null,null,null,null,null,null,null,"Enterprise","Enterprise"]
["FIXED COSTS",null,null,"Quantity","Quantity","Units","$/Unit","$/Unit","Total","Total","Share","Share","Landlord","Landlord","Tenant","Tenant","Total","Total"]
[null,"Machinery Depreciation"]
[null,null,"Tractors/Self-Propelled",1,null,"Acre",9.0779586864225799,null,9.0779586864225799,{"$f":"E90*H90","v":0},0,null,0,{"$f":"J90*L90","v":0},9.0779586864225799,{"$f":"+J90-N90","v":0},907.79586864225803,{"$f":"+J90*E$7","v":0}]
[null,null,"Implements",1,null,"Acre",3.0475010297676128,null,3.0475010297676128,0,0,null,0,{"$f":"J91*L91","v":0},3.0475010297676128,0,304.7501029767613,0]
[null,"Equipment Investment"]
[null,null,"Tractors/Self-Propelled",70.720226541001708,null,"Dollars",0.08,null,5.6576181232801366,{"$f":"E93*H93","v":0},0,null,0,{"$f":"J93*L93","v":0},5.6576181232801366,{"$f":"+J93-N93","v":0},565.76181232801366,{"$f":"+J93*E$7","v":0}]
[null,null,"Implements",13.036532182894792,null,"Dollars",0.08,null,1.0429225746315833,0,0,null,0,{"$f":"J94*L94","v":0},1.0429225746315833,0,104.29225746315834,0]
[null,"Salaried Labor",null,1,null,"Acre",0,null,0,0,0,null,0,{"$f":"J95*L95","v":0},0,{"$f":"+J95-N95","v":0},0,{"$f":"+J95*E$7","v":0}]
[null,"Management Fee, Owner/Operator Labor",null,1,null,"Acre",0,null,0,0,0,null,0,0,0,0,0,0]
[null,"Allocated Establishment Cost",null,1,null,"Acre",142.47424883349353,null,142.47424883349353,0,0,null,0,0,142.47424883349353,0,14247.424883349353,0]
[null,"Land Cost, Orchard",null,1,null,"Acre",100,null,100,0,0,null,0,0,100,0,10000,0]
[null,"Property Taxes",null,1,null,"Acre",0,null,0,0,0,null,0,0,0,0,0,0]
[null,"Whole Farm Insurance",null,1,null,"Acre",0,null,0,0,0,null,0,0,0,0,0,0]
[null,null,null,1,null,null,0,null,0,0,0,null,0,0,0,0,0,0]
[null,null,null,1,null,null,0,null,0,{"$f":"E102*H102","v":0},0,null,0,0,0,0,0,0]
["Total Fixed Costs",null,null,null,null,null,null,null,261.30024924759545,{"$f":"+SUM(J90:J102)","v":0},null,null,0,{"$f":"+SUM(N90:N102)","v":0},261.30024924759545,{"$f":"+SUM(P90:P102)","v":0},26130.024924759542,{"$f":"+SUM(R90:R102)","v":0}]
["Total Specified Costs",null,null,null,null,null,null,null,3301.1590134314347,{"$f":"+J84+J103","v":0},null,null,0,{"$f":"+N84+N103","v":0},3301.1590134314347,{"$f":"+P84+P103","v":0},330115.90134314331,{"$f":"+R84+R103","v":0}]
[]
["Returns Above Specified Costs",null,null,null,null,null,null,null,2210.6527512744469,{"$f":"+J13-J104","v":0},null,null,0,{"$f":"+N13-N104","v":0},2210.6527512744469,{"$f":"+P13-P104","v":0},221065.27512744488,{"$f":"+R13-R104","v":0}]
[]
["    Breakeven Price to Cover Total Costs",null,null,null,null,null,183.39772296841304,{"$f":"IF(E10=0,\"n/a\",(YTotExp-(YTotExp+YTotRet-J10))/E10)","v":"n/a"},"Ton"]
[]
[null,null,null,"Example Breakeven Prices"]
[null,"Example","Example","To Cover",null,null,"To Cover"]
[null,"Yield","Yield","Variable",null,null,"Total"]
[null,"Percent","Ton","Costs",null,null,"Costs"]
[null,0.75,13.5,225.174723272877,null,null,244.53029729121738]
[null,0.9,16.2,187.64560272739752,null,null,203.77524774268116]
[null,1,18,168.88104245465775,null,null,183.39772296841304]
[null,1.1000000000000001,19.8,153.52822041332522,null,null,166.7252026985573]
[null,1.25,22.5,135.10483396372621,null,null,146.71817837473043]
[]
["  Developed by Samuel Zapata, Assistant Professor and Extension Economist, Texas A&M AgriLife Extension, 956-968-5581.  "]
[]
["Information presented is prepared solely as a general guide and not intended to recognize or predict the costs and returns from any one operation.  Brand names are mentioned only as examples and imply no endorsement."]

{"sheet":"OrangesValencias","index":11,"n_rows":122,"n_cols":18,"rows_kept":122,"cut":false,"hidden":false,"merged":[[109,3,109,8],[121,0,121,11],[0,0,0,11],[1,0,1,11],[2,0,2,11],[3,0,3,11]]}
["Projections for Planning Purposes Only -- Not to be Used without Updating"]
["2023 Estimated Costs and Returns per Acre"]
["Oranges, Valencias, Mature Orchard, Flood Irrigated, Rio Grande Valley"]
["Enter your name for this budget in the cell above."]
["Enter  Your Values in the cells highlighed in MAROON."]
[null,null,null,null,"Your Acres",null,null,null,null,null,null,null,null,null,null,null,null,"Your"]
[null,null,"Crop Acres",100,null,null,null,null,null,null,null,"Your",null,null,null,null,"Enterprise","Enterprise"]
[null,null,null,null,"Your",null,null,"Your","Cash","Your","Landlord","Landlord",null,"Your",null,"Your","Total","Total"]
["REVENUE",null,null,"Quantity","Quantity","Units","$/Unit","$/Unit","Total","Total","Share","Share","Landlord","Landlord","Tenant","Tenant","(100 acres)",{"$f":"\"(\" & E7 & \" acres)\"","v":"( acres)"}]
[null,"Oranges (Valencias) ",null,18,null,"Ton",483.52941176470586,null,8703.5294117647063,{"$f":"E10*H10","v":0},0,null,0,{"$f":"J10*L10","v":0},8703.5294117647063,{"$f":"+J10-N10","v":0},870352.9411764706,{"$f":"+J10*E$7","v":0}]
[null,null,null,0,null,null,0,null,0,0,0,null,0,0,0,{"$f":"+J11-N11","v":0},0,0]
[null,null,null,0,null,null,0,null,0,0,0,null,0,0,0,0,0,0]
["Total Revenue",null,null,null,null,null,null,null,8703.5294117647063,{"$f":"SUM(J10:J12)","v":0},null,null,0,{"$f":"SUM(N10:N12)","v":0},8703.5294117647063,{"$f":"SUM(P10:P12)","v":0},870352.9411764706,{"$f":"SUM(R10:R12)","v":0}]
[null,null,null,null,null,null,null,null,null,null,null,null,null,null,null,null,"Enterprise","Enterprise"]
["VARIABLE COSTS",null,null,"Quantity","Quantity","Units","$/Unit","$/Unit","Total","Total","Share","Share","Landlord","Landlord","Tenant","Tenant","Total","Total"]
["Production Costs"]
[null,"Custom"]
[null,"","Foliar Application",7,null,"Acre",50,null,350,{"$f":"E18*H18","v":0},0,null,0,{"$f":"J18*L18","v":0},350,{"$f":"+J18-N18","v":0},35000,{"$f":"+J18*E$7","v":0}]
[null,"","Topping and Hedging",1,null,"Acre",120,null,120,0,0,null,0,0,120,0,12000,0]
[null,"Fertilizer"]
[null,"","Urea (46%)",2.5,null,"CTW",44.75,null,111.875,0,0,null,0,0,111.875,0,11187.5,0]
[null,"","Foliar 3-18-18",1,null,"Gallon",34,null,34,0,0,null,0,0,34,0,3400,0]
[null,"","Foliar Zn",2,null,"Pound",3.4998,null,6.9996,0,0,null,0,0,6.9996,0,699.96,0]
[null,"","Foliar 18-8-5",2,null,"Gallon",15.5,null,31,0,0,null,0,0,31,0,3100,0]
[null,"","Foliar N",5,null,"Pound",0.61,null,3.05,0,0,null,0,0,3.05,0,305,0]
[null,"Herbicide"]
[null,"","Simazine 4L",1.25,null,"Gallon",38,null,47.5,0,0,null,0,0,47.5,0,4750,0]
[null,"","Krovar I 80 DF",3,null,"Pound",17.68,null,53.04,0,0,null,0,0,53.04,0,5304,0]
[null,"","Glyphosate",20,null,"Pint",6.25,null,125,0,0,null,0,0,125,0,12500,0]
[null,"Insecticide"]
[null,"","Movento",30,null,"Ounce",7.7886718750000004,null,233.66015625,0,0,null,0,0,233.66015625,0,23366.015625,0]
[null,"","Micromite",18.8,null,"Ounce",1.6328125,null,30.696875000000002,0,0,null,0,0,30.696875000000002,0,3069.6875,0]
[null,"","Vendex ",8,null,"Pound",60.69,null,485.52,0,0,null,0,0,485.52,0,48552,0]
[null,"","Agri-Mek SC",0.32,null,"Gallon",89.95,null,28.784000000000002,0,0,null,0,0,28.784000000000002,0,2878.4,0]
[null,"","Actara",11,null,"Ounce",4.3316666666666661,null,47.648333333333326,0,0,null,0,0,47.648333333333326,0,4764.833333333333,0]
[null,"","Sivanto",10,null,"Ounce",3.2808593749999999,null,32.80859375,0,0,null,0,0,32.80859375,0,3280.859375,0]
[null,"","Esteem",10,null,"Ounce",13,null,130,0,0,null,0,0,130,0,13000,0]
[null,"","Danitol",16,null,"Ounce",1.0078125,null,16.125,0,0,null,0,0,16.125,0,1612.5,0]
[null,"","Admire Pro",0.44,null,"Pint",26.279999999999998,null,11.563199999999998,0,0,null,0,0,11.563199999999998,0,1156.32,0]
[null,"Miscellaneous"]
[null,"","Citrus Assessment",1,null,"Acre",5,null,5,0,0,null,0,0,5,0,500,0]
[null,"","Insurance, Oranges",1,null,"Acre",121.2752024712758,null,121.2752024712758,0,0,null,0,0,121.2752024712758,0,12127.520247127581,0]
[null,"Seed"]
[null,"","Young Citrus Trees",4,null,"Tree",15,null,60,0,0,null,0,0,60,0,6000,0]
[null,"","Layout and Plant",4,null,"Tree",5,null,20,0,0,null,0,0,20,0,2000,0]
[null,"","Removal Citrus",4,null,"Tree",25,null,100,0,0,null,0,0,100,0,10000,0]
[null,"","Treatment Removed citrus",4,null,"Tree",5,null,20,0,0,null,0,0,20,0,2000,0]
[null,"","Tree Wrap/Unwrap",4,null,"Tree",2,null,8,0,0,null,0,0,8,0,800,0]
[null,"Fungicides"]
[null,"","Quadris Top",10,null,"Ounce",1.5621093749999999,null,15.62109375,0,0,null,0,0,15.62109375,0,1562.109375,0]
[null,"","GEM",3.8,null,"Ounce",8.1234374999999996,null,30.869062499999998,0,0,null,0,0,30.869062499999998,0,3086.90625,0]
[null,"","Headline",24,null,"Ounce",1.859375,null,44.625,0,0,null,0,0,44.625,0,4462.5,0]
[null,"","Pristine",16,null,"Ounce",3.2912499999999998,null,52.66,0,0,null,0,0,52.66,0,5266,0]
[null,"Other Labor"]
[null,"","Costum Soil Fert. Citrus",6,null,"Hour",15,null,90,0,0,null,0,0,90,0,9000,0]
[null,"","Unallocated Labor",1,null,"Hour",15,null,15,0,0,null,0,0,15,0,1500,0]
[null,"Other Chemicals"]
[null,null,null,7.9799999999999986,null,null,7.4749999999999996,null,59.650499999999987,0,0,null,0,0,59.650499999999987,0,5965.0499999999984,0]
[null,null,null,0,null,null,0,null,0,0,0,null,0,0,0,0,0,0]
[null,null,null,0,null,null,0,null,0,{"$f":"E60*H60","v":0},0,null,0,{"$f":"J60*L60","v":0},0,{"$f":"+J60-N60","v":0},0,{"$f":"+J60*E$7","v":0}]
[null,"Irrigation"]
[null,null,"Water Cost",4,null,"Acre/Foot",21,null,84,{"$f":"E62*H62","v":0},0,null,0,{"$f":"J62*L62","v":0},84,{"$f":"+J62-N62","v":0},8400,{"$f":"+J62*E$7","v":0}]
[null,null,"Irrigation Labor",4,null,"Hour",17.5,null,70,0,0,null,0,0,70,0,7000,0]
[null,"Machinery Labor"]
[null,null,"Tractors/Self-Propelled",0.8,null,"Hour",17.21,null,13.768000000000001,{"$f":"E65*H65","v":0},0,null,0,{"$f":"J65*L65","v":0},13.768000000000001,{"$f":"+J65-N65","v":0},1376.8000000000002,{"$f":"+J65*E$7","v":0}]
[null,null,"Other Labor",0.4,null,"Hour",17.21,null,6.8840000000000003,{"$f":"E66*H66","v":0},0,null,0,{"$f":"J66*L66","v":0},6.8840000000000003,{"$f":"+J66-N66","v":0},688.40000000000009,{"$f":"+J66*E$7","v":0}]
[]
[null,"Diesel Fuel"]
[null,null,"Pickup/General Use Equipment",1,null,"Acre",0,null,0,{"$f":"E69*H69","v":0},0,null,0,{"$f":"J69*L69","v":0},0,{"$f":"+J69-N69","v":0},0,{"$f":"+J69*E$7","v":0}]
[null,null,"Tractors/Self-Propelled",3.66,null,"Gallon",2.2400000000000002,null,8.1984000000000012,{"$f":"E70*H70","v":0},0,null,0,{"$f":"J70*L70","v":0},8.1984000000000012,{"$f":"+J70-N70","v":0},819.84000000000015,{"$f":"+J70*E$7","v":0}]
[]
[null,"Gasoline"]
[null,null,"Pickup/General Use Equipment",1,null,"Acre",0,null,0,{"$f":"E73*H73","v":0},0,null,0,{"$f":"J73*L73","v":0},0,{"$f":"+J73-N73","v":0},0,{"$f":"+J73*E$7","v":0}]
[null,null,"Tractors/Self-Propelled",0,null,"Gallon",2.09,null,0,{"$f":"E74*H74","v":0},0,null,0,{"$f":"J74*L74","v":0},0,{"$f":"+J74-N74","v":0},0,{"$f":"+J74*E$7","v":0}]
[]
[null,"Repairs & Maintenance"]
[null,null,"Pickup/General Use Equipment",1,null,"Acre",0,null,0,{"$f":"E77*H77","v":0},0,null,0,{"$f":"J77*L77","v":0},0,{"$f":"+J77-N77","v":0},0,{"$f":"+J77*E$7","v":0}]
[null,null,"Irrigation Equipment",1,null,"Acre",0,null,0,0,0,null,0,0,0,0,0,0]
[null,null,"Tractors/Self-Propelled",1,null,"Acre",8.7851213094412053,null,8.7851213094412053,0,0,null,0,0,8.7851213094412053,0,878.51213094412049,0]
[null,null,"Implements",1,null,"Acre",2.8569806404862446,null,2.8569806404862446,0,0,null,0,0,2.8569806404862446,0,285.69806404862447,0]
[null,null,null,null,null,null,null,null,0,0,0,null,0,0,0,0,0,0]
[null,null,null,null,null,null,null,null,0,0,0,null,0,0,0,0,0,0]
[null,"Interest on Credit Line",null,null,null,null,0.08,null,121.87916024779518,{"$f":"+SUM(J17:J82)/2*H83","v":0},null,null,0,{"$f":"+SUM(N17:N82)/2*L83","v":0},121.87916024779518,{"$f":"+SUM(P17:P82)/2*L83","v":0},12187.916024779519,{"$f":"+J83*E$7","v":0}]
["Total Variable Costs",null,null,null,null,null,null,null,2858.3432792523322,{"$f":"SUM(J18:J83)","v":0},null,null,0,{"$f":"SUM(N18:N83)","v":0},2858.3432792523322,{"$f":"SUM(P18:P83)","v":0},285834.32792523311,{"$f":"SUM(R18:R83)","v":0}]
["Planned Returns Above Variable Costs:",null,null,null,null,null,null,null,5845.1861325123737,{"$f":"+J13-J84","v":0},null,null,0,{"$f":"+N13-N84","v":0},5845.1861325123737,{"$f":"+P13-P84","v":0},584518.61325123743,{"$f":"+R13-R84","v":0}]
[null,"Breakeven Price to Cover Variable Costs",null,null,null,null,158.79684884735178,{"$f":"IF(E10=0,\"n/a\",(YVarExp-(YTotExp+YTotRet-J10))/E10)","v":"n/a"},"Ton"]
[null,null,null,null,null,null,null,null,null,null,null,null,null,null,null,null,"Enterprise","Enterprise"]
["FIXED COSTS",null,null,"Quantity","Quantity","Units","$/Unit","$/Unit","Total","Total","Share","Share","Landlord","Landlord","Tenant","Tenant","Total","Total"]
[null,"Machinery Depreciation"]
[null,null,"Tractors/Self-Propelled",1,null,"Acre",9.0779586864225799,null,9.0779586864225799,{"$f":"E90*H90","v":0},0,null,0,{"$f":"J90*L90","v":0},9.0779586864225799,{"$f":"+J90-N90","v":0},907.79586864225803,{"$f":"+J90*E$7","v":0}]
[null,null,"Implements",1,null,"Acre",3.0475010297676128,null,3.0475010297676128,0,0,null,0,{"$f":"J91*L91","v":0},3.0475010297676128,0,304.7501029767613,0]
[null,"Equipment Investment"]
[null,null,"Tractors/Self-Propelled",70.720226541001708,null,"Dollars",0.08,null,5.6576181232801366,{"$f":"E93*H93","v":0},0,null,0,{"$f":"J93*L93","v":0},5.6576181232801366,{"$f":"+J93-N93","v":0},565.76181232801366,{"$f":"+J93*E$7","v":0}]
[null,null,"Implements",13.036532182894792,null,"Dollars",0.08,null,1.0429225746315833,0,0,null,0,{"$f":"J94*L94","v":0},1.0429225746315833,0,104.29225746315834,0]
[null,"Salaried Labor",null,1,null,"Acre",0,null,0,0,0,null,0,{"$f":"J95*L95","v":0},0,{"$f":"+J95-N95","v":0},0,{"$f":"+J95*E$7","v":0}]
[null,"Management Fee, Owner/Operator Labor",null,1,null,"Acre",0,null,0,0,0,null,0,0,0,0,0,0]
[null,"Allocated Establishment Cost",null,1,null,"Acre",142.47424883349353,null,142.47424883349353,0,0,null,0,0,142.47424883349353,0,14247.424883349353,0]
[null,"Land Cost, Orchard",null,1,null,"Acre",100,null,100,0,0,null,0,0,100,0,10000,0]
[null,"Property Taxes",null,1,null,"Acre",0,null,0,0,0,null,0,0,0,0,0,0]
[null,"Whole Farm Insurance",null,1,null,"Acre",0,null,0,0,0,null,0,0,0,0,0,0]
[null,null,null,1,null,null,0,null,0,0,0,null,0,0,0,0,0,0]
[null,null,null,1,null,null,0,null,0,{"$f":"E102*H102","v":0},0,null,0,0,0,0,0,0]
["Total Fixed Costs",null,null,null,null,null,null,null,261.30024924759545,{"$f":"+SUM(J90:J102)","v":0},null,null,0,{"$f":"+SUM(N90:N102)","v":0},261.30024924759545,{"$f":"+SUM(P90:P102)","v":0},26130.024924759542,{"$f":"+SUM(R90:R102)","v":0}]
["Total Specified Costs",null,null,null,null,null,null,null,3119.6435284999275,{"$f":"+J84+J103","v":0},null,null,0,{"$f":"+N84+N103","v":0},3119.6435284999275,{"$f":"+P84+P103","v":0},311964.35284999263,{"$f":"+R84+R103","v":0}]
[]
["Returns Above Specified Costs",null,null,null,null,null,null,null,5583.8858832647784,{"$f":"+J13-J104","v":0},null,null,0,{"$f":"+N13-N104","v":0},5583.8858832647784,{"$f":"+P13-P104","v":0},558388.58832647791,{"$f":"+R13-R104","v":0}]
[]
["    Breakeven Price to Cover Total Costs",null,null,null,null,null,173.31352936110707,{"$f":"IF(E10=0,\"n/a\",(YTotExp-(YTotExp+YTotRet-J10))/E10)","v":"n/a"},"Ton"]
[]
[null,null,null,"Example Breakeven Prices"]
[null,"Example","Example","To Cover",null,null,"To Cover"]
[null,"Yield","Yield","Variable",null,null,"Total"]
[null,"Percent","Ton","Costs",null,null,"Costs"]
[null,0.75,13.5,211.72913179646906,null,null,231.08470581480944]
[null,0.9,16.2,176.44094316372423,null,null,192.57058817900787]
[null,1,18,158.79684884735178,null,null,173.31352936110707]
[null,1.1000000000000001,19.8,144.3607716794107,null,null,157.55775396464279]
[null,1.25,22.5,127.03747907788143,null,null,138.65082348888566]
[]
["  Developed by Samuel Zapata, Assistant Professor and Extension Economist, Texas A&M AgriLife Extension, 956-968-5581.  "]
[]
["Information presented is prepared solely as a general guide and not intended to recognize or predict the costs and returns from any one operation.  Brand names are mentioned only as examples and imply no endorsement."]

{"sheet":"CornConventionalTill","index":12,"n_rows":94,"n_cols":18,"rows_kept":94,"cut":false,"hidden":false,"merged":[[81,3,81,8],[93,0,93,11],[0,0,0,11],[1,0,1,11],[2,0,2,11],[3,0,3,11]]}
["Projections for Planning Purposes Only -- Not to be Used without Updating"]
["2023 Estimated Costs and Returns per Acre"]
["Corn, Conventional Tillage, Furrow Irrigated, Rio Grande Valley"]
["Enter your name for this budget in the cell above."]
["Enter  Your Values in the cells highlighed in MAROON."]
[null,null,null,null,"Your Acres",null,null,null,null,null,null,null,null,null,null,null,null,"Your"]
[null,null,"Crop Acres",100,null,null,null,null,null,null,null,"Your",null,null,null,null,"Enterprise","Enterprise"]
[null,null,null,null,"Your",null,null,"Your","Cash","Your","Landlord","Landlord",null,"Your",null,"Your","Total","Total"]
["REVENUE",null,null,"Quantity","Quantity","Units","$/Unit","$/Unit","Total","Total","Share","Share","Landlord","Landlord","Tenant","Tenant","(100 acres)",{"$f":"\"(\" & E7 & \" acres)\"","v":"( acres)"}]
[null,"Corn",null,140,null,"Bushel",6,null,840,{"$f":"E10*H10","v":0},0,null,0,{"$f":"J10*L10","v":0},840,{"$f":"+J10-N10","v":0},84000,{"$f":"+J10*E$7","v":0}]
[null,null,null,0,null,null,0,null,0,0,0,null,0,0,0,{"$f":"+J11-N11","v":0},0,0]
[null,null,null,0,null,null,0,null,0,0,0,null,0,0,0,0,0,0]
["Total Revenue",null,null,null,null,null,null,null,840,{"$f":"SUM(J10:J12)","v":0},null,null,0,{"$f":"SUM(N10:N12)","v":0},840,{"$f":"SUM(P10:P12)","v":0},84000,{"$f":"SUM(R10:R12)","v":0}]
[null,null,null,null,null,null,null,null,null,null,null,null,null,null,null,null,"Enterprise","Enterprise"]
["VARIABLE COSTS",null,null,"Quantity","Quantity","Units","$/Unit","$/Unit","Total","Total","Share","Share","Landlord","Landlord","Tenant","Tenant","Total","Total"]
["Production Costs"]
[null,"Custom"]
[null,"","Custom Harvest and Hauling Corn",140,null,"Bushel",0.55999999999999994,null,78.399999999999991,{"$f":"E18*H18","v":0},0,null,0,{"$f":"J18*L18","v":0},78.399999999999991,{"$f":"+J18-N18","v":0},7839.9999999999991,{"$f":"+J18*E$7","v":0}]
[null,"Fertilizer"]
[null,"","UAN (32% N)",3.61,null,"CWT",33.950000000000003,null,122.5595,0,0,null,0,0,122.5595,0,12255.95,0]
[null,"Herbicide"]
[null,"","Prowl 3.3 EC",3.6,null,"Pint",6.3975,null,23.030999999999999,0,0,null,0,0,23.030999999999999,0,2303.1,0]
[null,"","Glyphosate",1.25,null,"Pint",6.25,null,7.8125,0,0,null,0,0,7.8125,0,781.25,0]
[null,"Miscellaneous"]
[null,"","Insurance, Corn",1,null,"Acre",23,null,23,0,0,null,0,0,23,0,2300,0]
[null,"Seed"]
[null,"","Corn Seed",30,null,"Thousand",3.125,null,93.75,0,0,null,0,0,93.75,0,9375,0]
[null,"Other Labor"]
[null,"","Unallocated Labor",0.47360000000000002,null,"Hour",15,null,7.1040000000000001,0,0,null,0,0,7.1040000000000001,0,710.4,0]
[null,null,null,0,null,null,0,null,0,0,0,null,0,0,0,0,0,0]
[null,null,null,0,null,null,0,null,0,0,0,null,0,0,0,0,0,0]
[null,null,null,0,null,null,0,null,0,{"$f":"E32*H32","v":0},0,null,0,{"$f":"J32*L32","v":0},0,{"$f":"+J32-N32","v":0},0,{"$f":"+J32*E$7","v":0}]
[null,"Irrigation"]
[null,null,"Water Cost",1.2000000000000002,null,"Acre/Foot",32.666666666666664,null,39.200000000000003,{"$f":"E34*H34","v":0},0,null,0,{"$f":"J34*L34","v":0},39.200000000000003,{"$f":"+J34-N34","v":0},3920.0000000000005,{"$f":"+J34*E$7","v":0}]
[null,null,"Irrigation Labor",3.3000000000000003,null,"Hour",17.5,null,57.750000000000007,0,0,null,0,0,57.750000000000007,0,5775.0000000000009,0]
[null,"Machinery Labor"]
[null,null,"Tractors/Self-Propelled",1.34,null,"Hour",17.21,null,23.061400000000003,{"$f":"E37*H37","v":0},0,null,0,{"$f":"J37*L37","v":0},23.061400000000003,{"$f":"+J37-N37","v":0},2306.1400000000003,{"$f":"+J37*E$7","v":0}]
[null,null,"Other Labor",0,null,"Hour",17.21,null,0,{"$f":"E38*H38","v":0},0,null,0,{"$f":"J38*L38","v":0},0,{"$f":"+J38-N38","v":0},0,{"$f":"+J38*E$7","v":0}]
[]
[null,"Diesel Fuel"]
[null,null,"Pickup/General Use Equipment",1,null,"Acre",0,null,0,{"$f":"E41*H41","v":0},0,null,0,{"$f":"J41*L41","v":0},0,{"$f":"+J41-N41","v":0},0,{"$f":"+J41*E$7","v":0}]
[null,null,"Tractors/Self-Propelled",8.11,null,"Gallon",2.2400000000000002,null,18.166399999999999,{"$f":"E42*H42","v":0},0,null,0,{"$f":"J42*L42","v":0},18.166399999999999,{"$f":"+J42-N42","v":0},1816.6399999999999,{"$f":"+J42*E$7","v":0}]
[]
[null,"Gasoline"]
[null,null,"Pickup/General Use Equipment",1,null,"Acre",0,null,0,{"$f":"E45*H45","v":0},0,null,0,{"$f":"J45*L45","v":0},0,{"$f":"+J45-N45","v":0},0,{"$f":"+J45*E$7","v":0}]
[null,null,"Tractors/Self-Propelled",0,null,"Gallon",2.09,null,0,{"$f":"E46*H46","v":0},0,null,0,{"$f":"J46*L46","v":0},0,{"$f":"+J46-N46","v":0},0,{"$f":"+J46*E$7","v":0}]
[]
[null,"Repairs & Maintenance"]
[null,null,"Pickup/General Use Equipment",1,null,"Acre",0,null,0,{"$f":"E49*H49","v":0},0,null,0,{"$f":"J49*L49","v":0},0,{"$f":"+J49-N49","v":0},0,{"$f":"+J49*E$7","v":0}]
[null,null,"Irrigation Equipment",1,null,"Acre",0,null,0,0,0,null,0,0,0,0,0,0]
[null,null,"Tractors/Self-Propelled",1,null,"Acre",18.398756610832844,null,18.398756610832844,0,0,null,0,0,18.398756610832844,0,1839.8756610832845,0]
[null,null,"Implements",1,null,"Acre",17.871112711095623,null,17.871112711095623,0,0,null,0,0,17.871112711095623,0,1787.1112711095623,0]
[null,null,null,null,null,null,null,null,0,0,0,null,0,0,0,0,0,0]
[null,null,null,null,null,null,null,null,0,0,0,null,0,0,0,0,0,0]
[null,"Interest on Credit Line",null,null,null,null,0.08,null,15.144905466050902,{"$f":"+SUM(J17:J54)/2*H55","v":0},null,null,0,{"$f":"+SUM(N17:N54)/2*L55","v":0},15.144905466050902,{"$f":"+SUM(P17:P54)/2*L55","v":0},1514.4905466050902,{"$f":"+J55*E$7","v":0}]
["Total Variable Costs",null,null,null,null,null,null,null,545.24957478797933,{"$f":"SUM(J18:J55)","v":0},null,null,0,{"$f":"SUM(N18:N55)","v":0},545.24957478797933,{"$f":"SUM(P18:P55)","v":0},54524.957478797944,{"$f":"SUM(R18:R55)","v":0}]
["Planned Returns Above Variable Costs:",null,null,null,null,null,null,null,294.75042521202067,{"$f":"+J13-J56","v":0},null,null,0,{"$f":"+N13-N56","v":0},294.75042521202067,{"$f":"+P13-P56","v":0},29475.042521202056,{"$f":"+R13-R56","v":0}]
[null,"Breakeven Price to Cover Variable Costs",null,null,null,null,3.8946398199141381,{"$f":"IF(E10=0,\"n/a\",(YVarExp-(YTotExp+YTotRet-J10))/E10)","v":"n/a"},"Bushel"]
[null,null,null,null,null,null,null,null,null,null,null,null,null,null,null,null,"Enterprise","Enterprise"]
["FIXED COSTS",null,null,"Quantity","Quantity","Units","$/Unit","$/Unit","Total","Total","Share","Share","Landlord","Landlord","Tenant","Tenant","Total","Total"]
[null,"Machinery Depreciation"]
[null,null,"Tractors/Self-Propelled",1,null,"Acre",19.012048497860604,null,19.012048497860604,{"$f":"E62*H62","v":0},0,null,0,{"$f":"J62*L62","v":0},19.012048497860604,{"$f":"+J62-N62","v":0},1901.2048497860605,{"$f":"+J62*E$7","v":0}]
[null,null,"Implements",1,null,"Acre",20.77321038189509,null,20.77321038189509,0,0,null,0,{"$f":"J63*L63","v":0},20.77321038189509,0,2077.3210381895092,0]
[null,"Equipment Investment"]
[null,null,"Tractors/Self-Propelled",148.10999071720437,null,"Dollars",0.08,null,11.848799257376349,{"$f":"E65*H65","v":0},0,null,0,{"$f":"J65*L65","v":0},11.848799257376349,{"$f":"+J65-N65","v":0},1184.8799257376349,{"$f":"+J65*E$7","v":0}]
[null,null,"Implements",97.327728087096617,null,"Dollars",0.08,null,7.7862182469677297,0,0,null,0,{"$f":"J66*L66","v":0},7.7862182469677297,0,778.62182469677293,0]
[null,"Salaried Labor",null,1,null,"Acre",0,null,0,0,0,null,0,{"$f":"J67*L67","v":0},0,{"$f":"+J67-N67","v":0},0,{"$f":"+J67*E$7","v":0}]
[null,"Management Fee, Owner/Operator Labor",null,1,null,"Acre",0,null,0,0,0,null,0,0,0,0,0,0]
[null,"Allocated Establishment Cost",null,1,null,"Acre",0,null,0,0,0,null,0,0,0,0,0,0]
[null,"Cash Rent, Irrigated",null,1,null,"Acre",85,null,85,0,0,null,0,0,85,0,8500,0]
[null,"Property Taxes",null,1,null,"Acre",0,null,0,0,0,null,0,0,0,0,0,0]
[null,"Whole Farm Insurance",null,1,null,"Acre",0,null,0,0,0,null,0,0,0,0,0,0]
[null,null,null,1,null,null,0,null,0,0,0,null,0,0,0,0,0,0]
[null,null,null,1,null,null,0,null,0,{"$f":"E74*H74","v":0},0,null,0,0,0,0,0,0]
["Total Fixed Costs",null,null,null,null,null,null,null,144.42027638409976,{"$f":"+SUM(J62:J74)","v":0},null,null,0,{"$f":"+SUM(N62:N74)","v":0},144.42027638409976,{"$f":"+SUM(P62:P74)","v":0},14442.027638409978,{"$f":"+SUM(R62:R74)","v":0}]
["Total Specified Costs",null,null,null,null,null,null,null,689.66985117207912,{"$f":"+J56+J75","v":0},null,null,0,{"$f":"+N56+N75","v":0},689.66985117207912,{"$f":"+P56+P75","v":0},68966.985117207922,{"$f":"+R56+R75","v":0}]
[]
["Returns Above Specified Costs",null,null,null,null,null,null,null,150.33014882792088,{"$f":"+J13-J76","v":0},null,null,0,{"$f":"+N13-N76","v":0},150.33014882792088,{"$f":"+P13-P76","v":0},15033.014882792078,{"$f":"+R13-R76","v":0}]
[]
["    Breakeven Price to Cover Total Costs",null,null,null,null,null,4.926213222657708,{"$f":"IF(E10=0,\"n/a\",(YTotExp-(YTotExp+YTotRet-J10))/E10)","v":"n/a"},"Bushel"]
[]
[null,null,null,"Example Breakeven Prices"]
[null,"Example","Example","To Cover",null,null,"To Cover"]
[null,"Yield","Yield","Variable",null,null,"Total"]
[null,"Percent","Bushel","Costs",null,null,"Costs"]
[null,0.75,105,5.1928530932188508,null,null,6.5682842968769437]
[null,0.9,126,4.327377577682376,null,null,5.4735702473974532]
[null,1,140,3.8946398199141381,null,null,4.926213222657708]
[null,1.1000000000000001,154,3.540581654467398,null,null,4.4783756569615525]
[null,1.25,175,3.1157118559313104,null,null,3.9409705781261666]
[]
["  Developed by Samuel Zapata, Assistant Professor and Extension Economist, Texas A&M AgriLife Extension, 956-968-5581.  "]
[]
["Information presented is prepared solely as a general guide and not intended to recognize or predict the costs and returns from any one operation.  Brand names are mentioned only as examples and imply no endorsement."]

{"sheet":"CornRducedTill","index":13,"n_rows":94,"n_cols":18,"rows_kept":94,"cut":false,"hidden":false,"merged":[[81,3,81,8],[93,0,93,11],[0,0,0,11],[1,0,1,11],[2,0,2,11],[3,0,3,11]]}
["Projections for Planning Purposes Only -- Not to be Used without Updating"]
["2023 Estimated Costs and Returns per Acre"]
["Corn, Reduced Tillage, Furrow Irrigated, Rio Grande Valley"]
["Enter your name for this budget in the cell above."]
["Enter  Your Values in the cells highlighed in MAROON."]
[null,null,null,null,"Your Acres",null,null,null,null,null,null,null,null,null,null,null,null,"Your"]
[null,null,"Crop Acres",100,null,null,null,null,null,null,null,"Your",null,null,null,null,"Enterprise","Enterprise"]
[null,null,null,null,"Your",null,null,"Your","Cash","Your","Landlord","Landlord",null,"Your",null,"Your","Total","Total"]
["REVENUE",null,null,"Quantity","Quantity","Units","$/Unit","$/Unit","Total","Total","Share","Share","Landlord","Landlord","Tenant","Tenant","(100 acres)",{"$f":"\"(\" & E7 & \" acres)\"","v":"( acres)"}]
[null,"Corn",null,140,null,"Bushel",6,null,840,{"$f":"E10*H10","v":0},0,null,0,{"$f":"J10*L10","v":0},840,{"$f":"+J10-N10","v":0},84000,{"$f":"+J10*E$7","v":0}]
[null,null,null,0,null,null,0,null,0,0,0,null,0,0,0,{"$f":"+J11-N11","v":0},0,0]
[null,null,null,0,null,null,0,null,0,0,0,null,0,0,0,0,0,0]
["Total Revenue",null,null,null,null,null,null,null,840,{"$f":"SUM(J10:J12)","v":0},null,null,0,{"$f":"SUM(N10:N12)","v":0},840,{"$f":"SUM(P10:P12)","v":0},84000,{"$f":"SUM(R10:R12)","v":0}]
[null,null,null,null,null,null,null,null,null,null,null,null,null,null,null,null,"Enterprise","Enterprise"]
["VARIABLE COSTS",null,null,"Quantity","Quantity","Units","$/Unit","$/Unit","Total","Total","Share","Share","Landlord","Landlord","Tenant","Tenant","Total","Total"]
["Production Costs"]
[null,"Herbicide"]
[null,"","Glyphosate",1.25,null,"Pint",6.25,null,7.8125,{"$f":"E18*H18","v":0},0,null,0,{"$f":"J18*L18","v":0},7.8125,{"$f":"+J18-N18","v":0},781.25,{"$f":"+J18*E$7","v":0}]
[null,"","AAtrex 4L",2,null,"Pint",2.8975,null,5.7949999999999999,0,0,null,0,0,5.7949999999999999,0,579.5,0]
[null,"Fertilizer"]
[null,"","UAN (32% N)",3.61,null,"CWT",33.950000000000003,null,122.5595,0,0,null,0,0,122.5595,0,12255.95,0]
[null,"Seed"]
[null,"","Corn Seed",30,null,"Thousand",3.125,null,93.75,0,0,null,0,0,93.75,0,9375,0]
[null,"Custom"]
[null,"","Custom Harvest and Hauling Corn",140,null,"Bushel",0.55999999999999994,null,78.399999999999991,0,0,null,0,0,78.399999999999991,0,7839.9999999999991,0]
[null,"Miscellaneous"]
[null,"","Insurance, Corn",1,null,"Acre",23,null,23,0,0,null,0,0,23,0,2300,0]
[null,"Other Labor"]
[null,"","Unallocated Labor",0.20960000000000001,null,"Hour",15,null,3.1440000000000001,0,0,null,0,0,3.1440000000000001,0,314.40000000000003,0]
[null,null,null,0,null,null,0,null,0,0,0,null,0,0,0,0,0,0]
[null,null,null,0,null,null,0,null,0,0,0,null,0,0,0,0,0,0]
[null,null,null,0,null,null,0,null,0,{"$f":"E32*H32","v":0},0,null,0,{"$f":"J32*L32","v":0},0,{"$f":"+J32-N32","v":0},0,{"$f":"+J32*E$7","v":0}]
[null,"Irrigation"]
[null,null,"Water Cost",1.2000000000000002,null,"Acre/Foot",32.666666666666664,null,39.200000000000003,{"$f":"E34*H34","v":0},0,null,0,{"$f":"J34*L34","v":0},39.200000000000003,{"$f":"+J34-N34","v":0},3920.0000000000005,{"$f":"+J34*E$7","v":0}]
[null,null,"Irrigation Labor",3.3000000000000003,null,"Hour",17.5,null,57.750000000000007,0,0,null,0,0,57.750000000000007,0,5775.0000000000009,0]
[null,"Machinery Labor"]
[null,null,"Tractors/Self-Propelled",0.9,null,"Hour",17.21,null,15.489000000000001,{"$f":"E37*H37","v":0},0,null,0,{"$f":"J37*L37","v":0},15.489000000000001,{"$f":"+J37-N37","v":0},1548.9,{"$f":"+J37*E$7","v":0}]
[null,null,"Other Labor",0,null,"Hour",17.21,null,0,{"$f":"E38*H38","v":0},0,null,0,{"$f":"J38*L38","v":0},0,{"$f":"+J38-N38","v":0},0,{"$f":"+J38*E$7","v":0}]
[]
[null,"Diesel Fuel"]
[null,null,"Pickup/General Use Equipment",1,null,"Acre",0,null,0,{"$f":"E41*H41","v":0},0,null,0,{"$f":"J41*L41","v":0},0,{"$f":"+J41-N41","v":0},0,{"$f":"+J41*E$7","v":0}]
[null,null,"Tractors/Self-Propelled",4.3099999999999996,null,"Gallon",2.2400000000000002,null,9.6544000000000008,{"$f":"E42*H42","v":0},0,null,0,{"$f":"J42*L42","v":0},9.6544000000000008,{"$f":"+J42-N42","v":0},965.44,{"$f":"+J42*E$7","v":0}]
[]
[null,"Gasoline"]
[null,null,"Pickup/General Use Equipment",1,null,"Acre",0,null,0,{"$f":"E45*H45","v":0},0,null,0,{"$f":"J45*L45","v":0},0,{"$f":"+J45-N45","v":0},0,{"$f":"+J45*E$7","v":0}]
[null,null,"Tractors/Self-Propelled",0,null,"Gallon",2.09,null,0,{"$f":"E46*H46","v":0},0,null,0,{"$f":"J46*L46","v":0},0,{"$f":"+J46-N46","v":0},0,{"$f":"+J46*E$7","v":0}]
[]
[null,"Repairs & Maintenance"]
[null,null,"Pickup/General Use Equipment",1,null,"Acre",0,null,0,{"$f":"E49*H49","v":0},0,null,0,{"$f":"J49*L49","v":0},0,{"$f":"+J49-N49","v":0},0,{"$f":"+J49*E$7","v":0}]
[null,null,"Irrigation Equipment",1,null,"Acre",0,null,0,0,0,null,0,0,0,0,0,0]
[null,null,"Tractors/Self-Propelled",1,null,"Acre",8.6209551422092474,null,8.6209551422092474,0,0,null,0,0,8.6209551422092474,0,862.09551422092477,0]
[null,null,"Implements",1,null,"Acre",10.521066850412412,null,10.521066850412412,0,0,null,0,0,10.521066850412412,0,1052.1066850412412,0]
[null,null,null,null,null,null,null,null,0,0,0,null,0,0,0,0,0,0]
[null,null,null,null,null,null,null,null,0,0,0,null,0,0,0,0,0,0]
[null,"Interest on Credit Line",null,null,null,null,0.08,null,13.068695894447343,{"$f":"+SUM(J17:J54)/2*H55","v":0},null,null,0,{"$f":"+SUM(N17:N54)/2*L55","v":0},13.068695894447343,{"$f":"+SUM(P17:P54)/2*L55","v":0},1306.8695894447342,{"$f":"+J55*E$7","v":0}]
["Total Variable Costs",null,null,null,null,null,null,null,488.76511788706898,{"$f":"SUM(J18:J55)","v":0},null,null,0,{"$f":"SUM(N18:N55)","v":0},488.76511788706898,{"$f":"SUM(P18:P55)","v":0},48876.511788706906,{"$f":"SUM(R18:R55)","v":0}]
["Planned Returns Above Variable Costs:",null,null,null,null,null,null,null,351.23488211293102,{"$f":"+J13-J56","v":0},null,null,0,{"$f":"+N13-N56","v":0},351.23488211293102,{"$f":"+P13-P56","v":0},35123.488211293094,{"$f":"+R13-R56","v":0}]
[null,"Breakeven Price to Cover Variable Costs",null,null,null,null,3.4911794134790641,{"$f":"IF(E10=0,\"n/a\",(YVarExp-(YTotExp+YTotRet-J10))/E10)","v":"n/a"},"Bushel"]
[null,null,null,null,null,null,null,null,null,null,null,null,null,null,null,null,"Enterprise","Enterprise"]
["FIXED COSTS",null,null,"Quantity","Quantity","Units","$/Unit","$/Unit","Total","Total","Share","Share","Landlord","Landlord","Tenant","Tenant","Total","Total"]
[null,"Machinery Depreciation"]
[null,null,"Tractors/Self-Propelled",1,null,"Acre",8.9083203136162226,null,8.9083203136162226,{"$f":"E62*H62","v":0},0,null,0,{"$f":"J62*L62","v":0},8.9083203136162226,{"$f":"+J62-N62","v":0},890.83203136162228,{"$f":"+J62*E$7","v":0}]
[null,null,"Implements",1,null,"Acre",12.783553133541636,null,12.783553133541636,0,0,null,0,{"$f":"J63*L63","v":0},12.783553133541636,0,1278.3553133541636,0]
[null,"Equipment Investment"]
[null,null,"Tractors/Self-Propelled",69.398688894784442,null,"Dollars",0.08,null,5.5518951115827555,{"$f":"E65*H65","v":0},0,null,0,{"$f":"J65*L65","v":0},5.5518951115827555,{"$f":"+J65-N65","v":0},555.18951115827554,{"$f":"+J65*E$7","v":0}]
[null,null,"Implements",63.736773973764564,null,"Dollars",0.08,null,5.0989419179011648,0,0,null,0,{"$f":"J66*L66","v":0},5.0989419179011648,0,509.89419179011645,0]
[null,"Salaried Labor",null,1,null,"Acre",0,null,0,0,0,null,0,{"$f":"J67*L67","v":0},0,{"$f":"+J67-N67","v":0},0,{"$f":"+J67*E$7","v":0}]
[null,"Management Fee, Owner/Operator Labor",null,1,null,"Acre",0,null,0,0,0,null,0,0,0,0,0,0]
[null,"Allocated Establishment Cost",null,1,null,"Acre",0,null,0,0,0,null,0,0,0,0,0,0]
[null,"Cash Rent, Irrigated",null,1,null,"Acre",85,null,85,0,0,null,0,0,85,0,8500,0]
[null,"Property Taxes",null,1,null,"Acre",0,null,0,0,0,null,0,0,0,0,0,0]
[null,"Whole Farm Insurance",null,1,null,"Acre",0,null,0,0,0,null,0,0,0,0,0,0]
[null,null,null,1,null,null,0,null,0,0,0,null,0,0,0,0,0,0]
[null,null,null,1,null,null,0,null,0,{"$f":"E74*H74","v":0},0,null,0,0,0,0,0,0]
["Total Fixed Costs",null,null,null,null,null,null,null,117.34271047664178,{"$f":"+SUM(J62:J74)","v":0},null,null,0,{"$f":"+SUM(N62:N74)","v":0},117.34271047664178,{"$f":"+SUM(P62:P74)","v":0},11734.271047664177,{"$f":"+SUM(R62:R74)","v":0}]
["Total Specified Costs",null,null,null,null,null,null,null,606.10782836371072,{"$f":"+J56+J75","v":0},null,null,0,{"$f":"+N56+N75","v":0},606.10782836371072,{"$f":"+P56+P75","v":0},60610.782836371087,{"$f":"+R56+R75","v":0}]
[]
["Returns Above Specified Costs",null,null,null,null,null,null,null,233.89217163628928,{"$f":"+J13-J76","v":0},null,null,0,{"$f":"+N13-N76","v":0},233.89217163628928,{"$f":"+P13-P76","v":0},23389.217163628913,{"$f":"+R13-R76","v":0}]
[]
["    Breakeven Price to Cover Total Costs",null,null,null,null,null,4.3293416311693624,{"$f":"IF(E10=0,\"n/a\",(YTotExp-(YTotExp+YTotRet-J10))/E10)","v":"n/a"},"Bushel"]
[]
[null,null,null,"Example Breakeven Prices"]
[null,"Example","Example","To Cover",null,null,"To Cover"]
[null,"Yield","Yield","Variable",null,null,"Total"]
[null,"Percent","Bushel","Costs",null,null,"Costs"]
[null,0.75,105,4.6549058846387519,null,null,5.772455508225816]
[null,0.9,126,3.8790882371989603,null,null,4.8103795901881803]
[null,1,140,3.4911794134790641,null,null,4.3293416311693624]
[null,1.1000000000000001,154,3.1737994667991494,null,null,3.9357651192448748]
[null,1.25,175,2.7929435307832513,null,null,3.4634733049354898]
[]
["  Developed by Samuel Zapata, Assistant Professor and Extension Economist, Texas A&M AgriLife Extension, 956-968-5581.  "]
[]
["Information presented is prepared solely as a general guide and not intended to recognize or predict the costs and returns from any one operation.  Brand names are mentioned only as examples and imply no endorsement."]

{"sheet":"CottonConventionalTill","index":14,"n_rows":107,"n_cols":18,"rows_kept":107,"cut":false,"hidden":false,"merged":[[94,3,94,8],[106,0,106,11],[0,0,0,11],[1,0,1,11],[2,0,2,11],[3,0,3,11]]}
["Projections for Planning Purposes Only -- Not to be Used without Updating"]
["2023 Estimated Costs and Returns per Acre"]
["Cotton, Conventional Tillage, Furrow Irrigated, Rio Grande Valley"]
["Enter your name for this budget in the cell above."]
["Enter  Your Values in the cells highlighed in MAROON."]
[null,null,null,null,"Your Acres",null,null,null,null,null,null,null,null,null,null,null,null,"Your"]
[null,null,"Crop Acres",100,null,null,null,null,null,null,null,"Your",null,null,null,null,"Enterprise","Enterprise"]
[null,null,null,null,"Your",null,null,"Your","Cash","Your","Landlord","Landlord",null,"Your",null,"Your","Total","Total"]
["REVENUE",null,null,"Quantity","Quantity","Units","$/Unit","$/Unit","Total","Total","Share","Share","Landlord","Landlord","Tenant","Tenant","(100 acres)",{"$f":"\"(\" & E7 & \" acres)\"","v":"( acres)"}]
[null,"Cotton Lint",null,975,null,"Pound",0.9,null,877.5,{"$f":"E10*H10","v":0},0,null,0,{"$f":"J10*L10","v":0},877.5,{"$f":"+J10-N10","v":0},87750,{"$f":"+J10*E$7","v":0}]
[null,"Cottonseed",null,0.69419999999999993,null,"Ton",360,null,249.91199999999998,0,0,null,0,0,249.91199999999998,{"$f":"+J11-N11","v":0},24991.199999999997,0]
[null,null,null,0,null,null,0,null,0,0,0,null,0,0,0,0,0,0]
[null,null,null,0,null,null,0,null,0,0,0,null,0,0,0,0,0,0]
["Total Revenue",null,null,null,null,null,null,null,1127.412,{"$f":"SUM(J10:J13)","v":0},null,null,0,{"$f":"SUM(N10:N13)","v":0},1127.412,{"$f":"SUM(P10:P13)","v":0},112741.2,{"$f":"SUM(R10:R13)","v":0}]
[null,null,null,null,null,null,null,null,null,null,null,null,null,null,null,null,"Enterprise","Enterprise"]
["VARIABLE COSTS",null,null,"Quantity","Quantity","Units","$/Unit","$/Unit","Total","Total","Share","Share","Landlord","Landlord","Tenant","Tenant","Total","Total"]
["Production Costs"]
[null,"Seed"]
[null,"","Cotton Seed",50,null,"Thousand",1.641,null,82.05,{"$f":"E19*H19","v":0},0,null,0,{"$f":"J19*L19","v":0},82.05,{"$f":"+J19-N19","v":0},8205,{"$f":"+J19*E$7","v":0}]
[null,"Fertilizer"]
[null,"","UAN (32% N)",3.06,null,"CWT",33.950000000000003,null,103.88700000000001,0,0,null,0,0,103.88700000000001,0,10388.700000000001,0]
[null,"Custom"]
[null,"","Insect Scouting",1,null,"Acre",15,null,15,0,0,null,0,0,15,0,1500,0]
[null,"","Custon Harvest Cotton",975,null,"Pound",0.16500000000000001,null,160.875,0,0,null,0,0,160.875,0,16087.5,0]
[null,"","Gin",975,null,"Pound",0.15,null,146.25,0,0,null,0,0,146.25,0,14625,0]
[null,"Herbicide"]
[null,"","Trifluralin 4EC",2,null,"Pint",4.7475000000000005,null,9.495000000000001,0,0,null,0,0,9.495000000000001,0,949.50000000000011,0]
[null,"","2, 4-D Amine",1,null,"Pint",2.9937499999999999,null,2.9937499999999999,0,0,null,0,0,2.9937499999999999,0,299.375,0]
[null,"Insecticide"]
[null,"","Transform",1,null,"Ounce",9.3433593750000004,null,9.3433593750000004,0,0,null,0,0,9.3433593750000004,0,934.3359375,0]
[null,"","Sivanto",10.5,null,"Ounce",3.2808593749999999,null,34.449023437499996,0,0,null,0,0,34.449023437499996,0,3444.9023437499995,0]
[null,"","Centric",2.5,null,"Ounce",5.95,null,14.875,0,0,null,0,0,14.875,0,1487.5,0]
[null,"Other Chemicals"]
[null,"","Mepiquat ",48,null,"Ounce",4.6875E-2,null,2.25,0,0,null,0,0,2.25,0,225,0]
[null,"","Thidiazuron",4,null,"Ounce",1.2210937500000001,null,4.8843750000000004,0,0,null,0,0,4.8843750000000004,0,488.43750000000006,0]
[null,"","Surfactant",0.25,null,"Pint",7.4749999999999996,null,1.8687499999999999,0,0,null,0,0,1.8687499999999999,0,186.875,0]
[null,"","Ethephon",21,null,"Ounce",0.39371875000000001,null,8.2680937500000002,0,0,null,0,0,8.2680937500000002,0,826.80937500000005,0]
[null,"Other Labor"]
[null,"","Unallocated Labor",1.2856000000000001,null,"Hour",15,null,19.284000000000002,0,0,null,0,0,19.284000000000002,0,1928.4000000000003,0]
[null,"Miscellaneous"]
[null,"","Insurance, Cotton - Irrigated",1,null,"Acre",33,null,33,0,0,null,0,0,33,0,3300,0]
[null,"","BW Eradication Program - Irr",1,null,"Acre",28,null,28,0,0,null,0,0,28,0,2800,0]
[null,null,null,0,null,null,0,null,0,0,0,null,0,0,0,0,0,0]
[null,null,null,0,null,null,0,null,0,0,0,null,0,0,0,0,0,0]
[null,null,null,0,null,null,0,null,0,{"$f":"E45*H45","v":0},0,null,0,{"$f":"J45*L45","v":0},0,{"$f":"+J45-N45","v":0},0,{"$f":"+J45*E$7","v":0}]
[null,"Irrigation"]
[null,null,"Water Cost",1.2000000000000002,null,"Acre/Foot",32.666666666666664,null,39.200000000000003,{"$f":"E47*H47","v":0},0,null,0,{"$f":"J47*L47","v":0},39.200000000000003,{"$f":"+J47-N47","v":0},3920.0000000000005,{"$f":"+J47*E$7","v":0}]
[null,null,"Irrigation Labor",3.3000000000000003,null,"Hour",17.5,null,57.750000000000007,0,0,null,0,0,57.750000000000007,0,5775.0000000000009,0]
[null,"Machinery Labor"]
[null,null,"Tractors/Self-Propelled",1.88,null,"Hour",17.21,null,32.354799999999997,{"$f":"E50*H50","v":0},0,null,0,{"$f":"J50*L50","v":0},32.354799999999997,{"$f":"+J50-N50","v":0},3235.4799999999996,{"$f":"+J50*E$7","v":0}]
[null,null,"Other Labor",0.36,null,"Hour",17.21,null,6.1955999999999998,{"$f":"E51*H51","v":0},0,null,0,{"$f":"J51*L51","v":0},6.1955999999999998,{"$f":"+J51-N51","v":0},619.55999999999995,{"$f":"+J51*E$7","v":0}]
[]
[null,"Diesel Fuel"]
[null,null,"Pickup/General Use Equipment",1,null,"Acre",0,null,0,{"$f":"E54*H54","v":0},0,null,0,{"$f":"J54*L54","v":0},0,{"$f":"+J54-N54","v":0},0,{"$f":"+J54*E$7","v":0}]
[null,null,"Tractors/Self-Propelled",13.25,null,"Gallon",2.2400000000000002,null,29.680000000000003,{"$f":"E55*H55","v":0},0,null,0,{"$f":"J55*L55","v":0},29.680000000000003,{"$f":"+J55-N55","v":0},2968.0000000000005,{"$f":"+J55*E$7","v":0}]
[]
[null,"Gasoline"]
[null,null,"Pickup/General Use Equipment",1,null,"Acre",0,null,0,{"$f":"E58*H58","v":0},0,null,0,{"$f":"J58*L58","v":0},0,{"$f":"+J58-N58","v":0},0,{"$f":"+J58*E$7","v":0}]
[null,null,"Tractors/Self-Propelled",0,null,"Gallon",2.09,null,0,{"$f":"E59*H59","v":0},0,null,0,{"$f":"J59*L59","v":0},0,{"$f":"+J59-N59","v":0},0,{"$f":"+J59*E$7","v":0}]
[]
[null,"Repairs & Maintenance"]
[null,null,"Pickup/General Use Equipment",1,null,"Acre",0,null,0,{"$f":"E62*H62","v":0},0,null,0,{"$f":"J62*L62","v":0},0,{"$f":"+J62-N62","v":0},0,{"$f":"+J62*E$7","v":0}]
[null,null,"Irrigation Equipment",1,null,"Acre",0,null,0,0,0,null,0,0,0,0,0,0]
[null,null,"Tractors/Self-Propelled",1,null,"Acre",27.800761248787115,null,27.800761248787115,0,0,null,0,0,27.800761248787115,0,2780.0761248787117,0]
[null,null,"Implements",1,null,"Acre",20.225396535023773,null,20.225396535023773,0,0,null,0,0,20.225396535023773,0,2022.5396535023772,0]
[null,null,null,null,null,null,null,null,0,0,0,null,0,0,0,0,0,0]
[null,null,null,null,null,null,null,null,0,0,0,null,0,0,0,0,0,0]
[null,"Interest on Credit Line",null,null,null,null,0.08,null,16.99782750962024,{"$f":"+SUM(J18:J67)/2*H68","v":0},null,null,0,{"$f":"+SUM(N18:N67)/2*L68","v":0},16.99782750962024,{"$f":"+SUM(P18:P67)/2*L68","v":0},1699.782750962024,{"$f":"+J68*E$7","v":0}]
["Total Variable Costs",null,null,null,null,null,null,null,906.97773685593108,{"$f":"SUM(J19:J68)","v":0},null,null,0,{"$f":"SUM(N19:N68)","v":0},906.97773685593108,{"$f":"SUM(P19:P68)","v":0},90697.7736855931,{"$f":"SUM(R19:R68)","v":0}]
["Planned Returns Above Variable Costs:",null,null,null,null,null,null,null,220.43426314406895,{"$f":"+J14-J69","v":0},null,null,0,{"$f":"+N14-N69","v":0},220.43426314406895,{"$f":"+P14-P69","v":0},22043.426314406897,{"$f":"+R14-R69","v":0}]
[null,"Breakeven Price to Cover Variable Costs",null,null,null,null,0.67391357626249349,{"$f":"IF(E10=0,\"n/a\",(YVarExp-(YTotExp+YTotRet-J10))/E10)","v":"n/a"},"Pound"]
[null,null,null,null,null,null,null,null,null,null,null,null,null,null,null,null,"Enterprise","Enterprise"]
["FIXED COSTS",null,null,"Quantity","Quantity","Units","$/Unit","$/Unit","Total","Total","Share","Share","Landlord","Landlord","Tenant","Tenant","Total","Total"]
[null,"Machinery Depreciation"]
[null,null,"Tractors/Self-Propelled",1,null,"Acre",36.019237440787286,null,36.019237440787286,{"$f":"E75*H75","v":0},0,null,0,{"$f":"J75*L75","v":0},36.019237440787286,{"$f":"+J75-N75","v":0},3601.9237440787288,{"$f":"+J75*E$7","v":0}]
[null,null,"Implements",1,null,"Acre",24.73838290255846,null,24.73838290255846,0,0,null,0,{"$f":"J76*L76","v":0},24.73838290255846,0,2473.838290255846,0]
[null,"Equipment Investment"]
[null,null,"Tractors/Self-Propelled",277.21346423689761,null,"Dollars",0.08,null,22.177077138951809,{"$f":"E78*H78","v":0},0,null,0,{"$f":"J78*L78","v":0},22.177077138951809,{"$f":"+J78-N78","v":0},2217.7077138951809,{"$f":"+J78*E$7","v":0}]
[null,null,"Implements",137.31111902969653,null,"Dollars",0.08,null,10.984889522375722,0,0,null,0,{"$f":"J79*L79","v":0},10.984889522375722,0,1098.4889522375722,0]
[null,"Salaried Labor",null,1,null,"Acre",0,null,0,0,0,null,0,{"$f":"J80*L80","v":0},0,{"$f":"+J80-N80","v":0},0,{"$f":"+J80*E$7","v":0}]
[null,"Management Fee, Owner/Operator Labor",null,1,null,"Acre",0,null,0,0,0,null,0,0,0,0,0,0]
[null,"Allocated Establishment Cost",null,1,null,"Acre",0,null,0,0,0,null,0,0,0,0,0,0]
[null,"Cash Rent, Irrigated",null,1,null,"Acre",85,null,85,0,0,null,0,0,85,0,8500,0]
[null,"Property Taxes",null,1,null,"Acre",0,null,0,0,0,null,0,0,0,0,0,0]
[null,"Whole Farm Insurance",null,1,null,"Acre",0,null,0,0,0,null,0,0,0,0,0,0]
[null,null,null,1,null,null,0,null,0,0,0,null,0,0,0,0,0,0]
[null,null,null,1,null,null,0,null,0,{"$f":"E87*H87","v":0},0,null,0,0,0,0,0,0]
["Total Fixed Costs",null,null,null,null,null,null,null,178.9195870046733,{"$f":"+SUM(J75:J87)","v":0},null,null,0,{"$f":"+SUM(N75:N87)","v":0},178.9195870046733,{"$f":"+SUM(P75:P87)","v":0},17891.95870046733,{"$f":"+SUM(R75:R87)","v":0}]
["Total Specified Costs",null,null,null,null,null,null,null,1085.8973238606045,{"$f":"+J69+J88","v":0},null,null,0,{"$f":"+N69+N88","v":0},1085.8973238606045,{"$f":"+P69+P88","v":0},108589.73238606044,{"$f":"+R69+R88","v":0}]
[]
["Returns Above Specified Costs",null,null,null,null,null,null,null,41.514676139395533,{"$f":"+J14-J89","v":0},null,null,0,{"$f":"+N14-N89","v":0},41.514676139395533,{"$f":"+P14-P89","v":0},4151.4676139395597,{"$f":"+R14-R89","v":0}]
[]
["    Breakeven Price to Cover Total Costs",null,null,null,null,null,0.8574208449852353,{"$f":"IF(E10=0,\"n/a\",(YTotExp-(YTotExp+YTotRet-J10))/E10)","v":"n/a"},"Pound"]
[]
[null,null,null,"Example Breakeven Prices"]
[null,"Example","Example","To Cover",null,null,"To Cover"]
[null,"Yield","Yield","Variable",null,null,"Total"]
[null,"Percent","Pound","Costs",null,null,"Costs"]
[null,0.75,731.25,0.89855143501665802,null,null,1.1432277933136472]
[null,0.9,877.5,0.74879286251388166,null,null,0.95268982776137257]
[null,1,975,0.67391357626249349,null,null,0.8574208449852353]
[null,1.1000000000000001,1072.5,0.61264870569317587,null,null,0.7794734954411231]
[null,1.25,1218.75,0.53913086100999486,null,null,0.6859366759881883]
[]
["  Developed by Samuel Zapata, Assistant Professor and Extension Economist, Texas A&M AgriLife Extension, 956-968-5581.  "]
[]
["Information presented is prepared solely as a general guide and not intended to recognize or predict the costs and returns from any one operation.  Brand names are mentioned only as examples and imply no endorsement."]

{"sheet":"CottonReducedTill","index":15,"n_rows":108,"n_cols":18,"rows_kept":108,"cut":false,"hidden":false,"merged":[[95,3,95,8],[107,0,107,11],[0,0,0,11],[1,0,1,11],[2,0,2,11],[3,0,3,11]]}
["Projections for Planning Purposes Only -- Not to be Used without Updating"]
["2023 Estimated Costs and Returns per Acre"]
["Cotton, Reduced Tillage, GMO, Furrow Irrigated, Rio Grande Valley"]
["Enter your name for this budget in the cell above."]
["Enter  Your Values in the cells highlighed in MAROON."]
[null,null,null,null,"Your Acres",null,null,null,null,null,null,null,null,null,null,null,null,"Your"]
[null,null,"Crop Acres",100,null,null,null,null,null,null,null,"Your",null,null,null,null,"Enterprise","Enterprise"]
[null,null,null,null,"Your",null,null,"Your","Cash","Your","Landlord","Landlord",null,"Your",null,"Your","Total","Total"]
["REVENUE",null,null,"Quantity","Quantity","Units","$/Unit","$/Unit","Total","Total","Share","Share","Landlord","Landlord","Tenant","Tenant","(100 acres)",{"$f":"\"(\" & E7 & \" acres)\"","v":"( acres)"}]
[null,"Cotton Lint",null,1250,null,"Pound",0.9,null,1125,{"$f":"E10*H10","v":0},0,null,0,{"$f":"J10*L10","v":0},1125,{"$f":"+J10-N10","v":0},112500,{"$f":"+J10*E$7","v":0}]
[null,"Cottonseed",null,0.89,null,"Ton",360,null,320.39999999999998,0,0,null,0,0,320.39999999999998,{"$f":"+J11-N11","v":0},32039.999999999996,0]
[null,null,null,0,null,null,0,null,0,0,0,null,0,0,0,0,0,0]
[null,null,null,0,null,null,0,null,0,0,0,null,0,0,0,0,0,0]
["Total Revenue",null,null,null,null,null,null,null,1445.4,{"$f":"SUM(J10:J13)","v":0},null,null,0,{"$f":"SUM(N10:N13)","v":0},1445.4,{"$f":"SUM(P10:P13)","v":0},144540,{"$f":"SUM(R10:R13)","v":0}]
[null,null,null,null,null,null,null,null,null,null,null,null,null,null,null,null,"Enterprise","Enterprise"]
["VARIABLE COSTS",null,null,"Quantity","Quantity","Units","$/Unit","$/Unit","Total","Total","Share","Share","Landlord","Landlord","Tenant","Tenant","Total","Total"]
["Production Costs"]
[null,"Herbicide"]
[null,"","Glyphosate",3.75,null,"Pint",6.25,null,23.4375,{"$f":"E19*H19","v":0},0,null,0,{"$f":"J19*L19","v":0},23.4375,{"$f":"+J19-N19","v":0},2343.75,{"$f":"+J19*E$7","v":0}]
[null,"","Harmony Extra",0.6,null,"Ounce",11.33,null,6.798,0,0,null,0,0,6.798,0,679.8,0]
[null,"","2, 4-D Amine",2,null,"Pint",2.9937499999999999,null,5.9874999999999998,0,0,null,0,0,5.9874999999999998,0,598.75,0]
[null,"Seed"]
[null,"","Cotton Seed",50,null,"Thousand",1.641,null,82.05,0,0,null,0,0,82.05,0,8205,0]
[null,"Fertilizer"]
[null,"","UAN (32% N)",3.93,null,"CWT",33.950000000000003,null,133.42350000000002,0,0,null,0,0,133.42350000000002,0,13342.350000000002,0]
[null,"Custom"]
[null,"","Insect Scouting",1,null,"Acre",15,null,15,0,0,null,0,0,15,0,1500,0]
[null,"","Custon Harvest Cotton",1250,null,"Pound",0.16500000000000001,null,206.25,0,0,null,0,0,206.25,0,20625,0]
[null,"","Gin",1250,null,"Pound",0.15,null,187.5,0,0,null,0,0,187.5,0,18750,0]
[null,"Miscellaneous"]
[null,"","Insurance, Cotton - Irrigated",1,null,"Acre",33,null,33,0,0,null,0,0,33,0,3300,0]
[null,"","BW Eradication Program - Irr",1,null,"Acre",28,null,28,0,0,null,0,0,28,0,2800,0]
[null,"Insecticide"]
[null,"","Centric",2.5,null,"Ounce",5.95,null,14.875,0,0,null,0,0,14.875,0,1487.5,0]
[null,"","Sivanto",10.5,null,"Ounce",3.2808593749999999,null,34.449023437499996,0,0,null,0,0,34.449023437499996,0,3444.9023437499995,0]
[null,"","Transform",1,null,"Ounce",9.3433593750000004,null,9.3433593750000004,0,0,null,0,0,9.3433593750000004,0,934.3359375,0]
[null,"Other Chemicals"]
[null,"","Mepiquat ",48,null,"Ounce",4.6875E-2,null,2.25,0,0,null,0,0,2.25,0,225,0]
[null,"","Thidiazuron",4,null,"Ounce",1.2210937500000001,null,4.8843750000000004,0,0,null,0,0,4.8843750000000004,0,488.43750000000006,0]
[null,"","Surfactant",0.5,null,"Pint",7.4749999999999996,null,3.7374999999999998,0,0,null,0,0,3.7374999999999998,0,373.75,0]
[null,"","Ethephon",21,null,"Ounce",0.39371875000000001,null,8.2680937500000002,0,0,null,0,0,8.2680937500000002,0,826.80937500000005,0]
[null,"Other Labor"]
[null,"","Unallocated Labor",0.88,null,"Hour",15,null,13.2,0,0,null,0,0,13.2,0,1320,0]
[null,null,null,0,null,null,0,null,0,0,0,null,0,0,0,0,0,0]
[null,null,null,0,null,null,0,null,0,0,0,null,0,0,0,0,0,0]
[null,null,null,0,null,null,0,null,0,{"$f":"E46*H46","v":0},0,null,0,{"$f":"J46*L46","v":0},0,{"$f":"+J46-N46","v":0},0,{"$f":"+J46*E$7","v":0}]
[null,"Irrigation"]
[null,null,"Water Cost",1.2000000000000002,null,"Acre/Foot",32.666666666666664,null,39.200000000000003,{"$f":"E48*H48","v":0},0,null,0,{"$f":"J48*L48","v":0},39.200000000000003,{"$f":"+J48-N48","v":0},3920.0000000000005,{"$f":"+J48*E$7","v":0}]
[null,null,"Irrigation Labor",3.3000000000000003,null,"Hour",17.5,null,57.750000000000007,0,0,null,0,0,57.750000000000007,0,5775.0000000000009,0]
[null,"Machinery Labor"]
[null,null,"Tractors/Self-Propelled",1.56,null,"Hour",17.21,null,26.847600000000003,{"$f":"E51*H51","v":0},0,null,0,{"$f":"J51*L51","v":0},26.847600000000003,{"$f":"+J51-N51","v":0},2684.76,{"$f":"+J51*E$7","v":0}]
[null,null,"Other Labor",0.36,null,"Hour",17.21,null,6.1955999999999998,{"$f":"E52*H52","v":0},0,null,0,{"$f":"J52*L52","v":0},6.1955999999999998,{"$f":"+J52-N52","v":0},619.55999999999995,{"$f":"+J52*E$7","v":0}]
[]
[null,"Diesel Fuel"]
[null,null,"Pickup/General Use Equipment",1,null,"Acre",0,null,0,{"$f":"E55*H55","v":0},0,null,0,{"$f":"J55*L55","v":0},0,{"$f":"+J55-N55","v":0},0,{"$f":"+J55*E$7","v":0}]
[null,null,"Tractors/Self-Propelled",9.34,null,"Gallon",2.2400000000000002,null,20.921600000000002,{"$f":"E56*H56","v":0},0,null,0,{"$f":"J56*L56","v":0},20.921600000000002,{"$f":"+J56-N56","v":0},2092.1600000000003,{"$f":"+J56*E$7","v":0}]
[]
[null,"Gasoline"]
[null,null,"Pickup/General Use Equipment",1,null,"Acre",0,null,0,{"$f":"E59*H59","v":0},0,null,0,{"$f":"J59*L59","v":0},0,{"$f":"+J59-N59","v":0},0,{"$f":"+J59*E$7","v":0}]
[null,null,"Tractors/Self-Propelled",0,null,"Gallon",2.09,null,0,{"$f":"E60*H60","v":0},0,null,0,{"$f":"J60*L60","v":0},0,{"$f":"+J60-N60","v":0},0,{"$f":"+J60*E$7","v":0}]
[]
[null,"Repairs & Maintenance"]
[null,null,"Pickup/General Use Equipment",1,null,"Acre",0,null,0,{"$f":"E63*H63","v":0},0,null,0,{"$f":"J63*L63","v":0},0,{"$f":"+J63-N63","v":0},0,{"$f":"+J63*E$7","v":0}]
[null,null,"Irrigation Equipment",1,null,"Acre",0,null,0,0,0,null,0,0,0,0,0,0]
[null,null,"Tractors/Self-Propelled",1,null,"Acre",16.873758957648555,null,16.873758957648555,0,0,null,0,0,16.873758957648555,0,1687.3758957648554,0]
[null,null,"Implements",1,null,"Acre",13.660362643365163,null,13.660362643365163,0,0,null,0,0,13.660362643365163,0,1366.0362643365163,0]
[null,null,null,null,null,null,null,null,0,0,0,null,0,0,0,0,0,0]
[null,null,null,null,null,null,null,null,0,0,0,null,0,0,0,0,0,0]
[null,"Interest on Credit Line",null,null,null,null,0.08,null,21.174146174507772,{"$f":"+SUM(J18:J68)/2*H69","v":0},null,null,0,{"$f":"+SUM(N18:N68)/2*L69","v":0},21.174146174507772,{"$f":"+SUM(P18:P68)/2*L69","v":0},2117.4146174507773,{"$f":"+J69*E$7","v":0}]
["Total Variable Costs",null,null,null,null,null,null,null,1015.0769193380216,{"$f":"SUM(J19:J69)","v":0},null,null,0,{"$f":"SUM(N19:N69)","v":0},1015.0769193380216,{"$f":"SUM(P19:P69)","v":0},101507.69193380214,{"$f":"SUM(R19:R69)","v":0}]
["Planned Returns Above Variable Costs:",null,null,null,null,null,null,null,430.32308066197845,{"$f":"+J14-J70","v":0},null,null,0,{"$f":"+N14-N70","v":0},430.32308066197845,{"$f":"+P14-P70","v":0},43032.30806619786,{"$f":"+R14-R70","v":0}]
[null,"Breakeven Price to Cover Variable Costs",null,null,null,null,0.55574153547041738,{"$f":"IF(E10=0,\"n/a\",(YVarExp-(YTotExp+YTotRet-J10))/E10)","v":"n/a"},"Pound"]
[null,null,null,null,null,null,null,null,null,null,null,null,null,null,null,null,"Enterprise","Enterprise"]
["FIXED COSTS",null,null,"Quantity","Quantity","Units","$/Unit","$/Unit","Total","Total","Share","Share","Landlord","Landlord","Tenant","Tenant","Total","Total"]
[null,"Machinery Depreciation"]
[null,null,"Tractors/Self-Propelled",1,null,"Acre",24.728001739944105,null,24.728001739944105,{"$f":"E76*H76","v":0},0,null,0,{"$f":"J76*L76","v":0},24.728001739944105,{"$f":"+J76-N76","v":0},2472.8001739944107,{"$f":"+J76*E$7","v":0}]
[null,null,"Implements",1,null,"Acre",16.625028390631844,null,16.625028390631844,0,0,null,0,{"$f":"J77*L77","v":0},16.625028390631844,0,1662.5028390631844,0]
[null,"Equipment Investment"]
[null,null,"Tractors/Self-Propelled",189.2510957932322,null,"Dollars",0.08,null,15.140087663458576,{"$f":"E79*H79","v":0},0,null,0,{"$f":"J79*L79","v":0},15.140087663458576,{"$f":"+J79-N79","v":0},1514.0087663458576,{"$f":"+J79*E$7","v":0}]
[null,null,"Implements",103.00216794163485,null,"Dollars",0.08,null,8.2401734353307887,0,0,null,0,{"$f":"J80*L80","v":0},8.2401734353307887,0,824.01734353307893,0]
[null,"Salaried Labor",null,1,null,"Acre",0,null,0,0,0,null,0,{"$f":"J81*L81","v":0},0,{"$f":"+J81-N81","v":0},0,{"$f":"+J81*E$7","v":0}]
[null,"Management Fee, Owner/Operator Labor",null,1,null,"Acre",0,null,0,0,0,null,0,0,0,0,0,0]
[null,"Allocated Establishment Cost",null,1,null,"Acre",0,null,0,0,0,null,0,0,0,0,0,0]
[null,"Cash Rent, Irrigated",null,1,null,"Acre",85,null,85,0,0,null,0,0,85,0,8500,0]
[null,"Property Taxes",null,1,null,"Acre",0,null,0,0,0,null,0,0,0,0,0,0]
[null,"Whole Farm Insurance",null,1,null,"Acre",0,null,0,0,0,null,0,0,0,0,0,0]
[null,null,null,1,null,null,0,null,0,0,0,null,0,0,0,0,0,0]
[null,null,null,1,null,null,0,null,0,{"$f":"E88*H88","v":0},0,null,0,0,0,0,0,0]
["Total Fixed Costs",null,null,null,null,null,null,null,149.73329122936531,{"$f":"+SUM(J76:J88)","v":0},null,null,0,{"$f":"+SUM(N76:N88)","v":0},149.73329122936531,{"$f":"+SUM(P76:P88)","v":0},14973.329122936531,{"$f":"+SUM(R76:R88)","v":0}]
["Total Specified Costs",null,null,null,null,null,null,null,1164.810210567387,{"$f":"+J70+J89","v":0},null,null,0,{"$f":"+N70+N89","v":0},1164.810210567387,{"$f":"+P70+P89","v":0},116481.02105673867,{"$f":"+R70+R89","v":0}]
[]
["Returns Above Specified Costs",null,null,null,null,null,null,null,280.58978943261309,{"$f":"+J14-J90","v":0},null,null,0,{"$f":"+N14-N90","v":0},280.58978943261309,{"$f":"+P14-P90","v":0},28058.978943261332,{"$f":"+R14-R90","v":0}]
[]
["    Breakeven Price to Cover Total Costs",null,null,null,null,null,0.67552816845390962,{"$f":"IF(E10=0,\"n/a\",(YTotExp-(YTotExp+YTotRet-J10))/E10)","v":"n/a"},"Pound"]
[]
[null,null,null,"Example Breakeven Prices"]
[null,"Example","Example","To Cover",null,null,"To Cover"]
[null,"Yield","Yield","Variable",null,null,"Total"]
[null,"Percent","Pound","Costs",null,null,"Costs"]
[null,0.75,937.5,0.74098871396055643,null,null,0.90070422460521282]
[null,0.9,1125,0.61749059496713032,null,null,0.75058685383767731]
[null,1,1250,0.55574153547041738,null,null,0.67552816845390962]
[null,1.1000000000000001,1375,0.5052195777003794,null,null,0.61411651677628143]
[null,1.25,1562.5,0.44459322837633386,null,null,0.54042253476312774]
[]
["  Developed by Samuel Zapata, Assistant Professor and Extension Economist, Texas A&M AgriLife Extension, 956-968-5581.  "]
[]
["Information presented is prepared solely as a general guide and not intended to recognize or predict the costs and returns from any one operation.  Brand names are mentioned only as examples and imply no endorsement."]

{"sheet":"CottonDryland","index":16,"n_rows":103,"n_cols":18,"rows_kept":103,"cut":false,"hidden":false,"merged":[[90,3,90,8],[102,0,102,11],[0,0,0,11],[1,0,1,11],[2,0,2,11],[3,0,3,11]]}
["Projections for Planning Purposes Only -- Not to be Used without Updating"]
["2023 Estimated Costs and Returns per Acre"]
["Cotton, Conventional Tillage, Dryland, Rio Grande Valley"]
["Enter your name for this budget in the cell above."]
["Enter  Your Values in the cells highlighed in MAROON."]
[null,null,null,null,"Your Acres",null,null,null,null,null,null,null,null,null,null,null,null,"Your"]
[null,null,"Crop Acres",100,null,null,null,null,null,null,null,"Your",null,null,null,null,"Enterprise","Enterprise"]
[null,null,null,null,"Your",null,null,"Your","Cash","Your","Landlord","Landlord",null,"Your",null,"Your","Total","Total"]
["REVENUE",null,null,"Quantity","Quantity","Units","$/Unit","$/Unit","Total","Total","Share","Share","Landlord","Landlord","Tenant","Tenant","(100 acres)",{"$f":"\"(\" & E7 & \" acres)\"","v":"( acres)"}]
[null,"Cotton Lint",null,720,null,"Pound",0.9,null,648,{"$f":"E10*H10","v":0},0,null,0,{"$f":"J10*L10","v":0},648,{"$f":"+J10-N10","v":0},64800,{"$f":"+J10*E$7","v":0}]
[null,"Cottonseed",null,0.51263999999999998,null,"Ton",360,null,184.5504,0,0,null,0,0,184.5504,{"$f":"+J11-N11","v":0},18455.04,0]
[null,null,null,0,null,null,0,null,0,0,0,null,0,0,0,0,0,0]
[null,null,null,0,null,null,0,null,0,0,0,null,0,0,0,0,0,0]
["Total Revenue",null,null,null,null,null,null,null,832.55039999999997,{"$f":"SUM(J10:J13)","v":0},null,null,0,{"$f":"SUM(N10:N13)","v":0},832.55039999999997,{"$f":"SUM(P10:P13)","v":0},83255.040000000008,{"$f":"SUM(R10:R13)","v":0}]
[null,null,null,null,null,null,null,null,null,null,null,null,null,null,null,null,"Enterprise","Enterprise"]
["VARIABLE COSTS",null,null,"Quantity","Quantity","Units","$/Unit","$/Unit","Total","Total","Share","Share","Landlord","Landlord","Tenant","Tenant","Total","Total"]
["Production Costs"]
[null,"Herbicide"]
[null,"","Trifluralin 4EC",2,null,"Pint",4.7475000000000005,null,9.495000000000001,{"$f":"E19*H19","v":0},0,null,0,{"$f":"J19*L19","v":0},9.495000000000001,{"$f":"+J19-N19","v":0},949.50000000000011,{"$f":"+J19*E$7","v":0}]
[null,"Seed"]
[null,"","Cotton Seed",30,null,"Thousand",1.641,null,49.230000000000004,0,0,null,0,0,49.230000000000004,0,4923,0]
[null,"Fertilizer"]
[null,"","UAN (32% N)",2.2599999999999998,null,"CWT",33.950000000000003,null,76.727000000000004,0,0,null,0,0,76.727000000000004,0,7672.7000000000007,0]
[null,"Custom"]
[null,"","Insect Scouting",1,null,"Acre",15,null,15,0,0,null,0,0,15,0,1500,0]
[null,"","Custon Harvest Cotton",720,null,"Pound",0.16500000000000001,null,118.80000000000001,0,0,null,0,0,118.80000000000001,0,11880.000000000002,0]
[null,"","Gin",720,null,"Pound",0.15,null,108,0,0,null,0,0,108,0,10800,0]
[null,"Miscellaneous"]
[null,"","Insurance, Cotton - Non-irrigated",1,null,"Acre",52,null,52,0,0,null,0,0,52,0,5200,0]
[null,"","BW Eradication Program - Dry",1,null,"Acre",14,null,14,0,0,null,0,0,14,0,1400,0]
[null,"Insecticide"]
[null,"","Transform",1,null,"Ounce",9.3433593750000004,null,9.3433593750000004,0,0,null,0,0,9.3433593750000004,0,934.3359375,0]
[null,"","Centric",2.5,null,"Ounce",5.95,null,14.875,0,0,null,0,0,14.875,0,1487.5,0]
[null,"","Sivanto",10.5,null,"Ounce",3.2808593749999999,null,34.449023437499996,0,0,null,0,0,34.449023437499996,0,3444.9023437499995,0]
[null,"Other Chemicals"]
[null,"","Thidiazuron",4,null,"Ounce",1.2210937500000001,null,4.8843750000000004,0,0,null,0,0,4.8843750000000004,0,488.43750000000006,0]
[null,"","Surfactant",0.25,null,"Pint",7.4749999999999996,null,1.8687499999999999,0,0,null,0,0,1.8687499999999999,0,186.875,0]
[null,"","Ethephon",21,null,"Ounce",0.39371875000000001,null,8.2680937500000002,0,0,null,0,0,8.2680937500000002,0,826.80937500000005,0]
[null,"","Mepiquat ",24,null,"Ounce",4.6875E-2,null,1.125,0,0,null,0,0,1.125,0,112.5,0]
[null,"Other Labor"]
[null,"","Unallocated Labor",1.2432000000000001,null,"Hour",15,null,18.648,0,0,null,0,0,18.648,0,1864.8,0]
[null,null,null,0,null,null,0,null,0,0,0,null,0,0,0,0,0,0]
[null,null,null,0,null,null,0,null,0,0,0,null,0,0,0,0,0,0]
[null,null,null,0,null,null,0,null,0,{"$f":"E44*H44","v":0},0,null,0,{"$f":"J44*L44","v":0},0,{"$f":"+J44-N44","v":0},0,{"$f":"+J44*E$7","v":0}]
[null,"Machinery Labor"]
[null,null,"Tractors/Self-Propelled",1.73,null,"Hour",17.21,null,29.773300000000003,{"$f":"E46*H46","v":0},0,null,0,{"$f":"J46*L46","v":0},29.773300000000003,{"$f":"+J46-N46","v":0},2977.3300000000004,{"$f":"+J46*E$7","v":0}]
[null,null,"Other Labor",0.35,null,"Hour",17.21,null,6.0235000000000003,{"$f":"E47*H47","v":0},0,null,0,{"$f":"J47*L47","v":0},6.0235000000000003,{"$f":"+J47-N47","v":0},602.35,{"$f":"+J47*E$7","v":0}]
[]
[null,"Diesel Fuel"]
[null,null,"Pickup/General Use Equipment",1,null,"Acre",0,null,0,{"$f":"E50*H50","v":0},0,null,0,{"$f":"J50*L50","v":0},0,{"$f":"+J50-N50","v":0},0,{"$f":"+J50*E$7","v":0}]
[null,null,"Tractors/Self-Propelled",13.1,null,"Gallon",2.2400000000000002,null,29.344000000000001,{"$f":"E51*H51","v":0},0,null,0,{"$f":"J51*L51","v":0},29.344000000000001,{"$f":"+J51-N51","v":0},2934.4,{"$f":"+J51*E$7","v":0}]
[]
[null,"Gasoline"]
[null,null,"Pickup/General Use Equipment",1,null,"Acre",0,null,0,{"$f":"E54*H54","v":0},0,null,0,{"$f":"J54*L54","v":0},0,{"$f":"+J54-N54","v":0},0,{"$f":"+J54*E$7","v":0}]
[null,null,"Tractors/Self-Propelled",0,null,"Gallon",2.09,null,0,{"$f":"E55*H55","v":0},0,null,0,{"$f":"J55*L55","v":0},0,{"$f":"+J55-N55","v":0},0,{"$f":"+J55*E$7","v":0}]
[]
[null,"Repairs & Maintenance"]
[null,null,"Pickup/General Use Equipment",1,null,"Acre",0,null,0,{"$f":"E58*H58","v":0},0,null,0,{"$f":"J58*L58","v":0},0,{"$f":"+J58-N58","v":0},0,{"$f":"+J58*E$7","v":0}]
[null,null,"Irrigation Equipment",1,null,"Acre",0,null,0,0,0,null,0,0,0,0,0,0]
[null,null,"Tractors/Self-Propelled",1,null,"Acre",27.490357883305904,null,27.490357883305904,0,0,null,0,0,27.490357883305904,0,2749.0357883305905,0]
[null,null,"Implements",1,null,"Acre",20.094655910023768,null,20.094655910023768,0,0,null,0,0,20.094655910023768,0,2009.4655910023769,0]
[null,null,null,null,null,null,null,null,0,0,0,null,0,0,0,0,0,0]
[null,null,null,null,null,null,null,null,0,0,0,null,0,0,0,0,0,0]
[null,"Interest on Credit Line",null,null,null,null,0.08,null,11.823179181351797,{"$f":"+SUM(J18:J63)/2*H64","v":0},null,null,0,{"$f":"+SUM(N18:N63)/2*L64","v":0},11.823179181351797,{"$f":"+SUM(P18:P63)/2*L64","v":0},1182.3179181351798,{"$f":"+J64*E$7","v":0}]
["Total Variable Costs",null,null,null,null,null,null,null,661.26259453718149,{"$f":"SUM(J19:J64)","v":0},null,null,0,{"$f":"SUM(N19:N64)","v":0},661.26259453718149,{"$f":"SUM(P19:P64)","v":0},66126.259453718158,{"$f":"SUM(R19:R64)","v":0}]
["Planned Returns Above Variable Costs:",null,null,null,null,null,null,null,171.28780546281848,{"$f":"+J14-J65","v":0},null,null,0,{"$f":"+N14-N65","v":0},171.28780546281848,{"$f":"+P14-P65","v":0},17128.780546281851,{"$f":"+R14-R65","v":0}]
[null,"Breakeven Price to Cover Variable Costs",null,null,null,null,0.66210027019052986,{"$f":"IF(E10=0,\"n/a\",(YVarExp-(YTotExp+YTotRet-J10))/E10)","v":"n/a"},"Pound"]
[null,null,null,null,null,null,null,null,null,null,null,null,null,null,null,null,"Enterprise","Enterprise"]
["FIXED COSTS",null,null,"Quantity","Quantity","Units","$/Unit","$/Unit","Total","Total","Share","Share","Landlord","Landlord","Tenant","Tenant","Total","Total"]
[null,"Machinery Depreciation"]
[null,null,"Tractors/Self-Propelled",1,null,"Acre",35.698487296456697,null,35.698487296456697,{"$f":"E71*H71","v":0},0,null,0,{"$f":"J71*L71","v":0},35.698487296456697,{"$f":"+J71-N71","v":0},3569.8487296456697,{"$f":"+J71*E$7","v":0}]
[null,null,"Implements",1,null,"Acre",24.476901652558453,null,24.476901652558453,0,0,null,0,{"$f":"J72*L72","v":0},24.476901652558453,0,2447.6901652558454,0]
[null,"Equipment Investment"]
[null,null,"Tractors/Self-Propelled",274.71471714477383,null,"Dollars",0.08,null,21.977177371581906,{"$f":"E74*H74","v":0},0,null,0,{"$f":"J74*L74","v":0},21.977177371581906,{"$f":"+J74-N74","v":0},2197.7177371581906,{"$f":"+J74*E$7","v":0}]
[null,null,"Implements",136.00371277969651,null,"Dollars",0.08,null,10.880297022375721,0,0,null,0,{"$f":"J75*L75","v":0},10.880297022375721,0,1088.0297022375721,0]
[null,"Salaried Labor",null,1,null,"Acre",0,null,0,0,0,null,0,{"$f":"J76*L76","v":0},0,{"$f":"+J76-N76","v":0},0,{"$f":"+J76*E$7","v":0}]
[null,"Management Fee, Owner/Operator Labor",null,1,null,"Acre",0,null,0,0,0,null,0,0,0,0,0,0]
[null,"Allocated Establishment Cost",null,1,null,"Acre",0,null,0,0,0,null,0,0,0,0,0,0]
[null,"Cash Rent, Dryland",null,1,null,"Acre",60,null,60,0,0,null,0,0,60,0,6000,0]
[null,"Property Taxes",null,1,null,"Acre",0,null,0,0,0,null,0,0,0,0,0,0]
[null,"Whole Farm Insurance",null,1,null,"Acre",0,null,0,0,0,null,0,0,0,0,0,0]
[null,null,null,1,null,null,0,null,0,0,0,null,0,0,0,0,0,0]
[null,null,null,1,null,null,0,null,0,{"$f":"E83*H83","v":0},0,null,0,0,0,0,0,0]
["Total Fixed Costs",null,null,null,null,null,null,null,153.03286334297277,{"$f":"+SUM(J71:J83)","v":0},null,null,0,{"$f":"+SUM(N71:N83)","v":0},153.03286334297277,{"$f":"+SUM(P71:P83)","v":0},15303.286334297278,{"$f":"+SUM(R71:R83)","v":0}]
["Total Specified Costs",null,null,null,null,null,null,null,814.29545788015423,{"$f":"+J65+J84","v":0},null,null,0,{"$f":"+N65+N84","v":0},814.29545788015423,{"$f":"+P65+P84","v":0},81429.545788015443,{"$f":"+R65+R84","v":0}]
[]
["Returns Above Specified Costs",null,null,null,null,null,null,null,18.254942119845737,{"$f":"+J14-J85","v":0},null,null,0,{"$f":"+N14-N85","v":0},18.254942119845737,{"$f":"+P14-P85","v":0},1825.4942119845655,{"$f":"+R14-R85","v":0}]
[]
["    Breakeven Price to Cover Total Costs",null,null,null,null,null,0.8746459137224365,{"$f":"IF(E10=0,\"n/a\",(YTotExp-(YTotExp+YTotRet-J10))/E10)","v":"n/a"},"Pound"]
[]
[null,null,null,"Example Breakeven Prices"]
[null,"Example","Example","To Cover",null,null,"To Cover"]
[null,"Yield","Yield","Variable",null,null,"Total"]
[null,"Percent","Pound","Costs",null,null,"Costs"]
[null,0.75,540,0.88280036025403985,null,null,1.1661945516299153]
[null,0.9,648,0.73566696687836652,null,null,0.97182879302492942]
[null,1,720,0.66210027019052986,null,null,0.8746459137224365]
[null,1.1000000000000001,792.00000000000011,0.60190933653684531,null,null,0.79513264883857848]
[null,1.25,900,0.52968021615242389,null,null,0.69971673097794918]
[]
["  Developed by Samuel Zapata, Assistant Professor and Extension Economist, Texas A&M AgriLife Extension, 956-968-5581.  "]
[]
["Information presented is prepared solely as a general guide and not intended to recognize or predict the costs and returns from any one operation.  Brand names are mentioned only as examples and imply no endorsement."]

{"sheet":"SorghumConventionalTill","index":17,"n_rows":95,"n_cols":18,"rows_kept":95,"cut":false,"hidden":false,"merged":[[82,3,82,8],[94,0,94,11],[0,0,0,11],[1,0,1,11],[2,0,2,11],[3,0,3,11]]}
["Projections for Planning Purposes Only -- Not to be Used without Updating"]
["2023 Estimated Costs and Returns per Acre"]
["Grain Sorghum, Conventional Tillage, Furrow Irrigated, Rio Grande Valley"]
["Enter your name for this budget in the cell above."]
["Enter  Your Values in the cells highlighed in MAROON."]
[null,null,null,null,"Your Acres",null,null,null,null,null,null,null,null,null,null,null,null,"Your"]
[null,null,"Crop Acres",100,null,null,null,null,null,null,null,"Your",null,null,null,null,"Enterprise","Enterprise"]
[null,null,null,null,"Your",null,null,"Your","Cash","Your","Landlord","Landlord",null,"Your",null,"Your","Total","Total"]
["REVENUE",null,null,"Quantity","Quantity","Units","$/Unit","$/Unit","Total","Total","Share","Share","Landlord","Landlord","Tenant","Tenant","(100 acres)",{"$f":"\"(\" & E7 & \" acres)\"","v":"( acres)"}]
[null,"Grain Sorghum       ",null,45,null,"CWT",10.36,null,466.2,{"$f":"E10*H10","v":0},0,null,0,{"$f":"J10*L10","v":0},466.2,{"$f":"+J10-N10","v":0},46620,{"$f":"+J10*E$7","v":0}]
[null,null,null,0,null,null,0,null,0,0,0,null,0,0,0,{"$f":"+J11-N11","v":0},0,0]
[null,null,null,0,null,null,0,null,0,0,0,null,0,0,0,0,0,0]
["Total Revenue",null,null,null,null,null,null,null,466.2,{"$f":"SUM(J10:J12)","v":0},null,null,0,{"$f":"SUM(N10:N12)","v":0},466.2,{"$f":"SUM(P10:P12)","v":0},46620,{"$f":"SUM(R10:R12)","v":0}]
[null,null,null,null,null,null,null,null,null,null,null,null,null,null,null,null,"Enterprise","Enterprise"]
["VARIABLE COSTS",null,null,"Quantity","Quantity","Units","$/Unit","$/Unit","Total","Total","Share","Share","Landlord","Landlord","Tenant","Tenant","Total","Total"]
["Production Costs"]
[null,"Herbicide"]
[null,"","AAtrex 4L",2,null,"Pint",2.8975,null,5.7949999999999999,{"$f":"E18*H18","v":0},0,null,0,{"$f":"J18*L18","v":0},5.7949999999999999,{"$f":"+J18-N18","v":0},579.5,{"$f":"+J18*E$7","v":0}]
[null,"Seed"]
[null,"","Grain Sorghum Seed",6,null,"Pound",3,null,18,0,0,null,0,0,18,0,1800,0]
[null,"Fertilizer"]
[null,"","UAN (32% N)",2.11,null,"CWT",33.950000000000003,null,71.634500000000003,0,0,null,0,0,71.634500000000003,0,7163.4500000000007,0]
[null,"Custom"]
[null,"","Harvest/Haul Sorghum",45,null,"CWT",0.97499999999999998,null,43.875,0,0,null,0,0,43.875,0,4387.5,0]
[null,"Miscellaneous"]
[null,"","Insurance, Sorghum - Irrigated",1,null,"Acre",14,null,14,0,0,null,0,0,14,0,1400,0]
[null,"Insecticide"]
[null,"","Transform",1,null,"Ounce",9.3433593750000004,null,9.3433593750000004,0,0,null,0,0,9.3433593750000004,0,934.3359375,0]
[null,"Other Labor"]
[null,"","Unallocated Labor",0.72319999999999995,null,"Hour",15,null,10.847999999999999,0,0,null,0,0,10.847999999999999,0,1084.8,0]
[null,null,null,0,null,null,0,null,0,0,0,null,0,0,0,0,0,0]
[null,null,null,0,null,null,0,null,0,0,0,null,0,0,0,0,0,0]
[null,null,null,0,null,null,0,null,0,{"$f":"E33*H33","v":0},0,null,0,{"$f":"J33*L33","v":0},0,{"$f":"+J33-N33","v":0},0,{"$f":"+J33*E$7","v":0}]
[null,"Irrigation"]
[null,null,"Water Cost",0.8,null,"Acre/Foot",41,null,32.800000000000004,{"$f":"E35*H35","v":0},0,null,0,{"$f":"J35*L35","v":0},32.800000000000004,{"$f":"+J35-N35","v":0},3280.0000000000005,{"$f":"+J35*E$7","v":0}]
[null,null,"Irrigation Labor",2.2000000000000002,null,"Hour",17.5,null,38.5,0,0,null,0,0,38.5,0,3850,0]
[null,"Machinery Labor"]
[null,null,"Tractors/Self-Propelled",1.68,null,"Hour",17.21,null,28.912800000000001,{"$f":"E38*H38","v":0},0,null,0,{"$f":"J38*L38","v":0},28.912800000000001,{"$f":"+J38-N38","v":0},2891.28,{"$f":"+J38*E$7","v":0}]
[null,null,"Other Labor",0,null,"Hour",17.21,null,0,{"$f":"E39*H39","v":0},0,null,0,{"$f":"J39*L39","v":0},0,{"$f":"+J39-N39","v":0},0,{"$f":"+J39*E$7","v":0}]
[]
[null,"Diesel Fuel"]
[null,null,"Pickup/General Use Equipment",1,null,"Acre",0,null,0,{"$f":"E42*H42","v":0},0,null,0,{"$f":"J42*L42","v":0},0,{"$f":"+J42-N42","v":0},0,{"$f":"+J42*E$7","v":0}]
[null,null,"Tractors/Self-Propelled",10.58,null,"Gallon",2.2400000000000002,null,23.699200000000001,{"$f":"E43*H43","v":0},0,null,0,{"$f":"J43*L43","v":0},23.699200000000001,{"$f":"+J43-N43","v":0},2369.92,{"$f":"+J43*E$7","v":0}]
[]
[null,"Gasoline"]
[null,null,"Pickup/General Use Equipment",1,null,"Acre",0,null,0,{"$f":"E46*H46","v":0},0,null,0,{"$f":"J46*L46","v":0},0,{"$f":"+J46-N46","v":0},0,{"$f":"+J46*E$7","v":0}]
[null,null,"Tractors/Self-Propelled",0,null,"Gallon",2.09,null,0,{"$f":"E47*H47","v":0},0,null,0,{"$f":"J47*L47","v":0},0,{"$f":"+J47-N47","v":0},0,{"$f":"+J47*E$7","v":0}]
[]
[null,"Repairs & Maintenance"]
[null,null,"Pickup/General Use Equipment",1,null,"Acre",0,null,0,{"$f":"E50*H50","v":0},0,null,0,{"$f":"J50*L50","v":0},0,{"$f":"+J50-N50","v":0},0,{"$f":"+J50*E$7","v":0}]
[null,null,"Irrigation Equipment",1,null,"Acre",0,null,0,0,0,null,0,0,0,0,0,0]
[null,null,"Tractors/Self-Propelled",1,null,"Acre",23.865332122443196,null,23.865332122443196,0,0,null,0,0,23.865332122443196,0,2386.5332122443197,0]
[null,null,"Implements",1,null,"Acre",19.627227212246805,null,19.627227212246805,0,0,null,0,0,19.627227212246805,0,1962.7227212246805,0]
[null,null,null,null,null,null,null,null,0,0,0,null,0,0,0,0,0,0]
[null,null,null,null,null,null,null,null,0,0,0,null,0,0,0,0,0,0]
[null,"Interest on Credit Line",null,null,null,null,0.08,null,10.525802280546516,{"$f":"+SUM(J17:J55)/2*H56","v":0},null,null,0,{"$f":"+SUM(N17:N55)/2*L56","v":0},10.525802280546516,{"$f":"+SUM(P17:P55)/2*L56","v":0},1052.5802280546516,{"$f":"+J56*E$7","v":0}]
["Total Variable Costs",null,null,null,null,null,null,null,351.42622099023657,{"$f":"SUM(J18:J56)","v":0},null,null,0,{"$f":"SUM(N18:N56)","v":0},351.42622099023657,{"$f":"SUM(P18:P56)","v":0},35142.622099023647,{"$f":"SUM(R18:R56)","v":0}]
["Planned Returns Above Variable Costs:",null,null,null,null,null,null,null,114.77377900976342,{"$f":"+J13-J57","v":0},null,null,0,{"$f":"+N13-N57","v":0},114.77377900976342,{"$f":"+P13-P57","v":0},11477.377900976353,{"$f":"+R13-R57","v":0}]
[null,"Breakeven Price to Cover Variable Costs",null,null,null,null,7.8094715775608128,{"$f":"IF(E10=0,\"n/a\",(YVarExp-(YTotExp+YTotRet-J10))/E10)","v":"n/a"},"CWT"]
[null,null,null,null,null,null,null,null,null,null,null,null,null,null,null,null,"Enterprise","Enterprise"]
["FIXED COSTS",null,null,"Quantity","Quantity","Units","$/Unit","$/Unit","Total","Total","Share","Share","Landlord","Landlord","Tenant","Tenant","Total","Total"]
[null,"Machinery Depreciation"]
[null,null,"Tractors/Self-Propelled",1,null,"Acre",24.660843193191305,null,24.660843193191305,{"$f":"E63*H63","v":0},0,null,0,{"$f":"J63*L63","v":0},24.660843193191305,{"$f":"+J63-N63","v":0},2466.0843193191304,{"$f":"+J63*E$7","v":0}]
[null,null,"Implements",1,null,"Acre",23.516325234456453,null,23.516325234456453,0,0,null,0,{"$f":"J64*L64","v":0},23.516325234456453,0,2351.6325234456453,0]
[null,"Equipment Investment"]
[null,null,"Tractors/Self-Propelled",192.11592358566773,null,"Dollars",0.08,null,15.369273886853419,{"$f":"E66*H66","v":0},0,null,0,{"$f":"J66*L66","v":0},15.369273886853419,{"$f":"+J66-N66","v":0},1536.9273886853418,{"$f":"+J66*E$7","v":0}]
[null,null,"Implements",109.06216384527578,null,"Dollars",0.08,null,8.7249731076220627,0,0,null,0,{"$f":"J67*L67","v":0},8.7249731076220627,0,872.49731076220633,0]
[null,"Salaried Labor",null,1,null,"Acre",0,null,0,0,0,null,0,{"$f":"J68*L68","v":0},0,{"$f":"+J68-N68","v":0},0,{"$f":"+J68*E$7","v":0}]
[null,"Management Fee, Owner/Operator Labor",null,1,null,"Acre",0,null,0,0,0,null,0,0,0,0,0,0]
[null,"Allocated Establishment Cost",null,1,null,"Acre",0,null,0,0,0,null,0,0,0,0,0,0]
[null,"Cash Rent, Irrigated",null,1,null,"Acre",85,null,85,0,0,null,0,0,85,0,8500,0]
[null,"Property Taxes",null,1,null,"Acre",0,null,0,0,0,null,0,0,0,0,0,0]
[null,"Whole Farm Insurance",null,1,null,"Acre",0,null,0,0,0,null,0,0,0,0,0,0]
[null,null,null,1,null,null,0,null,0,0,0,null,0,0,0,0,0,0]
[null,null,null,1,null,null,0,null,0,{"$f":"E75*H75","v":0},0,null,0,0,0,0,0,0]
["Total Fixed Costs",null,null,null,null,null,null,null,157.27141542212325,{"$f":"+SUM(J63:J75)","v":0},null,null,0,{"$f":"+SUM(N63:N75)","v":0},157.27141542212325,{"$f":"+SUM(P63:P75)","v":0},15727.141542212325,{"$f":"+SUM(R63:R75)","v":0}]
["Total Specified Costs",null,null,null,null,null,null,null,508.69763641235983,{"$f":"+J57+J76","v":0},null,null,0,{"$f":"+N57+N76","v":0},508.69763641235983,{"$f":"+P57+P76","v":0},50869.763641235972,{"$f":"+R57+R76","v":0}]
[]
["Returns Above Specified Costs",null,null,null,null,null,null,null,-42.497636412359839,{"$f":"+J13-J77","v":0},null,null,0,{"$f":"+N13-N77","v":0},-42.497636412359839,{"$f":"+P13-P77","v":0},-4249.7636412359716,{"$f":"+R13-R77","v":0}]
[]
["    Breakeven Price to Cover Total Costs",null,null,null,null,null,11.304391920274663,{"$f":"IF(E10=0,\"n/a\",(YTotExp-(YTotExp+YTotRet-J10))/E10)","v":"n/a"},"CWT"]
[]
[null,null,null,"Example Breakeven Prices"]
[null,"Example","Example","To Cover",null,null,"To Cover"]
[null,"Yield","Yield","Variable",null,null,"Total"]
[null,"Percent","CWT","Costs",null,null,"Costs"]
[null,0.75,33.75,10.412628770081083,null,null,15.072522560366217]
[null,0.9,40.5,8.6771906417342368,null,null,12.560435466971848]
[null,1,45,7.8094715775608128,null,null,11.304391920274663]
[null,1.1000000000000001,49.500000000000007,7.0995196159643745,null,null,10.27671992752242]
[null,1.25,56.25,6.24757726204865,null,null,9.0435135362197308]
[]
["  Developed by Samuel Zapata, Assistant Professor and Extension Economist, Texas A&M AgriLife Extension, 956-968-5581.  "]
[]
["Information presented is prepared solely as a general guide and not intended to recognize or predict the costs and returns from any one operation.  Brand names are mentioned only as examples and imply no endorsement."]

{"sheet":"SorghumReducedTill","index":18,"n_rows":96,"n_cols":18,"rows_kept":96,"cut":false,"hidden":false,"merged":[[83,3,83,8],[95,0,95,11],[0,0,0,11],[1,0,1,11],[2,0,2,11],[3,0,3,11]]}
["Projections for Planning Purposes Only -- Not to be Used without Updating"]
["2023 Estimated Costs and Returns per Acre"]
["Grain Sorghum, Reduced Tillage, Furrow Irrigated, Rio Grande Valley"]
["Enter your name for this budget in the cell above."]
["Enter  Your Values in the cells highlighed in MAROON."]
[null,null,null,null,"Your Acres",null,null,null,null,null,null,null,null,null,null,null,null,"Your"]
[null,null,"Crop Acres",100,null,null,null,null,null,null,null,"Your",null,null,null,null,"Enterprise","Enterprise"]
[null,null,null,null,"Your",null,null,"Your","Cash","Your","Landlord","Landlord",null,"Your",null,"Your","Total","Total"]
["REVENUE",null,null,"Quantity","Quantity","Units","$/Unit","$/Unit","Total","Total","Share","Share","Landlord","Landlord","Tenant","Tenant","(100 acres)",{"$f":"\"(\" & E7 & \" acres)\"","v":"( acres)"}]
[null,"Grain Sorghum       ",null,45,null,"CWT",10.36,null,466.2,{"$f":"E10*H10","v":0},0,null,0,{"$f":"J10*L10","v":0},466.2,{"$f":"+J10-N10","v":0},46620,{"$f":"+J10*E$7","v":0}]
[null,null,null,0,null,null,0,null,0,0,0,null,0,0,0,{"$f":"+J11-N11","v":0},0,0]
[null,null,null,0,null,null,0,null,0,0,0,null,0,0,0,0,0,0]
["Total Revenue",null,null,null,null,null,null,null,466.2,{"$f":"SUM(J10:J12)","v":0},null,null,0,{"$f":"SUM(N10:N12)","v":0},466.2,{"$f":"SUM(P10:P12)","v":0},46620,{"$f":"SUM(R10:R12)","v":0}]
[null,null,null,null,null,null,null,null,null,null,null,null,null,null,null,null,"Enterprise","Enterprise"]
["VARIABLE COSTS",null,null,"Quantity","Quantity","Units","$/Unit","$/Unit","Total","Total","Share","Share","Landlord","Landlord","Tenant","Tenant","Total","Total"]
["Production Costs"]
[null,"Seed"]
[null,"","Grain Sorghum Seed",6,null,"Pound",3,null,18,{"$f":"E18*H18","v":0},0,null,0,{"$f":"J18*L18","v":0},18,{"$f":"+J18-N18","v":0},1800,{"$f":"+J18*E$7","v":0}]
[null,"Fertilizer"]
[null,"","UAN (32% N)",2.11,null,"CWT",33.950000000000003,null,71.634500000000003,0,0,null,0,0,71.634500000000003,0,7163.4500000000007,0]
[null,"Custom"]
[null,"","Harvest/Haul Sorghum",45,null,"CWT",0.97499999999999998,null,43.875,0,0,null,0,0,43.875,0,4387.5,0]
[null,"Herbicide"]
[null,"","Glyphosate",2,null,"Pint",6.25,null,12.5,0,0,null,0,0,12.5,0,1250,0]
[null,"","AAtrex 4L",2,null,"Pint",2.8975,null,5.7949999999999999,0,0,null,0,0,5.7949999999999999,0,579.5,0]
[null,"Insecticide"]
[null,"","Transform",1,null,"Ounce",9.3433593750000004,null,9.3433593750000004,0,0,null,0,0,9.3433593750000004,0,934.3359375,0]
[null,"Miscellaneous"]
[null,"","Insurance, Sorghum - Irrigated",1,null,"Acre",14,null,14,0,0,null,0,0,14,0,1400,0]
[null,"Other Labor"]
[null,"","Unallocated Labor",0.22,null,"Hour",15,null,3.3,0,0,null,0,0,3.3,0,330,0]
[null,null,null,0,null,null,0,null,0,0,0,null,0,0,0,0,0,0]
[null,null,null,0,null,null,0,null,0,0,0,null,0,0,0,0,0,0]
[null,null,null,0,null,null,0,null,0,{"$f":"E34*H34","v":0},0,null,0,{"$f":"J34*L34","v":0},0,{"$f":"+J34-N34","v":0},0,{"$f":"+J34*E$7","v":0}]
[null,"Irrigation"]
[null,null,"Water Cost",0.8,null,"Acre/Foot",41,null,32.800000000000004,{"$f":"E36*H36","v":0},0,null,0,{"$f":"J36*L36","v":0},32.800000000000004,{"$f":"+J36-N36","v":0},3280.0000000000005,{"$f":"+J36*E$7","v":0}]
[null,null,"Irrigation Labor",2.2000000000000002,null,"Hour",17.5,null,38.5,0,0,null,0,0,38.5,0,3850,0]
[null,"Machinery Labor"]
[null,null,"Tractors/Self-Propelled",0.97,null,"Hour",17.21,null,16.6937,{"$f":"E39*H39","v":0},0,null,0,{"$f":"J39*L39","v":0},16.6937,{"$f":"+J39-N39","v":0},1669.37,{"$f":"+J39*E$7","v":0}]
[null,null,"Other Labor",0,null,"Hour",17.21,null,0,{"$f":"E40*H40","v":0},0,null,0,{"$f":"J40*L40","v":0},0,{"$f":"+J40-N40","v":0},0,{"$f":"+J40*E$7","v":0}]
[]
[null,"Diesel Fuel"]
[null,null,"Pickup/General Use Equipment",1,null,"Acre",0,null,0,{"$f":"E43*H43","v":0},0,null,0,{"$f":"J43*L43","v":0},0,{"$f":"+J43-N43","v":0},0,{"$f":"+J43*E$7","v":0}]
[null,null,"Tractors/Self-Propelled",4.95,null,"Gallon",2.2400000000000002,null,11.088000000000001,{"$f":"E44*H44","v":0},0,null,0,{"$f":"J44*L44","v":0},11.088000000000001,{"$f":"+J44-N44","v":0},1108.8000000000002,{"$f":"+J44*E$7","v":0}]
[]
[null,"Gasoline"]
[null,null,"Pickup/General Use Equipment",1,null,"Acre",0,null,0,{"$f":"E47*H47","v":0},0,null,0,{"$f":"J47*L47","v":0},0,{"$f":"+J47-N47","v":0},0,{"$f":"+J47*E$7","v":0}]
[null,null,"Tractors/Self-Propelled",0,null,"Gallon",2.09,null,0,{"$f":"E48*H48","v":0},0,null,0,{"$f":"J48*L48","v":0},0,{"$f":"+J48-N48","v":0},0,{"$f":"+J48*E$7","v":0}]
[]
[null,"Repairs & Maintenance"]
[null,null,"Pickup/General Use Equipment",1,null,"Acre",0,null,0,{"$f":"E51*H51","v":0},0,null,0,{"$f":"J51*L51","v":0},0,{"$f":"+J51-N51","v":0},0,{"$f":"+J51*E$7","v":0}]
[null,null,"Irrigation Equipment",1,null,"Acre",0,null,0,0,0,null,0,0,0,0,0,0]
[null,null,"Tractors/Self-Propelled",1,null,"Acre",9.600117120913545,null,9.600117120913545,0,0,null,0,0,9.600117120913545,0,960.01171209135453,0]
[null,null,"Implements",1,null,"Acre",10.547148994589918,null,10.547148994589918,0,0,null,0,0,10.547148994589918,0,1054.7148994589918,0]
[null,null,null,null,null,null,null,null,0,0,0,null,0,0,0,0,0,0]
[null,null,null,null,null,null,null,null,0,0,0,null,0,0,0,0,0,0]
[null,"Interest on Credit Line",null,null,null,null,0.08,null,7.5866927912681872,{"$f":"+SUM(J17:J56)/2*H57","v":0},null,null,0,{"$f":"+SUM(N17:N56)/2*L57","v":0},7.5866927912681872,{"$f":"+SUM(P17:P56)/2*L57","v":0},758.66927912681876,{"$f":"+J57*E$7","v":0}]
["Total Variable Costs",null,null,null,null,null,null,null,305.26351828177167,{"$f":"SUM(J18:J57)","v":0},null,null,0,{"$f":"SUM(N18:N57)","v":0},305.26351828177167,{"$f":"SUM(P18:P57)","v":0},30526.351828177161,{"$f":"SUM(R18:R57)","v":0}]
["Planned Returns Above Variable Costs:",null,null,null,null,null,null,null,160.93648171822832,{"$f":"+J13-J58","v":0},null,null,0,{"$f":"+N13-N58","v":0},160.93648171822832,{"$f":"+P13-P58","v":0},16093.648171822839,{"$f":"+R13-R58","v":0}]
[null,"Breakeven Price to Cover Variable Costs",null,null,null,null,6.7836337395949258,{"$f":"IF(E10=0,\"n/a\",(YVarExp-(YTotExp+YTotRet-J10))/E10)","v":"n/a"},"CWT"]
[null,null,null,null,null,null,null,null,null,null,null,null,null,null,null,null,"Enterprise","Enterprise"]
["FIXED COSTS",null,null,"Quantity","Quantity","Units","$/Unit","$/Unit","Total","Total","Share","Share","Landlord","Landlord","Tenant","Tenant","Total","Total"]
[null,"Machinery Depreciation"]
[null,null,"Tractors/Self-Propelled",1,null,"Acre",10.961804474997415,null,10.961804474997415,{"$f":"E64*H64","v":0},0,null,0,{"$f":"J64*L64","v":0},10.961804474997415,{"$f":"+J64-N64","v":0},1096.1804474997414,{"$f":"+J64*E$7","v":0}]
[null,null,"Implements",1,null,"Acre",12.656846951171474,null,12.656846951171474,0,0,null,0,{"$f":"J65*L65","v":0},12.656846951171474,0,1265.6846951171474,0]
[null,"Equipment Investment"]
[null,null,"Tractors/Self-Propelled",84.911990849662786,null,"Dollars",0.08,null,6.7929592679730231,{"$f":"E67*H67","v":0},0,null,0,{"$f":"J67*L67","v":0},6.7929592679730231,{"$f":"+J67-N67","v":0},679.29592679730229,{"$f":"+J67*E$7","v":0}]
[null,null,"Implements",63.00590551306999,null,"Dollars",0.08,null,5.0404724410455994,0,0,null,0,{"$f":"J68*L68","v":0},5.0404724410455994,0,504.04724410455992,0]
[null,"Salaried Labor",null,1,null,"Acre",0,null,0,0,0,null,0,{"$f":"J69*L69","v":0},0,{"$f":"+J69-N69","v":0},0,{"$f":"+J69*E$7","v":0}]
[null,"Management Fee, Owner/Operator Labor",null,1,null,"Acre",0,null,0,0,0,null,0,0,0,0,0,0]
[null,"Allocated Establishment Cost",null,1,null,"Acre",0,null,0,0,0,null,0,0,0,0,0,0]
[null,"Cash Rent, Irrigated",null,1,null,"Acre",85,null,85,0,0,null,0,0,85,0,8500,0]
[null,"Property Taxes",null,1,null,"Acre",0,null,0,0,0,null,0,0,0,0,0,0]
[null,"Whole Farm Insurance",null,1,null,"Acre",0,null,0,0,0,null,0,0,0,0,0,0]
[null,null,null,1,null,null,0,null,0,0,0,null,0,0,0,0,0,0]
[null,null,null,1,null,null,0,null,0,{"$f":"E76*H76","v":0},0,null,0,0,0,0,0,0]
["Total Fixed Costs",null,null,null,null,null,null,null,120.45208313518751,{"$f":"+SUM(J64:J76)","v":0},null,null,0,{"$f":"+SUM(N64:N76)","v":0},120.45208313518751,{"$f":"+SUM(P64:P76)","v":0},12045.208313518751,{"$f":"+SUM(R64:R76)","v":0}]
["Total Specified Costs",null,null,null,null,null,null,null,425.7156014169592,{"$f":"+J58+J77","v":0},null,null,0,{"$f":"+N58+N77","v":0},425.7156014169592,{"$f":"+P58+P77","v":0},42571.560141695911,{"$f":"+R58+R77","v":0}]
[]
["Returns Above Specified Costs",null,null,null,null,null,null,null,40.484398583040786,{"$f":"+J13-J78","v":0},null,null,0,{"$f":"+N13-N78","v":0},40.484398583040786,{"$f":"+P13-P78","v":0},4048.4398583040893,{"$f":"+R13-R78","v":0}]
[]
["    Breakeven Price to Cover Total Costs",null,null,null,null,null,9.4603466981546482,{"$f":"IF(E10=0,\"n/a\",(YTotExp-(YTotExp+YTotRet-J10))/E10)","v":"n/a"},"CWT"]
[]
[null,null,null,"Example Breakeven Prices"]
[null,"Example","Example","To Cover",null,null,"To Cover"]
[null,"Yield","Yield","Variable",null,null,"Total"]
[null,"Percent","CWT","Costs",null,null,"Costs"]
[null,0.75,33.75,9.0448449861265683,null,null,12.613795597539532]
[null,0.9,40.5,7.5373708217721402,null,null,10.511496331282943]
[null,1,45,6.7836337395949258,null,null,9.4603466981546482]
[null,1.1000000000000001,49.500000000000007,6.1669397632681138,null,null,8.6003151801405888]
[null,1.25,56.25,5.4269069916759411,null,null,7.5682773585237193]
[]
["  Developed by Samuel Zapata, Assistant Professor and Extension Economist, Texas A&M AgriLife Extension, 956-968-5581.  "]
[]
["Information presented is prepared solely as a general guide and not intended to recognize or predict the costs and returns from any one operation.  Brand names are mentioned only as examples and imply no endorsement."]

{"sheet":"SorghumDryland","index":19,"n_rows":90,"n_cols":18,"rows_kept":90,"cut":false,"hidden":false,"merged":[[77,3,77,8],[89,0,89,11],[0,0,0,11],[1,0,1,11],[2,0,2,11],[3,0,3,11]]}
["Projections for Planning Purposes Only -- Not to be Used without Updating"]
["2023 Estimated Costs and Returns per Acre"]
["Grain Sorghum, Conventional Tillage, Dryland, Rio Grande Valley"]
["Enter your name for this budget in the cell above."]
["Enter  Your Values in the cells highlighed in MAROON."]
[null,null,null,null,"Your Acres",null,null,null,null,null,null,null,null,null,null,null,null,"Your"]
[null,null,"Crop Acres",100,null,null,null,null,null,null,null,"Your",null,null,null,null,"Enterprise","Enterprise"]
[null,null,null,null,"Your",null,null,"Your","Cash","Your","Landlord","Landlord",null,"Your",null,"Your","Total","Total"]
["REVENUE",null,null,"Quantity","Quantity","Units","$/Unit","$/Unit","Total","Total","Share","Share","Landlord","Landlord","Tenant","Tenant","(100 acres)",{"$f":"\"(\" & E7 & \" acres)\"","v":"( acres)"}]
[null,"Grain Sorghum       ",null,30,null,"CWT",10.36,null,310.79999999999995,{"$f":"E10*H10","v":0},0,null,0,{"$f":"J10*L10","v":0},310.79999999999995,{"$f":"+J10-N10","v":0},31079.999999999996,{"$f":"+J10*E$7","v":0}]
[null,null,null,0,null,null,0,null,0,0,0,null,0,0,0,{"$f":"+J11-N11","v":0},0,0]
[null,null,null,0,null,null,0,null,0,0,0,null,0,0,0,0,0,0]
["Total Revenue",null,null,null,null,null,null,null,310.79999999999995,{"$f":"SUM(J10:J12)","v":0},null,null,0,{"$f":"SUM(N10:N12)","v":0},310.79999999999995,{"$f":"SUM(P10:P12)","v":0},31079.999999999996,{"$f":"SUM(R10:R12)","v":0}]
[null,null,null,null,null,null,null,null,null,null,null,null,null,null,null,null,"Enterprise","Enterprise"]
["VARIABLE COSTS",null,null,"Quantity","Quantity","Units","$/Unit","$/Unit","Total","Total","Share","Share","Landlord","Landlord","Tenant","Tenant","Total","Total"]
["Production Costs"]
[null,"Herbicide"]
[null,"","AAtrex 4L",2,null,"Pint",2.8975,null,5.7949999999999999,{"$f":"E18*H18","v":0},0,null,0,{"$f":"J18*L18","v":0},5.7949999999999999,{"$f":"+J18-N18","v":0},579.5,{"$f":"+J18*E$7","v":0}]
[null,"Seed"]
[null,"","Grain Sorghum Seed",4.5,null,"Pound",3,null,13.5,0,0,null,0,0,13.5,0,1350,0]
[null,"Fertilizer"]
[null,"","UAN (32% N)",1.41,null,"CWT",33.950000000000003,null,47.869500000000002,0,0,null,0,0,47.869500000000002,0,4786.95,0]
[null,"Custom"]
[null,"","Harvest/Haul Sorghum",30,null,"CWT",0.97499999999999998,null,29.25,0,0,null,0,0,29.25,0,2925,0]
[null,"Miscellaneous"]
[null,"","Insurance, Sorghum - Dryland",1,null,"acre",13,null,13,0,0,null,0,0,13,0,1300,0]
[null,"Other Labor"]
[null,"","Unallocated Labor",0.70720000000000005,null,"Hour",15,null,10.608000000000001,0,0,null,0,0,10.608000000000001,0,1060.8,0]
[null,null,null,0,null,null,0,null,0,0,0,null,0,0,0,0,0,0]
[null,null,null,0,null,null,0,null,0,0,0,null,0,0,0,0,0,0]
[null,null,null,0,null,null,0,null,0,{"$f":"E31*H31","v":0},0,null,0,{"$f":"J31*L31","v":0},0,{"$f":"+J31-N31","v":0},0,{"$f":"+J31*E$7","v":0}]
[null,"Machinery Labor"]
[null,null,"Tractors/Self-Propelled",1.42,null,"Hour",17.21,null,24.438199999999998,{"$f":"E33*H33","v":0},0,null,0,{"$f":"J33*L33","v":0},24.438199999999998,{"$f":"+J33-N33","v":0},2443.8199999999997,{"$f":"+J33*E$7","v":0}]
[null,null,"Other Labor",0,null,"Hour",17.21,null,0,{"$f":"E34*H34","v":0},0,null,0,{"$f":"J34*L34","v":0},0,{"$f":"+J34-N34","v":0},0,{"$f":"+J34*E$7","v":0}]
[]
[null,"Diesel Fuel"]
[null,null,"Pickup/General Use Equipment",1,null,"Acre",0,null,0,{"$f":"E37*H37","v":0},0,null,0,{"$f":"J37*L37","v":0},0,{"$f":"+J37-N37","v":0},0,{"$f":"+J37*E$7","v":0}]
[null,null,"Tractors/Self-Propelled",8.64,null,"Gallon",2.2400000000000002,null,19.353600000000004,{"$f":"E38*H38","v":0},0,null,0,{"$f":"J38*L38","v":0},19.353600000000004,{"$f":"+J38-N38","v":0},1935.3600000000004,{"$f":"+J38*E$7","v":0}]
[]
[null,"Gasoline"]
[null,null,"Pickup/General Use Equipment",1,null,"Acre",0,null,0,{"$f":"E41*H41","v":0},0,null,0,{"$f":"J41*L41","v":0},0,{"$f":"+J41-N41","v":0},0,{"$f":"+J41*E$7","v":0}]
[null,null,"Tractors/Self-Propelled",0,null,"Gallon",2.09,null,0,{"$f":"E42*H42","v":0},0,null,0,{"$f":"J42*L42","v":0},0,{"$f":"+J42-N42","v":0},0,{"$f":"+J42*E$7","v":0}]
[]
[null,"Repairs & Maintenance"]
[null,null,"Pickup/General Use Equipment",1,null,"Acre",0,null,0,{"$f":"E45*H45","v":0},0,null,0,{"$f":"J45*L45","v":0},0,{"$f":"+J45-N45","v":0},0,{"$f":"+J45*E$7","v":0}]
[null,null,"Irrigation Equipment",1,null,"Acre",0,null,0,0,0,null,0,0,0,0,0,0]
[null,null,"Tractors/Self-Propelled",1,null,"Acre",19.453095933485294,null,19.453095933485294,0,0,null,0,0,19.453095933485294,0,1945.3095933485295,0]
[null,null,"Implements",1,null,"Acre",17.194846582691937,null,17.194846582691937,0,0,null,0,0,17.194846582691937,0,1719.4846582691937,0]
[null,null,null,null,null,null,null,null,0,0,0,null,0,0,0,0,0,0]
[null,null,null,null,null,null,null,null,0,0,0,null,0,0,0,0,0,0]
[null,"Interest on Credit Line",null,null,null,null,0.08,null,6.4581890733086684,{"$f":"+SUM(J17:J50)/2*H51","v":0},null,null,0,{"$f":"+SUM(N17:N50)/2*L51","v":0},6.4581890733086684,{"$f":"+SUM(P17:P50)/2*L51","v":0},645.81890733086686,{"$f":"+J51*E$7","v":0}]
["Total Variable Costs",null,null,null,null,null,null,null,206.9204315894859,{"$f":"SUM(J18:J51)","v":0},null,null,0,{"$f":"SUM(N18:N51)","v":0},206.9204315894859,{"$f":"SUM(P18:P51)","v":0},20692.043158948592,{"$f":"SUM(R18:R51)","v":0}]
["Planned Returns Above Variable Costs:",null,null,null,null,null,null,null,103.87956841051405,{"$f":"+J13-J52","v":0},null,null,0,{"$f":"+N13-N52","v":0},103.87956841051405,{"$f":"+P13-P52","v":0},10387.956841051404,{"$f":"+R13-R52","v":0}]
[null,"Breakeven Price to Cover Variable Costs",null,null,null,null,6.8973477196495301,{"$f":"IF(E10=0,\"n/a\",(YVarExp-(YTotExp+YTotRet-J10))/E10)","v":"n/a"},"CWT"]
[null,null,null,null,null,null,null,null,null,null,null,null,null,null,null,null,"Enterprise","Enterprise"]
["FIXED COSTS",null,null,"Quantity","Quantity","Units","$/Unit","$/Unit","Total","Total","Share","Share","Landlord","Landlord","Tenant","Tenant","Total","Total"]
[null,"Machinery Depreciation"]
[null,null,"Tractors/Self-Propelled",1,null,"Acre",20.101532464601473,null,20.101532464601473,{"$f":"E58*H58","v":0},0,null,0,{"$f":"J58*L58","v":0},20.101532464601473,{"$f":"+J58-N58","v":0},2010.1532464601473,{"$f":"+J58*E$7","v":0}]
[null,null,"Implements",1,null,"Acre",20.707149527027077,null,20.707149527027077,0,0,null,0,{"$f":"J59*L59","v":0},20.707149527027077,0,2070.7149527027077,0]
[null,"Equipment Investment"]
[null,null,"Tractors/Self-Propelled",156.5974222645566,null,"Dollars",0.08,null,12.527793781164528,{"$f":"E61*H61","v":0},0,null,0,{"$f":"J61*L61","v":0},12.527793781164528,{"$f":"+J61-N61","v":0},1252.7793781164528,{"$f":"+J61*E$7","v":0}]
[null,null,"Implements",96.856286860716779,null,"Dollars",0.08,null,7.7485029488573423,0,0,null,0,{"$f":"J62*L62","v":0},7.7485029488573423,0,774.85029488573423,0]
[null,"Salaried Labor",null,1,null,"Acre",0,null,0,0,0,null,0,{"$f":"J63*L63","v":0},0,{"$f":"+J63-N63","v":0},0,{"$f":"+J63*E$7","v":0}]
[null,"Management Fee, Owner/Operator Labor",null,1,null,"Acre",0,null,0,0,0,null,0,0,0,0,0,0]
[null,"Allocated Establishment Cost",null,1,null,"Acre",0,null,0,0,0,null,0,0,0,0,0,0]
[null,"Cash Rent, Dryland",null,1,null,"Acre",60,null,60,0,0,null,0,0,60,0,6000,0]
[null,"Property Taxes",null,1,null,"Acre",0,null,0,0,0,null,0,0,0,0,0,0]
[null,"Whole Farm Insurance",null,1,null,"Acre",0,null,0,0,0,null,0,0,0,0,0,0]
[null,null,null,1,null,null,0,null,0,0,0,null,0,0,0,0,0,0]
[null,null,null,1,null,null,0,null,0,{"$f":"E70*H70","v":0},0,null,0,0,0,0,0,0]
["Total Fixed Costs",null,null,null,null,null,null,null,121.08497872165042,{"$f":"+SUM(J58:J70)","v":0},null,null,0,{"$f":"+SUM(N58:N70)","v":0},121.08497872165042,{"$f":"+SUM(P58:P70)","v":0},12108.49787216504,{"$f":"+SUM(R58:R70)","v":0}]
["Total Specified Costs",null,null,null,null,null,null,null,328.0054103111363,{"$f":"+J52+J71","v":0},null,null,0,{"$f":"+N52+N71","v":0},328.0054103111363,{"$f":"+P52+P71","v":0},32800.541031113637,{"$f":"+R52+R71","v":0}]
[]
["Returns Above Specified Costs",null,null,null,null,null,null,null,-17.205410311136347,{"$f":"+J13-J72","v":0},null,null,0,{"$f":"+N13-N72","v":0},-17.205410311136347,{"$f":"+P13-P72","v":0},-1720.5410311136402,{"$f":"+R13-R72","v":0}]
[]
["    Breakeven Price to Cover Total Costs",null,null,null,null,null,10.933513677037876,{"$f":"IF(E10=0,\"n/a\",(YTotExp-(YTotExp+YTotRet-J10))/E10)","v":"n/a"},"CWT"]
[]
[null,null,null,"Example Breakeven Prices"]
[null,"Example","Example","To Cover",null,null,"To Cover"]
[null,"Yield","Yield","Variable",null,null,"Total"]
[null,"Percent","CWT","Costs",null,null,"Costs"]
[null,0.75,22.5,9.1964636261993729,null,null,14.578018236050502]
[null,0.9,27,7.6637196884994774,null,null,12.148348530042085]
[null,1,30,6.8973477196495301,null,null,10.933513677037876]
[null,1.1000000000000001,33,6.2703161087722998,null,null,9.9395578882162514]
[null,1.25,37.5,5.5178781757196242,null,null,8.7468109416303008]
[]
["  Developed by Samuel Zapata, Assistant Professor and Extension Economist, Texas A&M AgriLife Extension, 956-968-5581.  "]
[]
["Information presented is prepared solely as a general guide and not intended to recognize or predict the costs and returns from any one operation.  Brand names are mentioned only as examples and imply no endorsement."]

{"sheet":"SugarCanePlant","index":20,"n_rows":97,"n_cols":18,"rows_kept":97,"cut":false,"hidden":false,"merged":[[84,3,84,8],[96,0,96,11],[0,0,0,11],[1,0,1,11],[2,0,2,11],[3,0,3,11]]}
["Projections for Planning Purposes Only -- Not to be Used without Updating"]
["2023 Estimated Costs and Returns per Acre"]
["Sugar Cane, Planted, Furrow Irrigated, Rio Grande Valley"]
["Enter your name for this budget in the cell above."]
["Enter  Your Values in the cells highlighed in MAROON."]
[null,null,null,null,"Your Acres",null,null,null,null,null,null,null,null,null,null,null,null,"Your"]
[null,null,"Crop Acres",100,null,null,null,null,null,null,null,"Your",null,null,null,null,"Enterprise","Enterprise"]
[null,null,null,null,"Your",null,null,"Your","Cash","Your","Landlord","Landlord",null,"Your",null,"Your","Total","Total"]
["REVENUE",null,null,"Quantity","Quantity","Units","$/Unit","$/Unit","Total","Total","Share","Share","Landlord","Landlord","Tenant","Tenant","(100 acres)",{"$f":"\"(\" & E7 & \" acres)\"","v":"( acres)"}]
[null,"Sugar Cane          ",null,50,null,"Ton",29.4,null,1470,{"$f":"E10*H10","v":0},0,null,0,{"$f":"J10*L10","v":0},1470,{"$f":"+J10-N10","v":0},147000,{"$f":"+J10*E$7","v":0}]
[null,null,null,0,null,null,0,null,0,0,0,null,0,0,0,{"$f":"+J11-N11","v":0},0,0]
[null,null,null,0,null,null,0,null,0,0,0,null,0,0,0,0,0,0]
["Total Revenue",null,null,null,null,null,null,null,1470,{"$f":"SUM(J10:J12)","v":0},null,null,0,{"$f":"SUM(N10:N12)","v":0},1470,{"$f":"SUM(P10:P12)","v":0},147000,{"$f":"SUM(R10:R12)","v":0}]
[null,null,null,null,null,null,null,null,null,null,null,null,null,null,null,null,"Enterprise","Enterprise"]
["VARIABLE COSTS",null,null,"Quantity","Quantity","Units","$/Unit","$/Unit","Total","Total","Share","Share","Landlord","Landlord","Tenant","Tenant","Total","Total"]
["Production Costs"]
[null,"Herbicide"]
[null,"","Atrazine 4L",6,null,"Pint",2.8975,null,17.384999999999998,{"$f":"E18*H18","v":0},0,null,0,{"$f":"J18*L18","v":0},17.384999999999998,{"$f":"+J18-N18","v":0},1738.4999999999998,{"$f":"+J18*E$7","v":0}]
[null,"","Pendimethalin",9.6,null,"Pint",6.9974999999999996,null,67.175999999999988,0,0,null,0,0,67.175999999999988,0,6717.5999999999985,0]
[null,"Seed"]
[null,"","Seed Cane",1,null,"acre",1200,null,1200,0,0,null,0,0,1200,0,120000,0]
[null,"Fertilizer"]
[null,"","Fertilizer 10-34-0",2.4,null,"CWT",39.75,null,95.399999999999991,0,0,null,0,0,95.399999999999991,0,9540,0]
[null,"","UAN (32% N)",3.3,null,"CWT",33.950000000000003,null,112.035,0,0,null,0,0,112.035,0,11203.5,0]
[null,"Custom"]
[null,"","Fixed Harvesting - SC",1,null,"Acre",145,null,145,0,0,null,0,0,145,0,14500,0]
[null,"","Variable Harvesting - SC",50,null,"Ton",3.87,null,193.5,0,0,null,0,0,193.5,0,19350,0]
[null,"","Hauling - SC",50,null,"Ton",3.96,null,198,0,0,null,0,0,198,0,19800,0]
[null,"Miscellaneous"]
[null,"","Insurance, Sugarcane",1,null,"Acre",14,null,14,0,0,null,0,0,14,0,1400,0]
[null,"Other Labor"]
[null,"","Unallocated Labor",0.5,null,"Hour",15,null,7.5,0,0,null,0,0,7.5,0,750,0]
[null,null,null,0,null,null,0,null,0,0,0,null,0,0,0,0,0,0]
[null,null,null,0,null,null,0,null,0,0,0,null,0,0,0,0,0,0]
[null,null,null,0,null,null,0,null,0,{"$f":"E35*H35","v":0},0,null,0,{"$f":"J35*L35","v":0},0,{"$f":"+J35-N35","v":0},0,{"$f":"+J35*E$7","v":0}]
[null,"Irrigation"]
[null,null,"Water Cost",5.5,null,"Acre/Foot",19.636363636363633,null,107.99999999999999,{"$f":"E37*H37","v":0},0,null,0,{"$f":"J37*L37","v":0},107.99999999999999,{"$f":"+J37-N37","v":0},10799.999999999998,{"$f":"+J37*E$7","v":0}]
[null,null,"Irrigation Labor",7.6999999999999966,null,"Hour",17.5,null,134.74999999999994,0,0,null,0,0,134.74999999999994,0,13474.999999999995,0]
[null,"Machinery Labor"]
[null,null,"Tractors/Self-Propelled",1.21,null,"Hour",17.21,null,20.824100000000001,{"$f":"E40*H40","v":0},0,null,0,{"$f":"J40*L40","v":0},20.824100000000001,{"$f":"+J40-N40","v":0},2082.4100000000003,{"$f":"+J40*E$7","v":0}]
[null,null,"Other Labor",0,null,"Hour",17.21,null,0,{"$f":"E41*H41","v":0},0,null,0,{"$f":"J41*L41","v":0},0,{"$f":"+J41-N41","v":0},0,{"$f":"+J41*E$7","v":0}]
[]
[null,"Diesel Fuel"]
[null,null,"Pickup/General Use Equipment",1,null,"Acre",0,null,0,{"$f":"E44*H44","v":0},0,null,0,{"$f":"J44*L44","v":0},0,{"$f":"+J44-N44","v":0},0,{"$f":"+J44*E$7","v":0}]
[null,null,"Tractors/Self-Propelled",5.89,null,"Gallon",2.2400000000000002,null,13.1936,{"$f":"E45*H45","v":0},0,null,0,{"$f":"J45*L45","v":0},13.1936,{"$f":"+J45-N45","v":0},1319.36,{"$f":"+J45*E$7","v":0}]
[]
[null,"Gasoline"]
[null,null,"Pickup/General Use Equipment",1,null,"Acre",0,null,0,{"$f":"E48*H48","v":0},0,null,0,{"$f":"J48*L48","v":0},0,{"$f":"+J48-N48","v":0},0,{"$f":"+J48*E$7","v":0}]
[null,null,"Tractors/Self-Propelled",0,null,"Gallon",2.09,null,0,{"$f":"E49*H49","v":0},0,null,0,{"$f":"J49*L49","v":0},0,{"$f":"+J49-N49","v":0},0,{"$f":"+J49*E$7","v":0}]
[]
[null,"Repairs & Maintenance"]
[null,null,"Pickup/General Use Equipment",1,null,"Acre",0,null,0,{"$f":"E52*H52","v":0},0,null,0,{"$f":"J52*L52","v":0},0,{"$f":"+J52-N52","v":0},0,{"$f":"+J52*E$7","v":0}]
[null,null,"Irrigation Equipment",1,null,"Acre",0,null,0,0,0,null,0,0,0,0,0,0]
[null,null,"Tractors/Self-Propelled",1,null,"Acre",13.437604759660212,null,13.437604759660212,0,0,null,0,0,13.437604759660212,0,1343.7604759660212,0]
[null,null,"Implements",1,null,"Acre",9.9145903195186538,null,9.9145903195186538,0,0,null,0,0,9.9145903195186538,0,991.45903195186543,0]
[null,null,null,null,null,null,null,null,0,0,0,null,0,0,0,0,0,0]
[null,null,null,null,null,null,null,null,0,0,0,null,0,0,0,0,0,0]
[null,"Interest on Credit Line",null,null,null,null,0.08,null,160.33478809324623,{"$f":"+SUM(J17:J57)/2*H58","v":0},null,null,0,{"$f":"+SUM(N17:N57)/2*L58","v":0},160.33478809324623,{"$f":"+SUM(P17:P57)/2*L58","v":0},16033.478809324622,{"$f":"+J58*E$7","v":0}]
["Total Variable Costs",null,null,null,null,null,null,null,2510.4506831724248,{"$f":"SUM(J18:J58)","v":0},null,null,0,{"$f":"SUM(N18:N58)","v":0},2510.4506831724248,{"$f":"SUM(P18:P58)","v":0},251045.06831724252,{"$f":"SUM(R18:R58)","v":0}]
["Planned Returns Above Variable Costs:",null,null,null,null,null,null,null,-1040.4506831724248,{"$f":"+J13-J59","v":0},null,null,0,{"$f":"+N13-N59","v":0},-1040.4506831724248,{"$f":"+P13-P59","v":0},-104045.06831724252,{"$f":"+R13-R59","v":0}]
[null,"Breakeven Price to Cover Variable Costs",null,null,null,null,50.209013663448495,{"$f":"IF(E10=0,\"n/a\",(YVarExp-(YTotExp+YTotRet-J10))/E10)","v":"n/a"},"Ton"]
[null,null,null,null,null,null,null,null,null,null,null,null,null,null,null,null,"Enterprise","Enterprise"]
["FIXED COSTS",null,null,"Quantity","Quantity","Units","$/Unit","$/Unit","Total","Total","Share","Share","Landlord","Landlord","Tenant","Tenant","Total","Total"]
[null,"Machinery Depreciation"]
[null,null,"Tractors/Self-Propelled",1,null,"Acre",13.885524918315552,null,13.885524918315552,{"$f":"E65*H65","v":0},0,null,0,{"$f":"J65*L65","v":0},13.885524918315552,{"$f":"+J65-N65","v":0},1388.5524918315552,{"$f":"+J65*E$7","v":0}]
[null,null,"Implements",1,null,"Acre",12.419621895129229,null,12.419621895129229,0,0,null,0,{"$f":"J66*L66","v":0},12.419621895129229,0,1241.9621895129228,0]
[null,"Equipment Investment"]
[null,null,"Tractors/Self-Propelled",108.17271831526469,null,"Dollars",0.08,null,8.6538174652211755,{"$f":"E68*H68","v":0},0,null,0,{"$f":"J68*L68","v":0},8.6538174652211755,{"$f":"+J68-N68","v":0},865.38174652211751,{"$f":"+J68*E$7","v":0}]
[null,null,"Implements",54.001847373229538,null,"Dollars",0.08,null,4.3201477898583631,0,0,null,0,{"$f":"J69*L69","v":0},4.3201477898583631,0,432.0147789858363,0]
[null,"Salaried Labor",null,1,null,"Acre",0,null,0,0,0,null,0,{"$f":"J70*L70","v":0},0,{"$f":"+J70-N70","v":0},0,{"$f":"+J70*E$7","v":0}]
[null,"Management Fee, Owner/Operator Labor",null,1,null,"Acre",0,null,0,0,0,null,0,0,0,0,0,0]
[null,"Allocated Establishment Cost",null,1,null,"Acre",2.11,null,2.11,0,0,null,0,0,2.11,0,211,0]
[null,"Cash Rent, Sugar Cane",null,1,null,"Acre",110,null,110,0,0,null,0,0,110,0,11000,0]
[null,"Property Taxes",null,1,null,"Acre",0,null,0,0,0,null,0,0,0,0,0,0]
[null,"Whole Farm Insurance",null,1,null,"Acre",0,null,0,0,0,null,0,0,0,0,0,0]
[null,null,null,1,null,null,0,null,0,0,0,null,0,0,0,0,0,0]
[null,null,null,1,null,null,0,null,0,{"$f":"E77*H77","v":0},0,null,0,0,0,0,0,0]
["Total Fixed Costs",null,null,null,null,null,null,null,151.3891120685243,{"$f":"+SUM(J65:J77)","v":0},null,null,0,{"$f":"+SUM(N65:N77)","v":0},151.3891120685243,{"$f":"+SUM(P65:P77)","v":0},15138.911206852432,{"$f":"+SUM(R65:R77)","v":0}]
["Total Specified Costs",null,null,null,null,null,null,null,2661.8397952409491,{"$f":"+J59+J78","v":0},null,null,0,{"$f":"+N59+N78","v":0},2661.8397952409491,{"$f":"+P59+P78","v":0},266183.97952409496,{"$f":"+R59+R78","v":0}]
[]
["Returns Above Specified Costs",null,null,null,null,null,null,null,-1191.8397952409491,{"$f":"+J13-J79","v":0},null,null,0,{"$f":"+N13-N79","v":0},-1191.8397952409491,{"$f":"+P13-P79","v":0},-119183.97952409496,{"$f":"+R13-R79","v":0}]
[]
["    Breakeven Price to Cover Total Costs",null,null,null,null,null,53.236795904818983,{"$f":"IF(E10=0,\"n/a\",(YTotExp-(YTotExp+YTotRet-J10))/E10)","v":"n/a"},"Ton"]
[]
[null,null,null,"Example Breakeven Prices"]
[null,"Example","Example","To Cover",null,null,"To Cover"]
[null,"Yield","Yield","Variable",null,null,"Total"]
[null,"Percent","Ton","Costs",null,null,"Costs"]
[null,0.75,37.5,66.945351551264665,null,null,70.982394539758644]
[null,0.9,45,55.787792959387218,null,null,59.151995449798868]
[null,1,50,50.209013663448495,null,null,53.236795904818983]
[null,1.1000000000000001,55.000000000000007,45.644557875862262,null,null,48.397087186199066]
[null,1.25,62.5,40.167210930758799,null,null,42.589436723855187]
[]
["  Developed by Samuel Zapata, Assistant Professor and Extension Economist, Texas A&M AgriLife Extension, 956-968-5581.  "]
[]
["Information presented is prepared solely as a general guide and not intended to recognize or predict the costs and returns from any one operation.  Brand names are mentioned only as examples and imply no endorsement."]

{"sheet":"SugarCaneRatoon","index":21,"n_rows":97,"n_cols":18,"rows_kept":97,"cut":false,"hidden":false,"merged":[[84,3,84,8],[96,0,96,11],[0,0,0,11],[1,0,1,11],[2,0,2,11],[3,0,3,11]]}
["Projections for Planning Purposes Only -- Not to be Used without Updating"]
["2023 Estimated Costs and Returns per Acre"]
["Sugar Cane, Ratoon, Furrow Irrigated, Rio Grande Valley"]
["Enter your name for this budget in the cell above."]
["Enter  Your Values in the cells highlighed in MAROON."]
[null,null,null,null,"Your Acres",null,null,null,null,null,null,null,null,null,null,null,null,"Your"]
[null,null,"Crop Acres",100,null,null,null,null,null,null,null,"Your",null,null,null,null,"Enterprise","Enterprise"]
[null,null,null,null,"Your",null,null,"Your","Cash","Your","Landlord","Landlord",null,"Your",null,"Your","Total","Total"]
["REVENUE",null,null,"Quantity","Quantity","Units","$/Unit","$/Unit","Total","Total","Share","Share","Landlord","Landlord","Tenant","Tenant","(100 acres)",{"$f":"\"(\" & E7 & \" acres)\"","v":"( acres)"}]
[null,"Sugar Cane          ",null,38,null,"Ton",29.4,null,1117.2,{"$f":"E10*H10","v":0},0,null,0,{"$f":"J10*L10","v":0},1117.2,{"$f":"+J10-N10","v":0},111720,{"$f":"+J10*E$7","v":0}]
[null,null,null,0,null,null,0,null,0,0,0,null,0,0,0,{"$f":"+J11-N11","v":0},0,0]
[null,null,null,0,null,null,0,null,0,0,0,null,0,0,0,0,0,0]
["Total Revenue",null,null,null,null,null,null,null,1117.2,{"$f":"SUM(J10:J12)","v":0},null,null,0,{"$f":"SUM(N10:N12)","v":0},1117.2,{"$f":"SUM(P10:P12)","v":0},111720,{"$f":"SUM(R10:R12)","v":0}]
[null,null,null,null,null,null,null,null,null,null,null,null,null,null,null,null,"Enterprise","Enterprise"]
["VARIABLE COSTS",null,null,"Quantity","Quantity","Units","$/Unit","$/Unit","Total","Total","Share","Share","Landlord","Landlord","Tenant","Tenant","Total","Total"]
["Production Costs"]
[null,"Herbicide"]
[null,"","Atrazine 4L",12,null,"Pint",2.8975,null,34.769999999999996,{"$f":"E18*H18","v":0},0,null,0,{"$f":"J18*L18","v":0},34.769999999999996,{"$f":"+J18-N18","v":0},3476.9999999999995,{"$f":"+J18*E$7","v":0}]
[null,"","Pendimethalin",9.6,null,"Pint",6.9974999999999996,null,67.175999999999988,0,0,null,0,0,67.175999999999988,0,6717.5999999999985,0]
[null,"","Glyphosate",0.8,null,"Pint",6.25,null,5,0,0,null,0,0,5,0,500,0]
[null,"Fertilizer"]
[null,"","UAN (32% N)",3.3,null,"CWT",33.950000000000003,null,112.035,0,0,null,0,0,112.035,0,11203.5,0]
[null,"","Fertilizer 10-34-0",2.4,null,"CWT",39.75,null,95.399999999999991,0,0,null,0,0,95.399999999999991,0,9540,0]
[null,"Custom"]
[null,"","Fixed Harvesting - SC",1,null,"Acre",145,null,145,0,0,null,0,0,145,0,14500,0]
[null,"","Variable Harvesting - SC",38,null,"Ton",3.87,null,147.06,0,0,null,0,0,147.06,0,14706,0]
[null,"","Hauling - SC",38,null,"Ton",3.96,null,150.47999999999999,0,0,null,0,0,150.47999999999999,0,15047.999999999998,0]
[null,"Miscellaneous"]
[null,"","Insurance, Sugarcane",1,null,"Acre",14,null,14,0,0,null,0,0,14,0,1400,0]
[null,"Other Labor"]
[null,"","Labor - Weed Control",1.75,null,"Hour",12,null,21,0,0,null,0,0,21,0,2100,0]
[null,"","Unallocated Labor",0.48720000000000002,null,"Hour",15,null,7.3080000000000007,0,0,null,0,0,7.3080000000000007,0,730.80000000000007,0]
[null,null,null,0,null,null,0,null,0,0,0,null,0,0,0,0,0,0]
[null,null,null,0,null,null,0,null,0,0,0,null,0,0,0,0,0,0]
[null,null,null,0,null,null,0,null,0,{"$f":"E35*H35","v":0},0,null,0,{"$f":"J35*L35","v":0},0,{"$f":"+J35-N35","v":0},0,{"$f":"+J35*E$7","v":0}]
[null,"Irrigation"]
[null,null,"Water Cost",5,null,"Acre/Foot",20,null,100,{"$f":"E37*H37","v":0},0,null,0,{"$f":"J37*L37","v":0},100,{"$f":"+J37-N37","v":0},10000,{"$f":"+J37*E$7","v":0}]
[null,null,"Irrigation Labor",6.9999999999999973,null,"Hour",17.5,null,122.49999999999996,0,0,null,0,0,122.49999999999996,0,12249.999999999996,0]
[null,"Machinery Labor"]
[null,null,"Tractors/Self-Propelled",0.7,null,"Hour",17.21,null,12.047000000000001,{"$f":"E40*H40","v":0},0,null,0,{"$f":"J40*L40","v":0},12.047000000000001,{"$f":"+J40-N40","v":0},1204.7,{"$f":"+J40*E$7","v":0}]
[null,null,"Other Labor",0,null,"Hour",17.21,null,0,{"$f":"E41*H41","v":0},0,null,0,{"$f":"J41*L41","v":0},0,{"$f":"+J41-N41","v":0},0,{"$f":"+J41*E$7","v":0}]
[]
[null,"Diesel Fuel"]
[null,null,"Pickup/General Use Equipment",1,null,"Acre",0,null,0,{"$f":"E44*H44","v":0},0,null,0,{"$f":"J44*L44","v":0},0,{"$f":"+J44-N44","v":0},0,{"$f":"+J44*E$7","v":0}]
[null,null,"Tractors/Self-Propelled",4.8099999999999996,null,"Gallon",2.2400000000000002,null,10.7744,{"$f":"E45*H45","v":0},0,null,0,{"$f":"J45*L45","v":0},10.7744,{"$f":"+J45-N45","v":0},1077.44,{"$f":"+J45*E$7","v":0}]
[]
[null,"Gasoline"]
[null,null,"Pickup/General Use Equipment",1,null,"Acre",0,null,0,{"$f":"E48*H48","v":0},0,null,0,{"$f":"J48*L48","v":0},0,{"$f":"+J48-N48","v":0},0,{"$f":"+J48*E$7","v":0}]
[null,null,"Tractors/Self-Propelled",0,null,"Gallon",2.09,null,0,{"$f":"E49*H49","v":0},0,null,0,{"$f":"J49*L49","v":0},0,{"$f":"+J49-N49","v":0},0,{"$f":"+J49*E$7","v":0}]
[]
[null,"Repairs & Maintenance"]
[null,null,"Pickup/General Use Equipment",1,null,"Acre",0,null,0,{"$f":"E52*H52","v":0},0,null,0,{"$f":"J52*L52","v":0},0,{"$f":"+J52-N52","v":0},0,{"$f":"+J52*E$7","v":0}]
[null,null,"Irrigation Equipment",1,null,"Acre",0,null,0,0,0,null,0,0,0,0,0,0]
[null,null,"Tractors/Self-Propelled",1,null,"Acre",10.806825531394033,null,10.806825531394033,0,0,null,0,0,10.806825531394033,0,1080.6825531394034,0]
[null,null,"Implements",1,null,"Acre",6.3924413972743537,null,6.3924413972743537,0,0,null,0,0,6.3924413972743537,0,639.24413972743537,0]
[null,null,null,null,null,null,null,null,0,0,0,null,0,0,0,0,0,0]
[null,null,null,null,null,null,null,null,0,0,0,null,0,0,0,0,0,0]
[null,"Interest on Credit Line",null,null,null,null,0.08,null,34.689148117579194,{"$f":"+SUM(J17:J57)/2*H58","v":0},null,null,0,{"$f":"+SUM(N17:N57)/2*L58","v":0},34.689148117579194,{"$f":"+SUM(P17:P57)/2*L58","v":0},3468.9148117579193,{"$f":"+J58*E$7","v":0}]
["Total Variable Costs",null,null,null,null,null,null,null,1096.4388150462476,{"$f":"SUM(J18:J58)","v":0},null,null,0,{"$f":"SUM(N18:N58)","v":0},1096.4388150462476,{"$f":"SUM(P18:P58)","v":0},109643.88150462475,{"$f":"SUM(R18:R58)","v":0}]
["Planned Returns Above Variable Costs:",null,null,null,null,null,null,null,20.76118495375249,{"$f":"+J13-J59","v":0},null,null,0,{"$f":"+N13-N59","v":0},20.76118495375249,{"$f":"+P13-P59","v":0},2076.1184953752527,{"$f":"+R13-R59","v":0}]
[null,"Breakeven Price to Cover Variable Costs",null,null,null,null,28.853653027532829,{"$f":"IF(E10=0,\"n/a\",(YVarExp-(YTotExp+YTotRet-J10))/E10)","v":"n/a"},"Ton"]
[null,null,null,null,null,null,null,null,null,null,null,null,null,null,null,null,"Enterprise","Enterprise"]
["FIXED COSTS",null,null,"Quantity","Quantity","Units","$/Unit","$/Unit","Total","Total","Share","Share","Landlord","Landlord","Tenant","Tenant","Total","Total"]
[null,"Machinery Depreciation"]
[null,null,"Tractors/Self-Propelled",1,null,"Acre",12.208736499160587,null,12.208736499160587,{"$f":"E65*H65","v":0},0,null,0,{"$f":"J65*L65","v":0},12.208736499160587,{"$f":"+J65-N65","v":0},1220.8736499160586,{"$f":"+J65*E$7","v":0}]
[null,null,"Implements",1,null,"Acre",8.2482583573728547,null,8.2482583573728547,0,0,null,0,{"$f":"J66*L66","v":0},8.2482583573728547,0,824.8258357372855,0]
[null,"Equipment Investment"]
[null,null,"Tractors/Self-Propelled",94.625993554030714,null,"Dollars",0.08,null,7.5700794843224575,{"$f":"E68*H68","v":0},0,null,0,{"$f":"J68*L68","v":0},7.5700794843224575,{"$f":"+J68-N68","v":0},757.00794843224571,{"$f":"+J68*E$7","v":0}]
[null,null,"Implements",36.34652869782726,null,"Dollars",0.08,null,2.907722295826181,0,0,null,0,{"$f":"J69*L69","v":0},2.907722295826181,0,290.77222958261808,0]
[null,"Salaried Labor",null,1,null,"Acre",0,null,0,0,0,null,0,{"$f":"J70*L70","v":0},0,{"$f":"+J70-N70","v":0},0,{"$f":"+J70*E$7","v":0}]
[null,"Management Fee, Owner/Operator Labor",null,1,null,"Acre",0,null,0,0,0,null,0,0,0,0,0,0]
[null,"Allocated Establishment Cost",null,1,null,"Acre",0,null,0,0,0,null,0,0,0,0,0,0]
[null,"Cash Rent, Sugar Cane",null,1,null,"Acre",110,null,110,0,0,null,0,0,110,0,11000,0]
[null,"Property Taxes",null,1,null,"Acre",0,null,0,0,0,null,0,0,0,0,0,0]
[null,"Whole Farm Insurance",null,1,null,"Acre",0,null,0,0,0,null,0,0,0,0,0,0]
[null,null,null,1,null,null,0,null,0,0,0,null,0,0,0,0,0,0]
[null,null,null,1,null,null,0,null,0,{"$f":"E77*H77","v":0},0,null,0,0,0,0,0,0]
["Total Fixed Costs",null,null,null,null,null,null,null,140.93479663668208,{"$f":"+SUM(J65:J77)","v":0},null,null,0,{"$f":"+SUM(N65:N77)","v":0},140.93479663668208,{"$f":"+SUM(P65:P77)","v":0},14093.479663668208,{"$f":"+SUM(R65:R77)","v":0}]
["Total Specified Costs",null,null,null,null,null,null,null,1237.3736116829295,{"$f":"+J59+J78","v":0},null,null,0,{"$f":"+N59+N78","v":0},1237.3736116829295,{"$f":"+P59+P78","v":0},123737.36116829296,{"$f":"+R59+R78","v":0}]
[]
["Returns Above Specified Costs",null,null,null,null,null,null,null,-120.1736116829295,{"$f":"+J13-J79","v":0},null,null,0,{"$f":"+N13-N79","v":0},-120.1736116829295,{"$f":"+P13-P79","v":0},-12017.361168292962,{"$f":"+R13-R79","v":0}]
[]
["    Breakeven Price to Cover Total Costs",null,null,null,null,null,32.562463465340251,{"$f":"IF(E10=0,\"n/a\",(YTotExp-(YTotExp+YTotRet-J10))/E10)","v":"n/a"},"Ton"]
[]
[null,null,null,"Example Breakeven Prices"]
[null,"Example","Example","To Cover",null,null,"To Cover"]
[null,"Yield","Yield","Variable",null,null,"Total"]
[null,"Percent","Ton","Costs",null,null,"Costs"]
[null,0.75,28.5,38.471537370043777,null,null,43.416617953787004]
[null,0.9,34.200000000000003,32.059614475036476,null,null,36.180514961489166]
[null,1,38,28.853653027532829,null,null,32.562463465340251]
[null,1.1000000000000001,41.800000000000004,26.230593661393481,null,null,29.60223951394568]
[null,1.25,47.5,23.082922422026265,null,null,26.0499707722722]
[]
["  Developed by Samuel Zapata, Assistant Professor and Extension Economist, Texas A&M AgriLife Extension, 956-968-5581.  "]
[]
["Information presented is prepared solely as a general guide and not intended to recognize or predict the costs and returns from any one operation.  Brand names are mentioned only as examples and imply no endorsement."]

{"sheet":"HayEstablishment","index":22,"n_rows":92,"n_cols":18,"rows_kept":92,"cut":false,"hidden":false,"merged":[[79,3,79,8],[91,0,91,11],[0,0,0,11],[1,0,1,11],[2,0,2,11],[3,0,3,11]]}
["Projections for Planning Purposes Only -- Not to be Used without Updating"]
["2023 Estimated Costs and Returns per Acre"]
["Hay Establishment, Furrow Irrigated, Rio Grande Valley"]
["Enter your name for this budget in the cell above."]
["Enter  Your Values in the cells highlighed in MAROON."]
[null,null,null,null,"Your Acres",null,null,null,null,null,null,null,null,null,null,null,null,"Your"]
[null,null,"Crop Acres",100,null,null,null,null,null,null,null,"Your",null,null,null,null,"Enterprise","Enterprise"]
[null,null,null,null,"Your",null,null,"Your","Cash","Your","Landlord","Landlord",null,"Your",null,"Your","Total","Total"]
["REVENUE",null,null,"Quantity","Quantity","Units","$/Unit","$/Unit","Total","Total","Share","Share","Landlord","Landlord","Tenant","Tenant","(100 acres)",{"$f":"\"(\" & E7 & \" acres)\"","v":"( acres)"}]
[null,"Bermuda Hay",null,0,null,"",0,null,0,{"$f":"E10*H10","v":0},0,null,0,{"$f":"J10*L10","v":0},0,{"$f":"+J10-N10","v":0},0,{"$f":"+J10*E$7","v":0}]
[null,null,null,0,null,null,0,null,0,0,0,null,0,0,0,{"$f":"+J11-N11","v":0},0,0]
[null,null,null,0,null,null,0,null,0,0,0,null,0,0,0,0,0,0]
["Total Revenue",null,null,null,null,null,null,null,0,{"$f":"SUM(J10:J12)","v":0},null,null,0,{"$f":"SUM(N10:N12)","v":0},0,{"$f":"SUM(P10:P12)","v":0},0,{"$f":"SUM(R10:R12)","v":0}]
[null,null,null,null,null,null,null,null,null,null,null,null,null,null,null,null,"Enterprise","Enterprise"]
["VARIABLE COSTS",null,null,"Quantity","Quantity","Units","$/Unit","$/Unit","Total","Total","Share","Share","Landlord","Landlord","Tenant","Tenant","Total","Total"]
["Production Costs"]
[null,"Seed"]
[null,"","Costal Bermuda Sprigs",1,null,"Acre",135,null,135,{"$f":"E18*H18","v":0},0,null,0,{"$f":"J18*L18","v":0},135,{"$f":"+J18-N18","v":0},13500,{"$f":"+J18*E$7","v":0}]
[null,"Fertilizer"]
[null,"","Ammonium Sulfate (21% N)",4,null,"CWT",26.462499999999999,null,105.85,0,0,null,0,0,105.85,0,10585,0]
[null,"Custom"]
[null,"","Land Prep and Disking",1,null,"Acre",50,null,50,0,0,null,0,0,50,0,5000,0]
[null,"","Mechanical Weed Control",1,null,"Acre",60,null,60,0,0,null,0,0,60,0,6000,0]
[null,"Herbicide"]
[null,"","Pendimethalin",3,null,"Pint",6.9974999999999996,null,20.9925,0,0,null,0,0,20.9925,0,2099.25,0]
[null,"Other Labor"]
[null,"","Unallocated Labor",0.5,null,"Hour",15,null,7.5,0,0,null,0,0,7.5,0,750,0]
[null,null,null,0,null,null,0,null,0,0,0,null,0,0,0,0,0,0]
[null,null,null,0,null,null,0,null,0,0,0,null,0,0,0,0,0,0]
[null,null,null,0,null,null,0,null,0,{"$f":"E30*H30","v":0},0,null,0,{"$f":"J30*L30","v":0},0,{"$f":"+J30-N30","v":0},0,{"$f":"+J30*E$7","v":0}]
[null,"Irrigation"]
[null,null,"Water Cost",2,null,"Acre/Foot",26,null,52,{"$f":"E32*H32","v":0},0,null,0,{"$f":"J32*L32","v":0},52,{"$f":"+J32-N32","v":0},5200,{"$f":"+J32*E$7","v":0}]
[null,null,"Irrigation Labor",1.2000000000000002,null,"Hour",17.5,null,21.000000000000004,0,0,null,0,0,21.000000000000004,0,2100.0000000000005,0]
[null,"Machinery Labor"]
[null,null,"Tractors/Self-Propelled",0.37,null,"Hour",17.21,null,6.3677000000000001,{"$f":"E35*H35","v":0},0,null,0,{"$f":"J35*L35","v":0},6.3677000000000001,{"$f":"+J35-N35","v":0},636.77,{"$f":"+J35*E$7","v":0}]
[null,null,"Other Labor",0.18,null,"Hour",17.21,null,3.0977999999999999,{"$f":"E36*H36","v":0},0,null,0,{"$f":"J36*L36","v":0},3.0977999999999999,{"$f":"+J36-N36","v":0},309.77999999999997,{"$f":"+J36*E$7","v":0}]
[]
[null,"Diesel Fuel"]
[null,null,"Pickup/General Use Equipment",1,null,"Acre",0,null,0,{"$f":"E39*H39","v":0},0,null,0,{"$f":"J39*L39","v":0},0,{"$f":"+J39-N39","v":0},0,{"$f":"+J39*E$7","v":0}]
[null,null,"Tractors/Self-Propelled",1.73,null,"Gallon",2.2400000000000002,null,3.8752000000000004,{"$f":"E40*H40","v":0},0,null,0,{"$f":"J40*L40","v":0},3.8752000000000004,{"$f":"+J40-N40","v":0},387.52000000000004,{"$f":"+J40*E$7","v":0}]
[]
[null,"Gasoline"]
[null,null,"Pickup/General Use Equipment",1,null,"Acre",0,null,0,{"$f":"E43*H43","v":0},0,null,0,{"$f":"J43*L43","v":0},0,{"$f":"+J43-N43","v":0},0,{"$f":"+J43*E$7","v":0}]
[null,null,"Tractors/Self-Propelled",0,null,"Gallon",2.09,null,0,{"$f":"E44*H44","v":0},0,null,0,{"$f":"J44*L44","v":0},0,{"$f":"+J44-N44","v":0},0,{"$f":"+J44*E$7","v":0}]
[]
[null,"Repairs & Maintenance"]
[null,null,"Pickup/General Use Equipment",1,null,"Acre",0,null,0,{"$f":"E47*H47","v":0},0,null,0,{"$f":"J47*L47","v":0},0,{"$f":"+J47-N47","v":0},0,{"$f":"+J47*E$7","v":0}]
[null,null,"Irrigation Equipment",1,null,"Acre",0,null,0,0,0,null,0,0,0,0,0,0]
[null,null,"Tractors/Self-Propelled",1,null,"Acre",3.7453038965715177,null,3.7453038965715177,0,0,null,0,0,3.7453038965715177,0,374.53038965715177,0]
[null,null,"Implements",1,null,"Acre",1.6131194798805759,null,1.6131194798805759,0,0,null,0,0,1.6131194798805759,0,161.3119479880576,0]
[null,null,null,null,null,null,null,null,0,0,0,null,0,0,0,0,0,0]
[null,null,null,null,null,null,null,null,0,0,0,null,0,0,0,0,0,0]
[null,"Interest on Credit Line",null,null,null,null,0.08,null,30.321564435112087,{"$f":"+SUM(J17:J52)/2*H53","v":0},null,null,0,{"$f":"+SUM(N17:N52)/2*L53","v":0},30.321564435112087,{"$f":"+SUM(P17:P52)/2*L53","v":0},3032.1564435112086,{"$f":"+J53*E$7","v":0}]
["Total Variable Costs",null,null,null,null,null,null,null,501.36318781156422,{"$f":"SUM(J18:J53)","v":0},null,null,0,{"$f":"SUM(N18:N53)","v":0},501.36318781156422,{"$f":"SUM(P18:P53)","v":0},50136.318781156406,{"$f":"SUM(R18:R53)","v":0}]
["Planned Returns Above Variable Costs:",null,null,null,null,null,null,null,-501.36318781156422,{"$f":"+J13-J54","v":0},null,null,0,{"$f":"+N13-N54","v":0},-501.36318781156422,{"$f":"+P13-P54","v":0},-50136.318781156406,{"$f":"+R13-R54","v":0}]
[null,"Breakeven Price to Cover Variable Costs",null,null,null,null,"n/a",{"$f":"IF(E10=0,\"n/a\",(YVarExp-(YTotExp+YTotRet-J10))/E10)","v":"n/a"},""]
[null,null,null,null,null,null,null,null,null,null,null,null,null,null,null,null,"Enterprise","Enterprise"]
["FIXED COSTS",null,null,"Quantity","Quantity","Units","$/Unit","$/Unit","Total","Total","Share","Share","Landlord","Landlord","Tenant","Tenant","Total","Total"]
[null,"Machinery Depreciation"]
[null,null,"Tractors/Self-Propelled",1,null,"Acre",3.8701473597905687,null,3.8701473597905687,{"$f":"E60*H60","v":0},0,null,0,{"$f":"J60*L60","v":0},3.8701473597905687,{"$f":"+J60-N60","v":0},387.01473597905687,{"$f":"+J60*E$7","v":0}]
[null,null,"Implements",1,null,"Acre",3.0226140599196474,null,3.0226140599196474,0,0,null,0,{"$f":"J61*L61","v":0},3.0226140599196474,0,302.26140599196475,0]
[null,"Equipment Investment"]
[null,null,"Tractors/Self-Propelled",30.149696367400722,null,"Dollars",0.08,null,2.411975709392058,{"$f":"E63*H63","v":0},0,null,0,{"$f":"J63*L63","v":0},2.411975709392058,{"$f":"+J63-N63","v":0},241.1975709392058,{"$f":"+J63*E$7","v":0}]
[null,null,"Implements",12.136734626006206,null,"Dollars",0.08,null,0.97093877008049645,0,0,null,0,{"$f":"J64*L64","v":0},0.97093877008049645,0,97.093877008049645,0]
[null,"Salaried Labor",null,1,null,"Acre",0,null,0,0,0,null,0,{"$f":"J65*L65","v":0},0,{"$f":"+J65-N65","v":0},0,{"$f":"+J65*E$7","v":0}]
[null,"Management Fee, Owner/Operator Labor",null,1,null,"Acre",0,null,0,0,0,null,0,0,0,0,0,0]
[null,"Allocated Establishment Cost",null,1,null,"Acre",0,null,0,0,0,null,0,0,0,0,0,0]
[null,"Cash Rent, Irrigated",null,1,null,"Acre",85,null,85,0,0,null,0,0,85,0,8500,0]
[null,"Property Taxes",null,1,null,"Acre",0,null,0,0,0,null,0,0,0,0,0,0]
[null,"Whole Farm Insurance",null,1,null,"Acre",0,null,0,0,0,null,0,0,0,0,0,0]
[null,null,null,1,null,null,0,null,0,0,0,null,0,0,0,0,0,0]
[null,null,null,1,null,null,0,null,0,{"$f":"E72*H72","v":0},0,null,0,0,0,0,0,0]
["Total Fixed Costs",null,null,null,null,null,null,null,95.275675899182772,{"$f":"+SUM(J60:J72)","v":0},null,null,0,{"$f":"+SUM(N60:N72)","v":0},95.275675899182772,{"$f":"+SUM(P60:P72)","v":0},9527.567589918277,{"$f":"+SUM(R60:R72)","v":0}]
["Total Specified Costs",null,null,null,null,null,null,null,596.63886371074705,{"$f":"+J54+J73","v":0},null,null,0,{"$f":"+N54+N73","v":0},596.63886371074705,{"$f":"+P54+P73","v":0},59663.886371074681,{"$f":"+R54+R73","v":0}]
[]
["Returns Above Specified Costs",null,null,null,null,null,null,null,-596.63886371074705,{"$f":"+J13-J74","v":0},null,null,0,{"$f":"+N13-N74","v":0},-596.63886371074705,{"$f":"+P13-P74","v":0},-59663.886371074681,{"$f":"+R13-R74","v":0}]
[]
["    Breakeven Price to Cover Total Costs",null,null,null,null,null,"n/a",{"$f":"IF(E10=0,\"n/a\",(YTotExp-(YTotExp+YTotRet-J10))/E10)","v":"n/a"},""]
[]
[null,null,null,"Example Breakeven Prices"]
[null,"Example","Example","To Cover",null,null,"To Cover"]
[null,"Yield","Yield","Variable",null,null,"Total"]
[null,"Percent","","Costs",null,null,"Costs"]
[null,0.75,0,0,null,null,0]
[null,0.9,0,0,null,null,0]
[null,1,0,0,null,null,0]
[null,1.1000000000000001,0,0,null,null,0]
[null,1.25,0,0,null,null,0]
[]
["  Developed by Samuel Zapata, Assistant Professor and Extension Economist, Texas A&M AgriLife Extension, 956-968-5581.  "]
[]
["Information presented is prepared solely as a general guide and not intended to recognize or predict the costs and returns from any one operation.  Brand names are mentioned only as examples and imply no endorsement."]

{"sheet":"HayProduction","index":23,"n_rows":89,"n_cols":18,"rows_kept":89,"cut":false,"hidden":false,"merged":[[76,3,76,8],[88,0,88,11],[0,0,0,11],[1,0,1,11],[2,0,2,11],[3,0,3,11]]}
["Projections for Planning Purposes Only -- Not to be Used without Updating"]
["2023 Estimated Costs and Returns per Acre"]
["Hay Production, Furrow Irrigated, Rio Grande Valley"]
["Enter your name for this budget in the cell above."]
["Enter  Your Values in the cells highlighed in MAROON."]
[null,null,null,null,"Your Acres",null,null,null,null,null,null,null,null,null,null,null,null,"Your"]
[null,null,"Crop Acres",100,null,null,null,null,null,null,null,"Your",null,null,null,null,"Enterprise","Enterprise"]
[null,null,null,null,"Your",null,null,"Your","Cash","Your","Landlord","Landlord",null,"Your",null,"Your","Total","Total"]
["REVENUE",null,null,"Quantity","Quantity","Units","$/Unit","$/Unit","Total","Total","Share","Share","Landlord","Landlord","Tenant","Tenant","(100 acres)",{"$f":"\"(\" & E7 & \" acres)\"","v":"( acres)"}]
[null,"Bermuda Hay",null,36,null,"Bale (950 lb)",92.62,null,3334.32,{"$f":"E10*H10","v":0},0,null,0,{"$f":"J10*L10","v":0},3334.32,{"$f":"+J10-N10","v":0},333432,{"$f":"+J10*E$7","v":0}]
[null,null,null,0,null,null,0,null,0,0,0,null,0,0,0,{"$f":"+J11-N11","v":0},0,0]
[null,null,null,0,null,null,0,null,0,0,0,null,0,0,0,0,0,0]
["Total Revenue",null,null,null,null,null,null,null,3334.32,{"$f":"SUM(J10:J12)","v":0},null,null,0,{"$f":"SUM(N10:N12)","v":0},3334.32,{"$f":"SUM(P10:P12)","v":0},333432,{"$f":"SUM(R10:R12)","v":0}]
[null,null,null,null,null,null,null,null,null,null,null,null,null,null,null,null,"Enterprise","Enterprise"]
["VARIABLE COSTS",null,null,"Quantity","Quantity","Units","$/Unit","$/Unit","Total","Total","Share","Share","Landlord","Landlord","Tenant","Tenant","Total","Total"]
["Production Costs"]
[null,"Fertilizer"]
[null,"","Ammonium Sulfate (21% N)",21.43,null,"CWT",26.462499999999999,null,567.09137499999997,{"$f":"E18*H18","v":0},0,null,0,{"$f":"J18*L18","v":0},567.09137499999997,{"$f":"+J18-N18","v":0},56709.137499999997,{"$f":"+J18*E$7","v":0}]
[null,"Custom"]
[null,"","Hay Harvest",36,null,"Bale",25,null,900,0,0,null,0,0,900,0,90000,0]
[null,"Herbicide"]
[null,"","Pendimethalin",3,null,"Pint",6.9974999999999996,null,20.9925,0,0,null,0,0,20.9925,0,2099.25,0]
[null,"Other Labor"]
[null,"","Unallocated Labor",1,null,"Hour",15,null,15,0,0,null,0,0,15,0,1500,0]
[null,null,null,0,null,null,0,null,0,0,0,null,0,0,0,0,0,0]
[null,null,null,0,null,null,0,null,0,0,0,null,0,0,0,0,0,0]
[null,null,null,0,null,null,0,null,0,{"$f":"E27*H27","v":0},0,null,0,{"$f":"J27*L27","v":0},0,{"$f":"+J27-N27","v":0},0,{"$f":"+J27*E$7","v":0}]
[null,"Irrigation"]
[null,null,"Water Cost",3,null,"Acre/Foot",22.666666666666668,null,68,{"$f":"E29*H29","v":0},0,null,0,{"$f":"J29*L29","v":0},68,{"$f":"+J29-N29","v":0},6800,{"$f":"+J29*E$7","v":0}]
[null,null,"Irrigation Labor",2.1,null,"Hour",17.5,null,36.75,0,0,null,0,0,36.75,0,3675,0]
[null,"Machinery Labor"]
[null,null,"Tractors/Self-Propelled",1.32,null,"Hour",17.21,null,22.717200000000002,{"$f":"E32*H32","v":0},0,null,0,{"$f":"J32*L32","v":0},22.717200000000002,{"$f":"+J32-N32","v":0},2271.7200000000003,{"$f":"+J32*E$7","v":0}]
[null,null,"Other Labor",0.43,null,"Hour",17.21,null,7.4003000000000005,{"$f":"E33*H33","v":0},0,null,0,{"$f":"J33*L33","v":0},7.4003000000000005,{"$f":"+J33-N33","v":0},740.03000000000009,{"$f":"+J33*E$7","v":0}]
[]
[null,"Diesel Fuel"]
[null,null,"Pickup/General Use Equipment",1,null,"Acre",0,null,0,{"$f":"E36*H36","v":0},0,null,0,{"$f":"J36*L36","v":0},0,{"$f":"+J36-N36","v":0},0,{"$f":"+J36*E$7","v":0}]
[null,null,"Tractors/Self-Propelled",7.62,null,"Gallon",2.2400000000000002,null,17.068800000000003,{"$f":"E37*H37","v":0},0,null,0,{"$f":"J37*L37","v":0},17.068800000000003,{"$f":"+J37-N37","v":0},1706.8800000000003,{"$f":"+J37*E$7","v":0}]
[]
[null,"Gasoline"]
[null,null,"Pickup/General Use Equipment",1,null,"Acre",0,null,0,{"$f":"E40*H40","v":0},0,null,0,{"$f":"J40*L40","v":0},0,{"$f":"+J40-N40","v":0},0,{"$f":"+J40*E$7","v":0}]
[null,null,"Tractors/Self-Propelled",0,null,"Gallon",2.09,null,0,{"$f":"E41*H41","v":0},0,null,0,{"$f":"J41*L41","v":0},0,{"$f":"+J41-N41","v":0},0,{"$f":"+J41*E$7","v":0}]
[]
[null,"Repairs & Maintenance"]
[null,null,"Pickup/General Use Equipment",1,null,"Acre",0,null,0,{"$f":"E44*H44","v":0},0,null,0,{"$f":"J44*L44","v":0},0,{"$f":"+J44-N44","v":0},0,{"$f":"+J44*E$7","v":0}]
[null,null,"Irrigation Equipment",1,null,"Acre",0,null,0,0,0,null,0,0,0,0,0,0]
[null,null,"Tractors/Self-Propelled",1,null,"Acre",16.553746009894958,null,16.553746009894958,0,0,null,0,0,16.553746009894958,0,1655.3746009894958,0]
[null,null,"Implements",1,null,"Acre",9.9624562336996476,null,9.9624562336996476,0,0,null,0,0,9.9624562336996476,0,996.24562336996473,0]
[null,null,null,null,null,null,null,null,0,0,0,null,0,0,0,0,0,0]
[null,null,null,null,null,null,null,null,0,0,0,null,0,0,0,0,0,0]
[null,"Interest on Credit Line",null,null,null,null,0.08,null,51.754715450618662,{"$f":"+SUM(J17:J49)/2*H50","v":0},null,null,0,{"$f":"+SUM(N17:N49)/2*L50","v":0},51.754715450618662,{"$f":"+SUM(P17:P49)/2*L50","v":0},5175.471545061866,{"$f":"+J50*E$7","v":0}]
["Total Variable Costs",null,null,null,null,null,null,null,1733.2910926942134,{"$f":"SUM(J18:J50)","v":0},null,null,0,{"$f":"SUM(N18:N50)","v":0},1733.2910926942134,{"$f":"SUM(P18:P50)","v":0},173329.10926942131,{"$f":"SUM(R18:R50)","v":0}]
["Planned Returns Above Variable Costs:",null,null,null,null,null,null,null,1601.0289073057868,{"$f":"+J13-J51","v":0},null,null,0,{"$f":"+N13-N51","v":0},1601.0289073057868,{"$f":"+P13-P51","v":0},160102.89073057869,{"$f":"+R13-R51","v":0}]
[null,"Breakeven Price to Cover Variable Costs",null,null,null,null,48.146974797061482,{"$f":"IF(E10=0,\"n/a\",(YVarExp-(YTotExp+YTotRet-J10))/E10)","v":"n/a"},"Bale (950 lb)"]
[null,null,null,null,null,null,null,null,null,null,null,null,null,null,null,null,"Enterprise","Enterprise"]
["FIXED COSTS",null,null,"Quantity","Quantity","Units","$/Unit","$/Unit","Total","Total","Share","Share","Landlord","Landlord","Tenant","Tenant","Total","Total"]
[null,"Machinery Depreciation"]
[null,null,"Tractors/Self-Propelled",1,null,"Acre",18.147220993611544,null,18.147220993611544,{"$f":"E57*H57","v":0},0,null,0,{"$f":"J57*L57","v":0},18.147220993611544,{"$f":"+J57-N57","v":0},1814.7220993611545,{"$f":"+J57*E$7","v":0}]
[null,null,"Implements",1,null,"Acre",15.388288030223443,null,15.388288030223443,0,0,null,0,{"$f":"J58*L58","v":0},15.388288030223443,0,1538.8288030223443,0]
[null,"Equipment Investment"]
[null,null,"Tractors/Self-Propelled",140.88870340596316,null,"Dollars",0.08,null,11.271096272477052,{"$f":"E60*H60","v":0},0,null,0,{"$f":"J60*L60","v":0},11.271096272477052,{"$f":"+J60-N60","v":0},1127.1096272477052,{"$f":"+J60*E$7","v":0}]
[null,null,"Implements",64.906647389229605,null,"Dollars",0.08,null,5.1925317911383688,0,0,null,0,{"$f":"J61*L61","v":0},5.1925317911383688,0,519.25317911383684,0]
[null,"Salaried Labor",null,1,null,"Acre",0,null,0,0,0,null,0,{"$f":"J62*L62","v":0},0,{"$f":"+J62-N62","v":0},0,{"$f":"+J62*E$7","v":0}]
[null,"Management Fee, Owner/Operator Labor",null,1,null,"Acre",0,null,0,0,0,null,0,0,0,0,0,0]
[null,"Allocated Establishment Cost",null,1,null,"Acre",0,null,0,0,0,null,0,0,0,0,0,0]
[null,"Cash Rent, Irrigated",null,1,null,"Acre",85,null,85,0,0,null,0,0,85,0,8500,0]
[null,"Property Taxes",null,1,null,"Acre",0,null,0,0,0,null,0,0,0,0,0,0]
[null,"Whole Farm Insurance",null,1,null,"Acre",0,null,0,0,0,null,0,0,0,0,0,0]
[null,null,null,1,null,null,0,null,0,0,0,null,0,0,0,0,0,0]
[null,null,null,1,null,null,0,null,0,{"$f":"E69*H69","v":0},0,null,0,0,0,0,0,0]
["Total Fixed Costs",null,null,null,null,null,null,null,134.99913708745041,{"$f":"+SUM(J57:J69)","v":0},null,null,0,{"$f":"+SUM(N57:N69)","v":0},134.99913708745041,{"$f":"+SUM(P57:P69)","v":0},13499.913708745042,{"$f":"+SUM(R57:R69)","v":0}]
["Total Specified Costs",null,null,null,null,null,null,null,1868.2902297816638,{"$f":"+J51+J70","v":0},null,null,0,{"$f":"+N51+N70","v":0},1868.2902297816638,{"$f":"+P51+P70","v":0},186829.02297816635,{"$f":"+R51+R70","v":0}]
[]
["Returns Above Specified Costs",null,null,null,null,null,null,null,1466.0297702183364,{"$f":"+J13-J71","v":0},null,null,0,{"$f":"+N13-N71","v":0},1466.0297702183364,{"$f":"+P13-P71","v":0},146602.97702183365,{"$f":"+R13-R71","v":0}]
[]
["    Breakeven Price to Cover Total Costs",null,null,null,null,null,51.896950827268441,{"$f":"IF(E10=0,\"n/a\",(YTotExp-(YTotExp+YTotRet-J10))/E10)","v":"n/a"},"Bale (950 lb)"]
[]
[null,null,null,"Example Breakeven Prices"]
[null,"Example","Example","To Cover",null,null,"To Cover"]
[null,"Yield","Yield","Variable",null,null,"Total"]
[null,"Percent","Bale (950 lb)","Costs",null,null,"Costs"]
[null,0.75,27,64.195966396081971,null,null,69.195934436357916]
[null,0.9,32.4,53.496638663401647,null,null,57.663278696964937]
[null,1,36,48.146974797061482,null,null,51.896950827268441]
[null,1.1000000000000001,39.6,43.769977088237709,null,null,47.179046206607673]
[null,1.25,45,38.517579837649187,null,null,41.517560661814748]
[]
["  Developed by Samuel Zapata, Assistant Professor and Extension Economist, Texas A&M AgriLife Extension, 956-968-5581.  "]
[]
["Information presented is prepared solely as a general guide and not intended to recognize or predict the costs and returns from any one operation.  Brand names are mentioned only as examples and imply no endorsement."]

{"sheet":"Cabbage","index":24,"n_rows":101,"n_cols":18,"rows_kept":101,"cut":false,"hidden":false,"merged":[[88,3,88,8],[100,0,100,11],[0,0,0,11],[1,0,1,11],[2,0,2,11],[3,0,3,11]]}
["Projections for Planning Purposes Only -- Not to be Used without Updating"]
["2023 Estimated Costs and Returns per Acre"]
["Cabbage, Fresh Market, Furrow Irrigated, Rio Grande Valley"]
["Enter your name for this budget in the cell above."]
["Enter  Your Values in the cells highlighed in MAROON."]
[null,null,null,null,"Your Acres",null,null,null,null,null,null,null,null,null,null,null,null,"Your"]
[null,null,"Crop Acres",100,null,null,null,null,null,null,null,"Your",null,null,null,null,"Enterprise","Enterprise"]
[null,null,null,null,"Your",null,null,"Your","Cash","Your","Landlord","Landlord",null,"Your",null,"Your","Total","Total"]
["REVENUE",null,null,"Quantity","Quantity","Units","$/Unit","$/Unit","Total","Total","Share","Share","Landlord","Landlord","Tenant","Tenant","(100 acres)",{"$f":"\"(\" & E7 & \" acres)\"","v":"( acres)"}]
[null,"Cabbage             ",null,750,null,"Carton",11,null,8250,{"$f":"E10*H10","v":0},0,null,0,{"$f":"J10*L10","v":0},8250,{"$f":"+J10-N10","v":0},825000,{"$f":"+J10*E$7","v":0}]
[null,null,null,0,null,null,0,null,0,0,0,null,0,0,0,{"$f":"+J11-N11","v":0},0,0]
[null,null,null,0,null,null,0,null,0,0,0,null,0,0,0,0,0,0]
["Total Revenue",null,null,null,null,null,null,null,8250,{"$f":"SUM(J10:J12)","v":0},null,null,0,{"$f":"SUM(N10:N12)","v":0},8250,{"$f":"SUM(P10:P12)","v":0},825000,{"$f":"SUM(R10:R12)","v":0}]
[null,null,null,null,null,null,null,null,null,null,null,null,null,null,null,null,"Enterprise","Enterprise"]
["VARIABLE COSTS",null,null,"Quantity","Quantity","Units","$/Unit","$/Unit","Total","Total","Share","Share","Landlord","Landlord","Tenant","Tenant","Total","Total"]
["Production Costs"]
[null,"Fertilizer"]
[null,"","Phosphorus (46% P2O5)",1.75,null,"CWT",43.15,null,75.512500000000003,{"$f":"E18*H18","v":0},0,null,0,{"$f":"J18*L18","v":0},75.512500000000003,{"$f":"+J18-N18","v":0},7551.25,{"$f":"+J18*E$7","v":0}]
[null,"","Ammonium Nitrate (34% N)",4.41,null,"CWT",35.625,null,157.10625000000002,0,0,null,0,0,157.10625000000002,0,15710.625000000002,0]
[null,"Custom"]
[null,"","Harvest Cabbage",750,null,"Carton",1.75,null,1312.5,0,0,null,0,0,1312.5,0,131250,0]
[null,"","Pack and Count Cabbage",750,null,"Carton",3.5,null,2625,0,0,null,0,0,2625,0,262500,0]
[null,"Insecticide"]
[null,"","Admire Pro",0.27500000000000002,null,"Pint",26.279999999999998,null,7.2270000000000003,0,0,null,0,0,7.2270000000000003,0,722.7,0]
[null,"","Lorsban 4E",3.55,null,"Pint",14.1975,null,50.401124999999993,0,0,null,0,0,50.401124999999993,0,5040.1124999999993,0]
[null,"","Asana XL ",24,null,"Ounce",0.62460937500000002,null,14.990625000000001,0,0,null,0,0,14.990625000000001,0,1499.0625000000002,0]
[null,"","Lambda",7.68,null,"Ounce",0.46875,null,3.5999999999999996,0,0,null,0,0,3.5999999999999996,0,359.99999999999994,0]
[null,"Seed"]
[null,"","Cabbage Seed",24,null,"Thousand",7.3239999999999998,null,175.77600000000001,0,0,null,0,0,175.77600000000001,0,17577.600000000002,0]
[null,"Herbicide"]
[null,"","Prefar 4E",2.75,null,"Quart",23.794999999999998,null,65.436250000000001,0,0,null,0,0,65.436250000000001,0,6543.625,0]
[null,"Fungicides"]
[null,"","Bravo Ultrex",7,null,"Pound",10.232481751824817,null,71.627372262773719,0,0,null,0,0,71.627372262773719,0,7162.7372262773715,0]
[null,"","Ridomil Gold SC",72,null,"Ounce",1.2375,null,89.100000000000009,0,0,null,0,0,89.100000000000009,0,8910,0]
[null,"Other Labor"]
[null,"","Unallocated Labor",0.15459999999999999,null,"Hour",15,null,2.319,0,0,null,0,0,2.319,0,231.9,0]
[null,null,null,0,null,null,0,null,0,0,0,null,0,0,0,0,0,0]
[null,null,null,0,null,null,0,null,0,0,0,null,0,0,0,0,0,0]
[null,null,null,0,null,null,0,null,0,{"$f":"E39*H39","v":0},0,null,0,{"$f":"J39*L39","v":0},0,{"$f":"+J39-N39","v":0},0,{"$f":"+J39*E$7","v":0}]
[null,"Irrigation"]
[null,null,"Water Cost",2.8,null,"Acre/Foot",23.142857142857149,null,64.800000000000011,{"$f":"E41*H41","v":0},0,null,0,{"$f":"J41*L41","v":0},64.800000000000011,{"$f":"+J41-N41","v":0},6480.0000000000009,{"$f":"+J41*E$7","v":0}]
[null,null,"Irrigation Labor",7.5,null,"Hour",17.5,null,131.25,0,0,null,0,0,131.25,0,13125,0]
[null,"Machinery Labor"]
[null,null,"Tractors/Self-Propelled",2.38,null,"Hour",17.21,null,40.959800000000001,{"$f":"E44*H44","v":0},0,null,0,{"$f":"J44*L44","v":0},40.959800000000001,{"$f":"+J44-N44","v":0},4095.98,{"$f":"+J44*E$7","v":0}]
[null,null,"Other Labor",0,null,"Hour",17.21,null,0,{"$f":"E45*H45","v":0},0,null,0,{"$f":"J45*L45","v":0},0,{"$f":"+J45-N45","v":0},0,{"$f":"+J45*E$7","v":0}]
[]
[null,"Diesel Fuel"]
[null,null,"Pickup/General Use Equipment",1,null,"Acre",0,null,0,{"$f":"E48*H48","v":0},0,null,0,{"$f":"J48*L48","v":0},0,{"$f":"+J48-N48","v":0},0,{"$f":"+J48*E$7","v":0}]
[null,null,"Tractors/Self-Propelled",13.91,null,"Gallon",2.2400000000000002,null,31.158400000000004,{"$f":"E49*H49","v":0},0,null,0,{"$f":"J49*L49","v":0},31.158400000000004,{"$f":"+J49-N49","v":0},3115.8400000000006,{"$f":"+J49*E$7","v":0}]
[]
[null,"Gasoline"]
[null,null,"Pickup/General Use Equipment",1,null,"Acre",0,null,0,{"$f":"E52*H52","v":0},0,null,0,{"$f":"J52*L52","v":0},0,{"$f":"+J52-N52","v":0},0,{"$f":"+J52*E$7","v":0}]
[null,null,"Tractors/Self-Propelled",0,null,"Gallon",2.09,null,0,{"$f":"E53*H53","v":0},0,null,0,{"$f":"J53*L53","v":0},0,{"$f":"+J53-N53","v":0},0,{"$f":"+J53*E$7","v":0}]
[]
[null,"Repairs & Maintenance"]
[null,null,"Pickup/General Use Equipment",1,null,"Acre",0,null,0,{"$f":"E56*H56","v":0},0,null,0,{"$f":"J56*L56","v":0},0,{"$f":"+J56-N56","v":0},0,{"$f":"+J56*E$7","v":0}]
[null,null,"Irrigation Equipment",1,null,"Acre",0,null,0,0,0,null,0,0,0,0,0,0]
[null,null,"Tractors/Self-Propelled",1,null,"Acre",32.077823155928058,null,32.077823155928058,0,0,null,0,0,32.077823155928058,0,3207.7823155928058,0]
[null,null,"Implements",1,null,"Acre",20.053441301214164,null,20.053441301214164,0,0,null,0,0,20.053441301214164,0,2005.3441301214164,0]
[null,null,null,null,null,null,null,null,0,0,0,null,0,0,0,0,0,0]
[null,null,null,null,null,null,null,null,0,0,0,null,0,0,0,0,0,0]
[null,"Interest on Credit Line",null,null,null,null,0.08,null,24.185137254623811,{"$f":"+SUM(J17:J61)/2*H62","v":0},null,null,0,{"$f":"+SUM(N17:N61)/2*L62","v":0},24.185137254623811,{"$f":"+SUM(P17:P61)/2*L62","v":0},2418.513725462381,{"$f":"+J62*E$7","v":0}]
["Total Variable Costs",null,null,null,null,null,null,null,4995.08072397454,{"$f":"SUM(J18:J62)","v":0},null,null,0,{"$f":"SUM(N18:N62)","v":0},4995.08072397454,{"$f":"SUM(P18:P62)","v":0},499508.07239745394,{"$f":"SUM(R18:R62)","v":0}]
["Planned Returns Above Variable Costs:",null,null,null,null,null,null,null,3254.91927602546,{"$f":"+J13-J63","v":0},null,null,0,{"$f":"+N13-N63","v":0},3254.91927602546,{"$f":"+P13-P63","v":0},325491.92760254606,{"$f":"+R13-R63","v":0}]
[null,"Breakeven Price to Cover Variable Costs",null,null,null,null,6.6601076319660537,{"$f":"IF(E10=0,\"n/a\",(YVarExp-(YTotExp+YTotRet-J10))/E10)","v":"n/a"},"Carton"]
[null,null,null,null,null,null,null,null,null,null,null,null,null,null,null,null,"Enterprise","Enterprise"]
["FIXED COSTS",null,null,"Quantity","Quantity","Units","$/Unit","$/Unit","Total","Total","Share","Share","Landlord","Landlord","Tenant","Tenant","Total","Total"]
[null,"Machinery Depreciation"]
[null,null,"Tractors/Self-Propelled",1,null,"Acre",32.881217976812962,null,32.881217976812962,{"$f":"E69*H69","v":0},0,null,0,{"$f":"J69*L69","v":0},32.881217976812962,{"$f":"+J69-N69","v":0},3288.1217976812964,{"$f":"+J69*E$7","v":0}]
[null,null,"Implements",1,null,"Acre",23.470922714873385,null,23.470922714873385,0,0,null,0,{"$f":"J70*L70","v":0},23.470922714873385,0,2347.0922714873386,0]
[null,"Equipment Investment"]
[null,null,"Tractors/Self-Propelled",256.1552948838816,null,"Dollars",0.08,null,20.492423590710526,{"$f":"E72*H72","v":0},0,null,0,{"$f":"J72*L72","v":0},20.492423590710526,{"$f":"+J72-N72","v":0},2049.2423590710528,{"$f":"+J72*E$7","v":0}]
[null,null,"Implements",109.62333223372599,null,"Dollars",0.08,null,8.7698665786980801,0,0,null,0,{"$f":"J73*L73","v":0},8.7698665786980801,0,876.98665786980803,0]
[null,"Salaried Labor",null,1,null,"Acre",0,null,0,0,0,null,0,{"$f":"J74*L74","v":0},0,{"$f":"+J74-N74","v":0},0,{"$f":"+J74*E$7","v":0}]
[null,"Management Fee, Owner/Operator Labor",null,1,null,"Acre",0,null,0,0,0,null,0,0,0,0,0,0]
[null,"Allocated Establishment Cost",null,1,null,"Acre",0,null,0,0,0,null,0,0,0,0,0,0]
[null,"Cash Rent, Irrigated Vegetables",null,1,null,"Acre",110,null,110,0,0,null,0,0,110,0,11000,0]
[null,"Property Taxes",null,1,null,"Acre",0,null,0,0,0,null,0,0,0,0,0,0]
[null,"Whole Farm Insurance",null,1,null,"Acre",0,null,0,0,0,null,0,0,0,0,0,0]
[null,null,null,1,null,null,0,null,0,0,0,null,0,0,0,0,0,0]
[null,null,null,1,null,null,0,null,0,{"$f":"E81*H81","v":0},0,null,0,0,0,0,0,0]
["Total Fixed Costs",null,null,null,null,null,null,null,195.61443086109495,{"$f":"+SUM(J69:J81)","v":0},null,null,0,{"$f":"+SUM(N69:N81)","v":0},195.61443086109495,{"$f":"+SUM(P69:P81)","v":0},19561.443086109495,{"$f":"+SUM(R69:R81)","v":0}]
["Total Specified Costs",null,null,null,null,null,null,null,5190.6951548356346,{"$f":"+J63+J82","v":0},null,null,0,{"$f":"+N63+N82","v":0},5190.6951548356346,{"$f":"+P63+P82","v":0},519069.51548356342,{"$f":"+R63+R82","v":0}]
[]
["Returns Above Specified Costs",null,null,null,null,null,null,null,3059.3048451643654,{"$f":"+J13-J83","v":0},null,null,0,{"$f":"+N13-N83","v":0},3059.3048451643654,{"$f":"+P13-P83","v":0},305930.48451643658,{"$f":"+R13-R83","v":0}]
[]
["    Breakeven Price to Cover Total Costs",null,null,null,null,null,6.9209268731141798,{"$f":"IF(E10=0,\"n/a\",(YTotExp-(YTotExp+YTotRet-J10))/E10)","v":"n/a"},"Carton"]
[]
[null,null,null,"Example Breakeven Prices"]
[null,"Example","Example","To Cover",null,null,"To Cover"]
[null,"Yield","Yield","Variable",null,null,"Total"]
[null,"Percent","Carton","Costs",null,null,"Costs"]
[null,0.75,562.5,8.8801435092880716,null,null,9.227902497485573]
[null,0.9,675,7.4001195910733921,null,null,7.6899187479046436]
[null,1,750,6.6601076319660537,null,null,6.9209268731141798]
[null,1.1000000000000001,825.00000000000011,6.05464330178732,null,null,6.2917517028310712]
[null,1.25,937.5,5.3280861055728428,null,null,5.5367414984913434]
[]
["  Developed by Samuel Zapata, Assistant Professor and Extension Economist, Texas A&M AgriLife Extension, 956-968-5581.  "]
[]
["Information presented is prepared solely as a general guide and not intended to recognize or predict the costs and returns from any one operation.  Brand names are mentioned only as examples and imply no endorsement."]

{"sheet":"Cantaloupe","index":25,"n_rows":106,"n_cols":18,"rows_kept":106,"cut":false,"hidden":false,"merged":[[93,3,93,8],[105,0,105,11],[0,0,0,11],[1,0,1,11],[2,0,2,11],[3,0,3,11]]}
["Projections for Planning Purposes Only -- Not to be Used without Updating"]
["2023 Estimated Costs and Returns per Acre"]
["Cantaloupe, Plastic Mulch, Drip Irrigated, Rio Grande Valley"]
["Enter your name for this budget in the cell above."]
["Enter  Your Values in the cells highlighed in MAROON."]
[null,null,null,null,"Your Acres",null,null,null,null,null,null,null,null,null,null,null,null,"Your"]
[null,null,"Crop Acres",40,null,null,null,null,null,null,null,"Your",null,null,null,null,"Enterprise","Enterprise"]
[null,null,null,null,"Your",null,null,"Your","Cash","Your","Landlord","Landlord",null,"Your",null,"Your","Total","Total"]
["REVENUE",null,null,"Quantity","Quantity","Units","$/Unit","$/Unit","Total","Total","Share","Share","Landlord","Landlord","Tenant","Tenant","(40 acres)",{"$f":"\"(\" & E7 & \" acres)\"","v":"( acres)"}]
[null,"Cantaloupes      ",null,400,null,"Carton",9.5,null,3800,{"$f":"E10*H10","v":0},0,null,0,{"$f":"J10*L10","v":0},3800,{"$f":"+J10-N10","v":0},152000,{"$f":"+J10*E$7","v":0}]
[null,null,null,0,null,null,0,null,0,0,0,null,0,0,0,{"$f":"+J11-N11","v":0},0,0]
[null,null,null,0,null,null,0,null,0,0,0,null,0,0,0,0,0,0]
["Total Revenue",null,null,null,null,null,null,null,3800,{"$f":"SUM(J10:J12)","v":0},null,null,0,{"$f":"SUM(N10:N12)","v":0},3800,{"$f":"SUM(P10:P12)","v":0},152000,{"$f":"SUM(R10:R12)","v":0}]
[null,null,null,null,null,null,null,null,null,null,null,null,null,null,null,null,"Enterprise","Enterprise"]
["VARIABLE COSTS",null,null,"Quantity","Quantity","Units","$/Unit","$/Unit","Total","Total","Share","Share","Landlord","Landlord","Tenant","Tenant","Total","Total"]
["Production Costs"]
[null,"Fertilizer"]
[null,"","Phosphorus (46% P2O5)",1.5,null,"CWT",43.15,null,64.724999999999994,{"$f":"E18*H18","v":0},0,null,0,{"$f":"J18*L18","v":0},64.724999999999994,{"$f":"+J18-N18","v":0},2589,{"$f":"+J18*E$7","v":0}]
[null,"","UAN (32% N)",3.7399999999999993,null,"CWT",33.950000000000003,null,126.97299999999998,0,0,null,0,0,126.97299999999998,0,5078.9199999999992,0]
[null,"Custom"]
[null,"","Bee Rental",1,null,"Hive",85,null,85,0,0,null,0,0,85,0,3400,0]
[null,"","Harvest Cantaloupe",400,null,"Carton",3.5,null,1400,0,0,null,0,0,1400,0,56000,0]
[null,"","Pack and Count Cantaloupe",400,null,"Carton",3.5,null,1400,0,0,null,0,0,1400,0,56000,0]
[null,"Seed"]
[null,"","Cantaloupe Seedlings",24,null,"Thousand",25,null,600,0,0,null,0,0,600,0,24000,0]
[null,"Miscellaneous"]
[null,"","DripTape (2 seasons)",6550,null,"Foot",3.1899999999999998E-2,null,208.94499999999999,0,0,null,0,0,208.94499999999999,0,8357.7999999999993,0]
[null,"","Plastic Mulch, 3x4K'",0.61,null,"Roll",198,null,120.78,0,0,null,0,0,120.78,0,4831.2,0]
[null,"","Sulfuric Acid",27,null,"Ounce",0.2218016206305081,null,5.988643757023719,0,0,null,0,0,5.988643757023719,0,239.54575028094877,0]
[null,"Herbicide"]
[null,"","Prefar 4E",2.75,null,"Quart",23.794999999999998,null,65.436250000000001,0,0,null,0,0,65.436250000000001,0,2617.4499999999998,0]
[null,"Other Labor"]
[null,"","Unallocated Labor",0.8992,null,"Hour",15,null,13.488,0,0,null,0,0,13.488,0,539.52,0]
[null,"","Transplant Melons",8,null,"Hour",15,null,120,0,0,null,0,0,120,0,4800,0]
[null,"","Pickup Plastic",8,null,"Hour",15,null,120,0,0,null,0,0,120,0,4800,0]
[null,"Insecticide"]
[null,"","Admire Pro",0.4375,null,"Pint",26.279999999999998,null,11.497499999999999,0,0,null,0,0,11.497499999999999,0,459.9,0]
[null,"","Asana XL ",5.8,null,"Ounce",0.62460937500000002,null,3.6227343749999998,0,0,null,0,0,3.6227343749999998,0,144.90937499999998,0]
[null,"Fungicides"]
[null,"","Bravo Ultrex",1,null,"Pound",10.232481751824817,null,10.232481751824817,0,0,null,0,0,10.232481751824817,0,409.29927007299273,0]
[null,"","Quadris",32,null,"Ounce",1.5621093749999999,null,49.987499999999997,0,0,null,0,0,49.987499999999997,0,1999.5,0]
[null,null,null,0,null,null,0,null,0,0,0,null,0,0,0,0,0,0]
[null,null,null,0,null,null,0,null,0,0,0,null,0,0,0,0,0,0]
[null,null,null,0,null,null,0,null,0,{"$f":"E44*H44","v":0},0,null,0,{"$f":"J44*L44","v":0},0,{"$f":"+J44-N44","v":0},0,{"$f":"+J44*E$7","v":0}]
[null,"Irrigation"]
[null,null,"Water Cost",1.1760000000000004,null,"Acre/Foot",33.006802721088434,null,38.81600000000001,{"$f":"E46*H46","v":0},0,null,0,{"$f":"J46*L46","v":0},38.81600000000001,{"$f":"+J46-N46","v":0},1552.6400000000003,{"$f":"+J46*E$7","v":0}]
[null,null,"Irrigation Labor",3.0000000000000013,null,"Hour",17.5,null,52.500000000000021,0,0,null,0,0,52.500000000000021,0,2100.0000000000009,0]
[null,"Machinery Labor"]
[null,null,"Tractors/Self-Propelled",1.36,null,"Hour",17.21,null,23.405600000000003,{"$f":"E49*H49","v":0},0,null,0,{"$f":"J49*L49","v":0},23.405600000000003,{"$f":"+J49-N49","v":0},936.22400000000016,{"$f":"+J49*E$7","v":0}]
[null,null,"Other Labor",0.41,null,"Hour",17.21,null,7.0560999999999998,{"$f":"E50*H50","v":0},0,null,0,{"$f":"J50*L50","v":0},7.0560999999999998,{"$f":"+J50-N50","v":0},282.24399999999997,{"$f":"+J50*E$7","v":0}]
[]
[null,"Diesel Fuel"]
[null,null,"Pickup/General Use Equipment",1,null,"Acre",0,null,0,{"$f":"E53*H53","v":0},0,null,0,{"$f":"J53*L53","v":0},0,{"$f":"+J53-N53","v":0},0,{"$f":"+J53*E$7","v":0}]
[null,null,"Tractors/Self-Propelled",8.7799999999999994,null,"Gallon",2.2400000000000002,null,19.667200000000001,{"$f":"E54*H54","v":0},0,null,0,{"$f":"J54*L54","v":0},19.667200000000001,{"$f":"+J54-N54","v":0},786.6880000000001,{"$f":"+J54*E$7","v":0}]
[]
[null,"Gasoline"]
[null,null,"Pickup/General Use Equipment",1,null,"Acre",0,null,0,{"$f":"E57*H57","v":0},0,null,0,{"$f":"J57*L57","v":0},0,{"$f":"+J57-N57","v":0},0,{"$f":"+J57*E$7","v":0}]
[null,null,"Tractors/Self-Propelled",0,null,"Gallon",2.09,null,0,{"$f":"E58*H58","v":0},0,null,0,{"$f":"J58*L58","v":0},0,{"$f":"+J58-N58","v":0},0,{"$f":"+J58*E$7","v":0}]
[]
[null,"Repairs & Maintenance"]
[null,null,"Pickup/General Use Equipment",1,null,"Acre",0,null,0,{"$f":"E61*H61","v":0},0,null,0,{"$f":"J61*L61","v":0},0,{"$f":"+J61-N61","v":0},0,{"$f":"+J61*E$7","v":0}]
[null,null,"Irrigation Equipment",1,null,"Acre",0,null,0,0,0,null,0,0,0,0,0,0]
[null,null,"Tractors/Self-Propelled",1,null,"Acre",20.515538965250119,null,20.515538965250119,0,0,null,0,0,20.515538965250119,0,820.62155861000474,0]
[null,null,"Implements",1,null,"Acre",11.232292718101657,null,11.232292718101657,0,0,null,0,0,11.232292718101657,0,449.29170872406632,0]
[null,null,null,null,null,null,null,null,0,0,0,null,0,0,0,0,0,0]
[null,null,null,null,null,null,null,null,0,0,0,null,0,0,0,0,0,0]
[null,"Interest on Credit Line",null,null,null,null,0.08,null,64.995443125532873,{"$f":"+SUM(J17:J66)/2*H67","v":0},null,null,0,{"$f":"+SUM(N17:N66)/2*L67","v":0},64.995443125532873,{"$f":"+SUM(P17:P66)/2*L67","v":0},2599.8177250213148,{"$f":"+J67*E$7","v":0}]
["Total Variable Costs",null,null,null,null,null,null,null,4644.8642846927323,{"$f":"SUM(J18:J67)","v":0},null,null,0,{"$f":"SUM(N18:N67)","v":0},4644.8642846927323,{"$f":"SUM(P18:P67)","v":0},185794.57138770929,{"$f":"SUM(R18:R67)","v":0}]
["Planned Returns Above Variable Costs:",null,null,null,null,null,null,null,-844.86428469273233,{"$f":"+J13-J68","v":0},null,null,0,{"$f":"+N13-N68","v":0},-844.86428469273233,{"$f":"+P13-P68","v":0},-33794.571387709293,{"$f":"+R13-R68","v":0}]
[null,"Breakeven Price to Cover Variable Costs",null,null,null,null,11.61216071173183,{"$f":"IF(E10=0,\"n/a\",(YVarExp-(YTotExp+YTotRet-J10))/E10)","v":"n/a"},"Carton"]
[null,null,null,null,null,null,null,null,null,null,null,null,null,null,null,null,"Enterprise","Enterprise"]
["FIXED COSTS",null,null,"Quantity","Quantity","Units","$/Unit","$/Unit","Total","Total","Share","Share","Landlord","Landlord","Tenant","Tenant","Total","Total"]
[null,"Machinery Depreciation"]
[null,null,"Tractors/Self-Propelled",1,null,"Acre",21.199390264091793,null,21.199390264091793,{"$f":"E74*H74","v":0},0,null,0,{"$f":"J74*L74","v":0},21.199390264091793,{"$f":"+J74-N74","v":0},847.97561056367169,{"$f":"+J74*E$7","v":0}]
[null,null,"Implements",1,null,"Acre",12.277534190764339,null,12.277534190764339,0,0,null,0,{"$f":"J75*L75","v":0},12.277534190764339,0,491.10136763057358,0]
[null,"Equipment Investment"]
[null,null,"Tractors/Self-Propelled",165.15008867026347,null,"Dollars",0.08,null,13.212007093621079,{"$f":"E77*H77","v":0},0,null,0,{"$f":"J77*L77","v":0},13.212007093621079,{"$f":"+J77-N77","v":0},528.48028374484318,{"$f":"+J77*E$7","v":0}]
[null,null,"Implements",62.990329323011302,null,"Dollars",0.08,null,5.0392263458409046,0,0,null,0,{"$f":"J78*L78","v":0},5.0392263458409046,0,201.56905383363619,0]
[null,"Salaried Labor",null,1,null,"Acre",0,null,0,0,0,null,0,{"$f":"J79*L79","v":0},0,{"$f":"+J79-N79","v":0},0,{"$f":"+J79*E$7","v":0}]
[null,"Management Fee, Owner/Operator Labor",null,1,null,"Acre",0,null,0,0,0,null,0,0,0,0,0,0]
[null,"Allocated Establishment Cost",null,1,null,"Acre",0,null,0,0,0,null,0,0,0,0,0,0]
[null,"Cash Rent, Irrigated Vegetables",null,1,null,"Acre",110,null,110,0,0,null,0,0,110,0,4400,0]
[null,"Property Taxes",null,1,null,"Acre",0,null,0,0,0,null,0,0,0,0,0,0]
[null,"Whole Farm Insurance",null,1,null,"Acre",0,null,0,0,0,null,0,0,0,0,0,0]
[null,null,null,1,null,null,0,null,0,0,0,null,0,0,0,0,0,0]
[null,null,null,1,null,null,0,null,0,{"$f":"E86*H86","v":0},0,null,0,0,0,0,0,0]
["Total Fixed Costs",null,null,null,null,null,null,null,161.72815789431812,{"$f":"+SUM(J74:J86)","v":0},null,null,0,{"$f":"+SUM(N74:N86)","v":0},161.72815789431812,{"$f":"+SUM(P74:P86)","v":0},6469.1263157727244,{"$f":"+SUM(R74:R86)","v":0}]
["Total Specified Costs",null,null,null,null,null,null,null,4806.5924425870508,{"$f":"+J68+J87","v":0},null,null,0,{"$f":"+N68+N87","v":0},4806.5924425870508,{"$f":"+P68+P87","v":0},192263.69770348203,{"$f":"+R68+R87","v":0}]
[]
["Returns Above Specified Costs",null,null,null,null,null,null,null,-1006.5924425870508,{"$f":"+J13-J88","v":0},null,null,0,{"$f":"+N13-N88","v":0},-1006.5924425870508,{"$f":"+P13-P88","v":0},-40263.69770348203,{"$f":"+R13-R88","v":0}]
[]
["    Breakeven Price to Cover Total Costs",null,null,null,null,null,12.016481106467626,{"$f":"IF(E10=0,\"n/a\",(YTotExp-(YTotExp+YTotRet-J10))/E10)","v":"n/a"},"Carton"]
[]
[null,null,null,"Example Breakeven Prices"]
[null,"Example","Example","To Cover",null,null,"To Cover"]
[null,"Yield","Yield","Variable",null,null,"Total"]
[null,"Percent","Carton","Costs",null,null,"Costs"]
[null,0.75,300,15.482880948975774,null,null,16.021974808623501]
[null,0.9,360,12.902400790813145,null,null,13.351645673852918]
[null,1,400,11.61216071173183,null,null,12.016481106467626]
[null,1.1000000000000001,440.00000000000006,10.556509737938027,null,null,10.924073733152387]
[null,1.25,500,9.2897285693854652,null,null,9.6131848851741015]
[]
["  Developed by Samuel Zapata, Assistant Professor and Extension Economist, Texas A&M AgriLife Extension, 956-968-5581.  "]
[]
["Information presented is prepared solely as a general guide and not intended to recognize or predict the costs and returns from any one operation.  Brand names are mentioned only as examples and imply no endorsement."]

{"sheet":"HoneyDew","index":26,"n_rows":107,"n_cols":18,"rows_kept":107,"cut":false,"hidden":false,"merged":[[94,3,94,8],[106,0,106,11],[0,0,0,11],[1,0,1,11],[2,0,2,11],[3,0,3,11]]}
["Projections for Planning Purposes Only -- Not to be Used without Updating"]
["2023 Estimated Costs and Returns per Acre"]
["Honeydew, Plastic Mulch, Drip Irrigated, Rio Grande Valley"]
["Enter your name for this budget in the cell above."]
["Enter  Your Values in the cells highlighed in MAROON."]
[null,null,null,null,"Your Acres",null,null,null,null,null,null,null,null,null,null,null,null,"Your"]
[null,null,"Crop Acres",40,null,null,null,null,null,null,null,"Your",null,null,null,null,"Enterprise","Enterprise"]
[null,null,null,null,"Your",null,null,"Your","Cash","Your","Landlord","Landlord",null,"Your",null,"Your","Total","Total"]
["REVENUE",null,null,"Quantity","Quantity","Units","$/Unit","$/Unit","Total","Total","Share","Share","Landlord","Landlord","Tenant","Tenant","(40 acres)",{"$f":"\"(\" & E7 & \" acres)\"","v":"( acres)"}]
[null,"Honeydews           ",null,800,null,"Carton",9,null,7200,{"$f":"E10*H10","v":0},0,null,0,{"$f":"J10*L10","v":0},7200,{"$f":"+J10-N10","v":0},288000,{"$f":"+J10*E$7","v":0}]
[null,null,null,0,null,null,0,null,0,0,0,null,0,0,0,{"$f":"+J11-N11","v":0},0,0]
[null,null,null,0,null,null,0,null,0,0,0,null,0,0,0,0,0,0]
["Total Revenue",null,null,null,null,null,null,null,7200,{"$f":"SUM(J10:J12)","v":0},null,null,0,{"$f":"SUM(N10:N12)","v":0},7200,{"$f":"SUM(P10:P12)","v":0},288000,{"$f":"SUM(R10:R12)","v":0}]
[null,null,null,null,null,null,null,null,null,null,null,null,null,null,null,null,"Enterprise","Enterprise"]
["VARIABLE COSTS",null,null,"Quantity","Quantity","Units","$/Unit","$/Unit","Total","Total","Share","Share","Landlord","Landlord","Tenant","Tenant","Total","Total"]
["Production Costs"]
[null,"Fertilizer"]
[null,"","Phosphorus (46% P2O5)",1.5,null,"CWT",43.15,null,64.724999999999994,{"$f":"E18*H18","v":0},0,null,0,{"$f":"J18*L18","v":0},64.724999999999994,{"$f":"+J18-N18","v":0},2589,{"$f":"+J18*E$7","v":0}]
[null,"","UAN (32% N)",3.7399999999999993,null,"CWT",33.950000000000003,null,126.97299999999998,0,0,null,0,0,126.97299999999998,0,5078.9199999999992,0]
[null,"Custom"]
[null,"","Bee Rental",1,null,"Hive",85,null,85,0,0,null,0,0,85,0,3400,0]
[null,"","Harvest Honeydew",800,null,"Carton",2.5,null,2000,0,0,null,0,0,2000,0,80000,0]
[null,"","Pack and Count Honeydew",800,null,"Carton",3.5,null,2800,0,0,null,0,0,2800,0,112000,0]
[null,"Miscellaneous"]
[null,"","DripTape (2 seasons)",6550,null,"Foot",3.1899999999999998E-2,null,208.94499999999999,0,0,null,0,0,208.94499999999999,0,8357.7999999999993,0]
[null,"","Plastic Mulch, 3x4K'",0.61,null,"Roll",198,null,120.78,0,0,null,0,0,120.78,0,4831.2,0]
[null,"","Sulfuric Acid",27,null,"Ounce",0.2218016206305081,null,5.988643757023719,0,0,null,0,0,5.988643757023719,0,239.54575028094877,0]
[null,"Herbicide"]
[null,"","Prefar 4E",2.75,null,"Quart",23.794999999999998,null,65.436250000000001,0,0,null,0,0,65.436250000000001,0,2617.4499999999998,0]
[null,"Seed"]
[null,"","Honeydew Seeds",0.83,null,"Pound",634.79843953185957,null,526.88270481144343,0,0,null,0,0,526.88270481144343,0,21075.308192457738,0]
[null,"","Honeydew Seedlings",13,null,"Thousand",35,null,455,0,0,null,0,0,455,0,18200,0]
[null,"Other Labor"]
[null,"","Unallocated Labor",0.8992,null,"Hour",15,null,13.488,0,0,null,0,0,13.488,0,539.52,0]
[null,"","Transplant Melons",8,null,"Hour",15,null,120,0,0,null,0,0,120,0,4800,0]
[null,"","Pickup Plastic",8,null,"Hour",15,null,120,0,0,null,0,0,120,0,4800,0]
[null,"Insecticide"]
[null,"","Admire Pro",0.4375,null,"Pint",26.279999999999998,null,11.497499999999999,0,0,null,0,0,11.497499999999999,0,459.9,0]
[null,"","Asana XL ",5.8,null,"Ounce",0.62460937500000002,null,3.6227343749999998,0,0,null,0,0,3.6227343749999998,0,144.90937499999998,0]
[null,"Fungicides"]
[null,"","Bravo Ultrex",1,null,"Pound",10.232481751824817,null,10.232481751824817,0,0,null,0,0,10.232481751824817,0,409.29927007299273,0]
[null,"","Quadris",32,null,"Ounce",1.5621093749999999,null,49.987499999999997,0,0,null,0,0,49.987499999999997,0,1999.5,0]
[null,null,null,0,null,null,0,null,0,0,0,null,0,0,0,0,0,0]
[null,null,null,0,null,null,0,null,0,0,0,null,0,0,0,0,0,0]
[null,null,null,0,null,null,0,null,0,{"$f":"E45*H45","v":0},0,null,0,{"$f":"J45*L45","v":0},0,{"$f":"+J45-N45","v":0},0,{"$f":"+J45*E$7","v":0}]
[null,"Irrigation"]
[null,null,"Water Cost",1.1760000000000004,null,"Acre/Foot",33.006802721088434,null,38.81600000000001,{"$f":"E47*H47","v":0},0,null,0,{"$f":"J47*L47","v":0},38.81600000000001,{"$f":"+J47-N47","v":0},1552.6400000000003,{"$f":"+J47*E$7","v":0}]
[null,null,"Irrigation Labor",0.19600000000000012,null,"Hour",17.5,null,3.4300000000000019,0,0,null,0,0,3.4300000000000019,0,137.20000000000007,0]
[null,"Machinery Labor"]
[null,null,"Tractors/Self-Propelled",1.36,null,"Hour",17.21,null,23.405600000000003,{"$f":"E50*H50","v":0},0,null,0,{"$f":"J50*L50","v":0},23.405600000000003,{"$f":"+J50-N50","v":0},936.22400000000016,{"$f":"+J50*E$7","v":0}]
[null,null,"Other Labor",0.41,null,"Hour",17.21,null,7.0560999999999998,{"$f":"E51*H51","v":0},0,null,0,{"$f":"J51*L51","v":0},7.0560999999999998,{"$f":"+J51-N51","v":0},282.24399999999997,{"$f":"+J51*E$7","v":0}]
[]
[null,"Diesel Fuel"]
[null,null,"Pickup/General Use Equipment",1,null,"Acre",0,null,0,{"$f":"E54*H54","v":0},0,null,0,{"$f":"J54*L54","v":0},0,{"$f":"+J54-N54","v":0},0,{"$f":"+J54*E$7","v":0}]
[null,null,"Tractors/Self-Propelled",8.86,null,"Gallon",2.2400000000000002,null,19.846399999999999,{"$f":"E55*H55","v":0},0,null,0,{"$f":"J55*L55","v":0},19.846399999999999,{"$f":"+J55-N55","v":0},793.85599999999999,{"$f":"+J55*E$7","v":0}]
[]
[null,"Gasoline"]
[null,null,"Pickup/General Use Equipment",1,null,"Acre",0,null,0,{"$f":"E58*H58","v":0},0,null,0,{"$f":"J58*L58","v":0},0,{"$f":"+J58-N58","v":0},0,{"$f":"+J58*E$7","v":0}]
[null,null,"Tractors/Self-Propelled",0,null,"Gallon",2.09,null,0,{"$f":"E59*H59","v":0},0,null,0,{"$f":"J59*L59","v":0},0,{"$f":"+J59-N59","v":0},0,{"$f":"+J59*E$7","v":0}]
[]
[null,"Repairs & Maintenance"]
[null,null,"Pickup/General Use Equipment",1,null,"Acre",0,null,0,{"$f":"E62*H62","v":0},0,null,0,{"$f":"J62*L62","v":0},0,{"$f":"+J62-N62","v":0},0,{"$f":"+J62*E$7","v":0}]
[null,null,"Irrigation Equipment",1,null,"Acre",0,null,0,0,0,null,0,0,0,0,0,0]
[null,null,"Tractors/Self-Propelled",1,null,"Acre",20.919726638562217,null,20.919726638562217,0,0,null,0,0,20.919726638562217,0,836.78906554248874,0]
[null,null,"Implements",1,null,"Acre",11.232292718101657,null,11.232292718101657,0,0,null,0,0,11.232292718101657,0,449.29170872406632,0]
[null,null,null,null,null,null,null,null,0,0,0,null,0,0,0,0,0,0]
[null,null,null,null,null,null,null,null,0,0,0,null,0,0,0,0,0,0]
[null,"Interest on Credit Line",null,null,null,null,0.08,null,159.56241632441757,{"$f":"+SUM(J17:J67)/2*H68","v":0},null,null,0,{"$f":"+SUM(N17:N67)/2*L68","v":0},159.56241632441757,{"$f":"+SUM(P17:P67)/2*L68","v":0},6382.4966529767025,{"$f":"+J68*E$7","v":0}]
["Total Variable Costs",null,null,null,null,null,null,null,7072.827350376373,{"$f":"SUM(J18:J68)","v":0},null,null,0,{"$f":"SUM(N18:N68)","v":0},7072.827350376373,{"$f":"SUM(P18:P68)","v":0},282913.09401505505,{"$f":"SUM(R18:R68)","v":0}]
["Planned Returns Above Variable Costs:",null,null,null,null,null,null,null,127.17264962362697,{"$f":"+J13-J69","v":0},null,null,0,{"$f":"+N13-N69","v":0},127.17264962362697,{"$f":"+P13-P69","v":0},5086.905984944955,{"$f":"+R13-R69","v":0}]
[null,"Breakeven Price to Cover Variable Costs",null,null,null,null,8.8410341879704664,{"$f":"IF(E10=0,\"n/a\",(YVarExp-(YTotExp+YTotRet-J10))/E10)","v":"n/a"},"Carton"]
[null,null,null,null,null,null,null,null,null,null,null,null,null,null,null,null,"Enterprise","Enterprise"]
["FIXED COSTS",null,null,"Quantity","Quantity","Units","$/Unit","$/Unit","Total","Total","Share","Share","Landlord","Landlord","Tenant","Tenant","Total","Total"]
[null,"Machinery Depreciation"]
[null,null,"Tractors/Self-Propelled",1,null,"Acre",21.617050859847627,null,21.617050859847627,{"$f":"E75*H75","v":0},0,null,0,{"$f":"J75*L75","v":0},21.617050859847627,{"$f":"+J75-N75","v":0},864.68203439390504,{"$f":"+J75*E$7","v":0}]
[null,null,"Implements",1,null,"Acre",12.277534190764339,null,12.277534190764339,0,0,null,0,{"$f":"J76*L76","v":0},12.277534190764339,0,491.10136763057358,0]
[null,"Equipment Investment"]
[null,null,"Tractors/Self-Propelled",168.40379944042587,null,"Dollars",0.08,null,13.47230395523407,{"$f":"E78*H78","v":0},0,null,0,{"$f":"J78*L78","v":0},13.47230395523407,{"$f":"+J78-N78","v":0},538.89215820936283,{"$f":"+J78*E$7","v":0}]
[null,null,"Implements",62.990329323011302,null,"Dollars",0.08,null,5.0392263458409046,0,0,null,0,{"$f":"J79*L79","v":0},5.0392263458409046,0,201.56905383363619,0]
[null,"Salaried Labor",null,1,null,"Acre",0,null,0,0,0,null,0,{"$f":"J80*L80","v":0},0,{"$f":"+J80-N80","v":0},0,{"$f":"+J80*E$7","v":0}]
[null,"Management Fee, Owner/Operator Labor",null,1,null,"Acre",0,null,0,0,0,null,0,0,0,0,0,0]
[null,"Allocated Establishment Cost",null,1,null,"Acre",0,null,0,0,0,null,0,0,0,0,0,0]
[null,"Cash Rent, Irrigated Vegetables",null,1,null,"Acre",110,null,110,0,0,null,0,0,110,0,4400,0]
[null,"Property Taxes",null,1,null,"Acre",0,null,0,0,0,null,0,0,0,0,0,0]
[null,"Whole Farm Insurance",null,1,null,"Acre",0,null,0,0,0,null,0,0,0,0,0,0]
[null,null,null,1,null,null,0,null,0,0,0,null,0,0,0,0,0,0]
[null,null,null,1,null,null,0,null,0,{"$f":"E87*H87","v":0},0,null,0,0,0,0,0,0]
["Total Fixed Costs",null,null,null,null,null,null,null,162.40611535168694,{"$f":"+SUM(J75:J87)","v":0},null,null,0,{"$f":"+SUM(N75:N87)","v":0},162.40611535168694,{"$f":"+SUM(P75:P87)","v":0},6496.2446140674774,{"$f":"+SUM(R75:R87)","v":0}]
["Total Specified Costs",null,null,null,null,null,null,null,7235.2334657280599,{"$f":"+J69+J88","v":0},null,null,0,{"$f":"+N69+N88","v":0},7235.2334657280599,{"$f":"+P69+P88","v":0},289409.33862912253,{"$f":"+R69+R88","v":0}]
[]
["Returns Above Specified Costs",null,null,null,null,null,null,null,-35.233465728059855,{"$f":"+J13-J89","v":0},null,null,0,{"$f":"+N13-N89","v":0},-35.233465728059855,{"$f":"+P13-P89","v":0},-1409.3386291225324,{"$f":"+R13-R89","v":0}]
[]
["    Breakeven Price to Cover Total Costs",null,null,null,null,null,9.0440418321600742,{"$f":"IF(E10=0,\"n/a\",(YTotExp-(YTotExp+YTotRet-J10))/E10)","v":"n/a"},"Carton"]
[]
[null,null,null,"Example Breakeven Prices"]
[null,"Example","Example","To Cover",null,null,"To Cover"]
[null,"Yield","Yield","Variable",null,null,"Total"]
[null,"Percent","Carton","Costs",null,null,"Costs"]
[null,0.75,600,11.788045583960622,null,null,12.0587224428801]
[null,0.9,720,9.823371319967185,null,null,10.048935369066751]
[null,1,800,8.8410341879704664,null,null,9.0440418321600742]
[null,1.1000000000000001,880.00000000000011,8.0373038072458769,null,null,8.2218562110546127]
[null,1.25,1000,7.0728273503763734,null,null,7.2352334657280597]
[]
["  Developed by Samuel Zapata, Assistant Professor and Extension Economist, Texas A&M AgriLife Extension, 956-968-5581.  "]
[]
["Information presented is prepared solely as a general guide and not intended to recognize or predict the costs and returns from any one operation.  Brand names are mentioned only as examples and imply no endorsement."]

{"sheet":"Onion","index":27,"n_rows":105,"n_cols":18,"rows_kept":105,"cut":false,"hidden":false,"merged":[[92,3,92,8],[104,0,104,11],[0,0,0,11],[1,0,1,11],[2,0,2,11],[3,0,3,11]]}
["Projections for Planning Purposes Only -- Not to be Used without Updating"]
["2023 Estimated Costs and Returns per Acre"]
["Onion, Hybrid Yellow Varieties, Furrow Irrigated, Rio Grande Valley"]
["Enter your name for this budget in the cell above."]
["Enter  Your Values in the cells highlighed in MAROON."]
[null,null,null,null,"Your Acres",null,null,null,null,null,null,null,null,null,null,null,null,"Your"]
[null,null,"Crop Acres",100,null,null,null,null,null,null,null,"Your",null,null,null,null,"Enterprise","Enterprise"]
[null,null,null,null,"Your",null,null,"Your","Cash","Your","Landlord","Landlord",null,"Your",null,"Your","Total","Total"]
["REVENUE",null,null,"Quantity","Quantity","Units","$/Unit","$/Unit","Total","Total","Share","Share","Landlord","Landlord","Tenant","Tenant","(100 acres)",{"$f":"\"(\" & E7 & \" acres)\"","v":"( acres)"}]
[null,"Onions, Yellow  ",null,750,null,"Sack",10,null,7500,{"$f":"E10*H10","v":0},0,null,0,{"$f":"J10*L10","v":0},7500,{"$f":"+J10-N10","v":0},750000,{"$f":"+J10*E$7","v":0}]
[null,null,null,0,null,null,0,null,0,0,0,null,0,0,0,{"$f":"+J11-N11","v":0},0,0]
[null,null,null,0,null,null,0,null,0,0,0,null,0,0,0,0,0,0]
["Total Revenue",null,null,null,null,null,null,null,7500,{"$f":"SUM(J10:J12)","v":0},null,null,0,{"$f":"SUM(N10:N12)","v":0},7500,{"$f":"SUM(P10:P12)","v":0},750000,{"$f":"SUM(R10:R12)","v":0}]
[null,null,null,null,null,null,null,null,null,null,null,null,null,null,null,null,"Enterprise","Enterprise"]
["VARIABLE COSTS",null,null,"Quantity","Quantity","Units","$/Unit","$/Unit","Total","Total","Share","Share","Landlord","Landlord","Tenant","Tenant","Total","Total"]
["Production Costs"]
[null,"Fertilizer"]
[null,"","Fertilizer 10-34-0",2,null,"CWT",39.75,null,79.5,{"$f":"E18*H18","v":0},0,null,0,{"$f":"J18*L18","v":0},79.5,{"$f":"+J18-N18","v":0},7950,{"$f":"+J18*E$7","v":0}]
[null,"","Micronutrients",7,null,"Quart",8.9875000000000007,null,62.912500000000009,0,0,null,0,0,62.912500000000009,0,6291.2500000000009,0]
[null,"","UAN (32% N)",3.12,null,"CWT",33.950000000000003,null,105.92400000000001,0,0,null,0,0,105.92400000000001,0,10592.400000000001,0]
[null,"Custom"]
[null,"","Harvest Onions",750,null,"Bag",2.25,null,1687.5,0,0,null,0,0,1687.5,0,168750,0]
[null,"","Drying Onions",750,null,"Bag",0.75,null,562.5,0,0,null,0,0,562.5,0,56250,0]
[null,"","Pack and Count Onions",750,null,"Bag",2.5,null,1875,0,0,null,0,0,1875,0,187500,0]
[null,"Insecticide"]
[null,"","Lorsban 4E",1.75,null,"Pint",14.1975,null,24.845624999999998,0,0,null,0,0,24.845624999999998,0,2484.5625,0]
[null,"","Lambda",9.6000000000000014,null,"Ounce",0.46875,null,4.5000000000000009,0,0,null,0,0,4.5000000000000009,0,450.00000000000011,0]
[null,"Herbicide"]
[null,"","Prefar 4E",2.75,null,"Quart",23.794999999999998,null,65.436250000000001,0,0,null,0,0,65.436250000000001,0,6543.625,0]
[null,"","Goaltender",6.25E-2,null,"Gallon",149.94999999999999,null,9.3718749999999993,0,0,null,0,0,9.3718749999999993,0,937.18749999999989,0]
[null,"","Trifluralin 4EC",1,null,"Pint",4.7475000000000005,null,4.7475000000000005,0,0,null,0,0,4.7475000000000005,0,474.75000000000006,0]
[null,"Seed"]
[null,"","Onion Seed",100,null,"Thousand",4.75,null,475,0,0,null,0,0,475,0,47500,0]
[null,"Fungicides"]
[null,"","Dithane F-45",2,null,"Quart",10.995000000000001,null,21.990000000000002,0,0,null,0,0,21.990000000000002,0,2199,0]
[null,"","Rovral 4f",3,null,"Pint",14.997499999999999,null,44.992499999999993,0,0,null,0,0,44.992499999999993,0,4499.2499999999991,0]
[null,"","Ridomil Gold SC",80,null,"Ounce",1.2375,null,99,0,0,null,0,0,99,0,9900,0]
[null,"","Bravo Ultrex",2,null,"Pound",10.232481751824817,null,20.464963503649635,0,0,null,0,0,20.464963503649635,0,2046.4963503649635,0]
[null,"Other Labor"]
[null,"","Unallocated Labor",0.1527,null,"Hour",15,null,2.2905000000000002,0,0,null,0,0,2.2905000000000002,0,229.05,0]
[null,null,null,0,null,null,0,null,0,0,0,null,0,0,0,0,0,0]
[null,null,null,0,null,null,0,null,0,0,0,null,0,0,0,0,0,0]
[null,null,null,0,null,null,0,null,0,{"$f":"E43*H43","v":0},0,null,0,{"$f":"J43*L43","v":0},0,{"$f":"+J43-N43","v":0},0,{"$f":"+J43*E$7","v":0}]
[null,"Irrigation"]
[null,null,"Water Cost",2.8,null,"Acre/Foot",23.142857142857149,null,64.800000000000011,{"$f":"E45*H45","v":0},0,null,0,{"$f":"J45*L45","v":0},64.800000000000011,{"$f":"+J45-N45","v":0},6480.0000000000009,{"$f":"+J45*E$7","v":0}]
[null,null,"Irrigation Labor",7.3999999999999995,null,"Hour",17.5,null,129.5,0,0,null,0,0,129.5,0,12950,0]
[null,"Machinery Labor"]
[null,null,"Tractors/Self-Propelled",2.58,null,"Hour",17.21,null,44.401800000000001,{"$f":"E48*H48","v":0},0,null,0,{"$f":"J48*L48","v":0},44.401800000000001,{"$f":"+J48-N48","v":0},4440.18,{"$f":"+J48*E$7","v":0}]
[null,null,"Other Labor",0,null,"Hour",17.21,null,0,{"$f":"E49*H49","v":0},0,null,0,{"$f":"J49*L49","v":0},0,{"$f":"+J49-N49","v":0},0,{"$f":"+J49*E$7","v":0}]
[]
[null,"Diesel Fuel"]
[null,null,"Pickup/General Use Equipment",1,null,"Acre",0,null,0,{"$f":"E52*H52","v":0},0,null,0,{"$f":"J52*L52","v":0},0,{"$f":"+J52-N52","v":0},0,{"$f":"+J52*E$7","v":0}]
[null,null,"Tractors/Self-Propelled",14.81,null,"Gallon",2.2400000000000002,null,33.174400000000006,{"$f":"E53*H53","v":0},0,null,0,{"$f":"J53*L53","v":0},33.174400000000006,{"$f":"+J53-N53","v":0},3317.4400000000005,{"$f":"+J53*E$7","v":0}]
[]
[null,"Gasoline"]
[null,null,"Pickup/General Use Equipment",1,null,"Acre",0,null,0,{"$f":"E56*H56","v":0},0,null,0,{"$f":"J56*L56","v":0},0,{"$f":"+J56-N56","v":0},0,{"$f":"+J56*E$7","v":0}]
[null,null,"Tractors/Self-Propelled",0,null,"Gallon",2.09,null,0,{"$f":"E57*H57","v":0},0,null,0,{"$f":"J57*L57","v":0},0,{"$f":"+J57-N57","v":0},0,{"$f":"+J57*E$7","v":0}]
[]
[null,"Repairs & Maintenance"]
[null,null,"Pickup/General Use Equipment",1,null,"Acre",0,null,0,{"$f":"E60*H60","v":0},0,null,0,{"$f":"J60*L60","v":0},0,{"$f":"+J60-N60","v":0},0,{"$f":"+J60*E$7","v":0}]
[null,null,"Irrigation Equipment",1,null,"Acre",0,null,0,0,0,null,0,0,0,0,0,0]
[null,null,"Tractors/Self-Propelled",1,null,"Acre",33.992129299669521,null,33.992129299669521,0,0,null,0,0,33.992129299669521,0,3399.2129299669523,0]
[null,null,"Implements",1,null,"Acre",19.952573116599243,null,19.952573116599243,0,0,null,0,0,19.952573116599243,0,1995.2573116599244,0]
[null,null,null,null,null,null,null,null,0,0,0,null,0,0,0,0,0,0]
[null,null,null,null,null,null,null,null,0,0,0,null,0,0,0,0,0,0]
[null,"Interest on Credit Line",null,null,null,null,0.08,null,42.857245778075892,{"$f":"+SUM(J17:J65)/2*H66","v":0},null,null,0,{"$f":"+SUM(N17:N65)/2*L66","v":0},42.857245778075892,{"$f":"+SUM(P17:P65)/2*L66","v":0},4285.7245778075894,{"$f":"+J66*E$7","v":0}]
["Total Variable Costs",null,null,null,null,null,null,null,5514.6538616979942,{"$f":"SUM(J18:J66)","v":0},null,null,0,{"$f":"SUM(N18:N66)","v":0},5514.6538616979942,{"$f":"SUM(P18:P66)","v":0},551465.38616979949,{"$f":"SUM(R18:R66)","v":0}]
["Planned Returns Above Variable Costs:",null,null,null,null,null,null,null,1985.3461383020058,{"$f":"+J13-J67","v":0},null,null,0,{"$f":"+N13-N67","v":0},1985.3461383020058,{"$f":"+P13-P67","v":0},198534.61383020051,{"$f":"+R13-R67","v":0}]
[null,"Breakeven Price to Cover Variable Costs",null,null,null,null,7.3528718155973261,{"$f":"IF(E10=0,\"n/a\",(YVarExp-(YTotExp+YTotRet-J10))/E10)","v":"n/a"},"Sack"]
[null,null,null,null,null,null,null,null,null,null,null,null,null,null,null,null,"Enterprise","Enterprise"]
["FIXED COSTS",null,null,"Quantity","Quantity","Units","$/Unit","$/Unit","Total","Total","Share","Share","Landlord","Landlord","Tenant","Tenant","Total","Total"]
[null,"Machinery Depreciation"]
[null,null,"Tractors/Self-Propelled",1,null,"Acre",34.85933432534582,null,34.85933432534582,{"$f":"E73*H73","v":0},0,null,0,{"$f":"J73*L73","v":0},34.85933432534582,{"$f":"+J73-N73","v":0},3485.9334325345822,{"$f":"+J73*E$7","v":0}]
[null,null,"Implements",1,null,"Acre",23.065823032570865,null,23.065823032570865,0,0,null,0,{"$f":"J74*L74","v":0},23.065823032570865,0,2306.5823032570866,0]
[null,"Equipment Investment"]
[null,null,"Tractors/Self-Propelled",271.56545934100041,null,"Dollars",0.08,null,21.725236747280032,{"$f":"E76*H76","v":0},0,null,0,{"$f":"J76*L76","v":0},21.725236747280032,{"$f":"+J76-N76","v":0},2172.5236747280032,{"$f":"+J76*E$7","v":0}]
[null,null,"Implements",107.70155824554298,null,"Dollars",0.08,null,8.6161246596434395,0,0,null,0,{"$f":"J77*L77","v":0},8.6161246596434395,0,861.61246596434398,0]
[null,"Salaried Labor",null,1,null,"Acre",0,null,0,0,0,null,0,{"$f":"J78*L78","v":0},0,{"$f":"+J78-N78","v":0},0,{"$f":"+J78*E$7","v":0}]
[null,"Management Fee, Owner/Operator Labor",null,1,null,"Acre",0,null,0,0,0,null,0,0,0,0,0,0]
[null,"Allocated Establishment Cost",null,1,null,"Acre",0,null,0,0,0,null,0,0,0,0,0,0]
[null,"Cash Rent, Irrigated Vegetables",null,1,null,"Acre",110,null,110,0,0,null,0,0,110,0,11000,0]
[null,"Property Taxes",null,1,null,"Acre",0,null,0,0,0,null,0,0,0,0,0,0]
[null,"Whole Farm Insurance",null,1,null,"Acre",0,null,0,0,0,null,0,0,0,0,0,0]
[null,null,null,1,null,null,0,null,0,0,0,null,0,0,0,0,0,0]
[null,null,null,1,null,null,0,null,0,{"$f":"E85*H85","v":0},0,null,0,0,0,0,0,0]
["Total Fixed Costs",null,null,null,null,null,null,null,198.26651876484016,{"$f":"+SUM(J73:J85)","v":0},null,null,0,{"$f":"+SUM(N73:N85)","v":0},198.26651876484016,{"$f":"+SUM(P73:P85)","v":0},19826.651876484015,{"$f":"+SUM(R73:R85)","v":0}]
["Total Specified Costs",null,null,null,null,null,null,null,5712.9203804628341,{"$f":"+J67+J86","v":0},null,null,0,{"$f":"+N67+N86","v":0},5712.9203804628341,{"$f":"+P67+P86","v":0},571292.03804628353,{"$f":"+R67+R86","v":0}]
[]
["Returns Above Specified Costs",null,null,null,null,null,null,null,1787.0796195371659,{"$f":"+J13-J87","v":0},null,null,0,{"$f":"+N13-N87","v":0},1787.0796195371659,{"$f":"+P13-P87","v":0},178707.96195371647,{"$f":"+R13-R87","v":0}]
[]
["    Breakeven Price to Cover Total Costs",null,null,null,null,null,7.6172271739504458,{"$f":"IF(E10=0,\"n/a\",(YTotExp-(YTotExp+YTotRet-J10))/E10)","v":"n/a"},"Sack"]
[]
[null,null,null,"Example Breakeven Prices"]
[null,"Example","Example","To Cover",null,null,"To Cover"]
[null,"Yield","Yield","Variable",null,null,"Total"]
[null,"Percent","Sack","Costs",null,null,"Costs"]
[null,0.75,562.5,9.8038290874631002,null,null,10.156302898600593]
[null,0.9,675,8.1698575728859169,null,null,8.4635857488338289]
[null,1,750,7.3528718155973261,null,null,7.6172271739504458]
[null,1.1000000000000001,825.00000000000011,6.6844289232702954,null,null,6.9247519763185856]
[null,1.25,937.5,5.8822974524778608,null,null,6.0937817391603568]
[]
["  Developed by Samuel Zapata, Assistant Professor and Extension Economist, Texas A&M AgriLife Extension, 956-968-5581.  "]
[]
["Information presented is prepared solely as a general guide and not intended to recognize or predict the costs and returns from any one operation.  Brand names are mentioned only as examples and imply no endorsement."]

{"sheet":"Watermelon","index":28,"n_rows":105,"n_cols":18,"rows_kept":105,"cut":false,"hidden":false,"merged":[[92,3,92,8],[104,0,104,11],[0,0,0,11],[1,0,1,11],[2,0,2,11],[3,0,3,11]]}
["Projections for Planning Purposes Only -- Not to be Used without Updating"]
["2023 Estimated Costs and Returns per Acre"]
["Watermelon, Seedless, Plastic Mulch, Drip Irrigated, Rio Grande Valley"]
["Enter your name for this budget in the cell above."]
["Enter  Your Values in the cells highlighed in MAROON."]
[null,null,null,null,"Your Acres",null,null,null,null,null,null,null,null,null,null,null,null,"Your"]
[null,null,"Crop Acres",40,null,null,null,null,null,null,null,"Your",null,null,null,null,"Enterprise","Enterprise"]
[null,null,null,null,"Your",null,null,"Your","Cash","Your","Landlord","Landlord",null,"Your",null,"Your","Total","Total"]
["REVENUE",null,null,"Quantity","Quantity","Units","$/Unit","$/Unit","Total","Total","Share","Share","Landlord","Landlord","Tenant","Tenant","(40 acres)",{"$f":"\"(\" & E7 & \" acres)\"","v":"( acres)"}]
[null,"Watermelon, seedless",null,450,null,"CWT",16,null,7200,{"$f":"E10*H10","v":0},0,null,0,{"$f":"J10*L10","v":0},7200,{"$f":"+J10-N10","v":0},288000,{"$f":"+J10*E$7","v":0}]
[null,null,null,0,null,null,0,null,0,0,0,null,0,0,0,{"$f":"+J11-N11","v":0},0,0]
[null,null,null,0,null,null,0,null,0,0,0,null,0,0,0,0,0,0]
["Total Revenue",null,null,null,null,null,null,null,7200,{"$f":"SUM(J10:J12)","v":0},null,null,0,{"$f":"SUM(N10:N12)","v":0},7200,{"$f":"SUM(P10:P12)","v":0},288000,{"$f":"SUM(R10:R12)","v":0}]
[null,null,null,null,null,null,null,null,null,null,null,null,null,null,null,null,"Enterprise","Enterprise"]
["VARIABLE COSTS",null,null,"Quantity","Quantity","Units","$/Unit","$/Unit","Total","Total","Share","Share","Landlord","Landlord","Tenant","Tenant","Total","Total"]
["Production Costs"]
[null,"Fertilizer"]
[null,"","Phosphorus (46% P2O5)",1.74,null,"CWT",43.15,null,75.081000000000003,{"$f":"E18*H18","v":0},0,null,0,{"$f":"J18*L18","v":0},75.081000000000003,{"$f":"+J18-N18","v":0},3003.2400000000002,{"$f":"+J18*E$7","v":0}]
[null,"","UAN (32% N)",2.5,null,"CWT",33.950000000000003,null,84.875,0,0,null,0,0,84.875,0,3395,0]
[null,"Custom"]
[null,"","Bee Rental",1,null,"Hive",85,null,85,0,0,null,0,0,85,0,3400,0]
[null,"","Harvest and Sell Watermelons",450,null,"CWT",8.5,null,3825,0,0,null,0,0,3825,0,153000,0]
[null,"Insecticide"]
[null,"","Asana XL ",5.8,null,"Ounce",0.62460937500000002,null,3.6227343749999998,0,0,null,0,0,3.6227343749999998,0,144.90937499999998,0]
[null,"Herbicide"]
[null,"","Trifluralin 4EC",2.75,null,"Pint",4.7475000000000005,null,13.055625000000001,0,0,null,0,0,13.055625000000001,0,522.22500000000002,0]
[null,"Seed"]
[null,"","Hybrid Watermelon Seed",2.1,null,"Thousand",30,null,63,0,0,null,0,0,63,0,2520,0]
[null,"","Watermelon Seedlings",2.1,null,"Thousand",115,null,241.5,0,0,null,0,0,241.5,0,9660,0]
[null,"Miscellaneous"]
[null,"","DripTape (2 seasons)",6550,null,"Foot",3.1899999999999998E-2,null,208.94499999999999,0,0,null,0,0,208.94499999999999,0,8357.7999999999993,0]
[null,"","Plastic Mulch, 3x4K'",0.61,null,"Roll",198,null,120.78,0,0,null,0,0,120.78,0,4831.2,0]
[null,"","Sulfuric Acid",26,null,"Ounce",0.2218016206305081,null,5.7668421363932101,0,0,null,0,0,5.7668421363932101,0,230.67368545572839,0]
[null,"Other Labor"]
[null,"","Transplant Melons",8,null,"Hour",15,null,120,0,0,null,0,0,120,0,4800,0]
[null,"","Pickup Plastic",8,null,"Hour",15,null,120,0,0,null,0,0,120,0,4800,0]
[null,"","Unallocated Labor",0.8992,null,"Hour",15,null,13.488,0,0,null,0,0,13.488,0,539.52,0]
[null,"Fungicides"]
[null,"","Bravo Ultrex",1,null,"Pound",10.232481751824817,null,10.232481751824817,0,0,null,0,0,10.232481751824817,0,409.29927007299273,0]
[null,"","Quadris",32,null,"Ounce",1.5621093749999999,null,49.987499999999997,0,0,null,0,0,49.987499999999997,0,1999.5,0]
[null,null,null,0,null,null,0,null,0,0,0,null,0,0,0,0,0,0]
[null,null,null,0,null,null,0,null,0,0,0,null,0,0,0,0,0,0]
[null,null,null,0,null,null,0,null,0,{"$f":"E43*H43","v":0},0,null,0,{"$f":"J43*L43","v":0},0,{"$f":"+J43-N43","v":0},0,{"$f":"+J43*E$7","v":0}]
[null,"Irrigation"]
[null,null,"Water Cost",1.1340000000000003,null,"Acre/Foot",33.636684303350954,null,38.143999999999991,{"$f":"E45*H45","v":0},0,null,0,{"$f":"J45*L45","v":0},38.143999999999991,{"$f":"+J45-N45","v":0},1525.7599999999998,{"$f":"+J45*E$7","v":0}]
[null,null,"Irrigation Labor",0.18900000000000011,null,"Hour",17.5,null,3.3075000000000019,0,0,null,0,0,3.3075000000000019,0,132.30000000000007,0]
[null,"Machinery Labor"]
[null,null,"Tractors/Self-Propelled",1.4,null,"Hour",17.21,null,24.094000000000001,{"$f":"E48*H48","v":0},0,null,0,{"$f":"J48*L48","v":0},24.094000000000001,{"$f":"+J48-N48","v":0},963.76,{"$f":"+J48*E$7","v":0}]
[null,null,"Other Labor",0.41,null,"Hour",17.21,null,7.0560999999999998,{"$f":"E49*H49","v":0},0,null,0,{"$f":"J49*L49","v":0},7.0560999999999998,{"$f":"+J49-N49","v":0},282.24399999999997,{"$f":"+J49*E$7","v":0}]
[]
[null,"Diesel Fuel"]
[null,null,"Pickup/General Use Equipment",1,null,"Acre",0,null,0,{"$f":"E52*H52","v":0},0,null,0,{"$f":"J52*L52","v":0},0,{"$f":"+J52-N52","v":0},0,{"$f":"+J52*E$7","v":0}]
[null,null,"Tractors/Self-Propelled",9,null,"Gallon",2.2400000000000002,null,20.160000000000004,{"$f":"E53*H53","v":0},0,null,0,{"$f":"J53*L53","v":0},20.160000000000004,{"$f":"+J53-N53","v":0},806.40000000000009,{"$f":"+J53*E$7","v":0}]
[]
[null,"Gasoline"]
[null,null,"Pickup/General Use Equipment",1,null,"Acre",0,null,0,{"$f":"E56*H56","v":0},0,null,0,{"$f":"J56*L56","v":0},0,{"$f":"+J56-N56","v":0},0,{"$f":"+J56*E$7","v":0}]
[null,null,"Tractors/Self-Propelled",0,null,"Gallon",2.09,null,0,{"$f":"E57*H57","v":0},0,null,0,{"$f":"J57*L57","v":0},0,{"$f":"+J57-N57","v":0},0,{"$f":"+J57*E$7","v":0}]
[]
[null,"Repairs & Maintenance"]
[null,null,"Pickup/General Use Equipment",1,null,"Acre",0,null,0,{"$f":"E60*H60","v":0},0,null,0,{"$f":"J60*L60","v":0},0,{"$f":"+J60-N60","v":0},0,{"$f":"+J60*E$7","v":0}]
[null,null,"Irrigation Equipment",1,null,"Acre",0,null,0,0,0,null,0,0,0,0,0,0]
[null,null,"Tractors/Self-Propelled",1,null,"Acre",21.023444957062281,null,21.023444957062281,0,0,null,0,0,21.023444957062281,0,840.93779828249126,0]
[null,null,"Implements",1,null,"Acre",10.350267293474397,null,10.350267293474397,0,0,null,0,0,10.350267293474397,0,414.01069173897588,0]
[null,null,null,null,null,null,null,null,0,0,0,null,0,0,0,0,0,0]
[null,null,null,null,null,null,null,null,0,0,0,null,0,0,0,0,0,0]
[null,"Interest on Credit Line",null,null,null,null,0.08,null,50.184185529088516,{"$f":"+SUM(J17:J65)/2*H66","v":0},null,null,0,{"$f":"+SUM(N17:N65)/2*L66","v":0},50.184185529088516,{"$f":"+SUM(P17:P65)/2*L66","v":0},2007.3674211635407,{"$f":"+J66*E$7","v":0}]
["Total Variable Costs",null,null,null,null,null,null,null,5214.6536810428443,{"$f":"SUM(J18:J66)","v":0},null,null,0,{"$f":"SUM(N18:N66)","v":0},5214.6536810428443,{"$f":"SUM(P18:P66)","v":0},208586.14724171368,{"$f":"SUM(R18:R66)","v":0}]
["Planned Returns Above Variable Costs:",null,null,null,null,null,null,null,1985.3463189571557,{"$f":"+J13-J67","v":0},null,null,0,{"$f":"+N13-N67","v":0},1985.3463189571557,{"$f":"+P13-P67","v":0},79413.852758286317,{"$f":"+R13-R67","v":0}]
[null,"Breakeven Price to Cover Variable Costs",null,null,null,null,11.58811929120632,{"$f":"IF(E10=0,\"n/a\",(YVarExp-(YTotExp+YTotRet-J10))/E10)","v":"n/a"},"CWT"]
[null,null,null,null,null,null,null,null,null,null,null,null,null,null,null,null,"Enterprise","Enterprise"]
["FIXED COSTS",null,null,"Quantity","Quantity","Units","$/Unit","$/Unit","Total","Total","Share","Share","Landlord","Landlord","Tenant","Tenant","Total","Total"]
[null,"Machinery Depreciation"]
[null,null,"Tractors/Self-Propelled",1,null,"Acre",21.724226455631023,null,21.724226455631023,{"$f":"E73*H73","v":0},0,null,0,{"$f":"J73*L73","v":0},21.724226455631023,{"$f":"+J73-N73","v":0},868.96905822524093,{"$f":"+J73*E$7","v":0}]
[null,null,"Implements",1,null,"Acre",12.375516465407523,null,12.375516465407523,0,0,null,0,{"$f":"J74*L74","v":0},12.375516465407523,0,495.02065861630092,0]
[null,"Equipment Investment"]
[null,null,"Tractors/Self-Propelled",169.23873190435137,null,"Dollars",0.08,null,13.53909855234811,{"$f":"E76*H76","v":0},0,null,0,{"$f":"J76*L76","v":0},13.53909855234811,{"$f":"+J76-N76","v":0},541.56394209392442,{"$f":"+J76*E$7","v":0}]
[null,null,"Implements",54.737104632058973,null,"Dollars",0.08,null,4.378968370564718,0,0,null,0,{"$f":"J77*L77","v":0},4.378968370564718,0,175.15873482258871,0]
[null,"Salaried Labor",null,1,null,"Acre",0,null,0,0,0,null,0,{"$f":"J78*L78","v":0},0,{"$f":"+J78-N78","v":0},0,{"$f":"+J78*E$7","v":0}]
[null,"Management Fee, Owner/Operator Labor",null,1,null,"Acre",0,null,0,0,0,null,0,0,0,0,0,0]
[null,"Allocated Establishment Cost",null,1,null,"Acre",0,null,0,0,0,null,0,0,0,0,0,0]
[null,"Cash Rent, Irrigated Vegetables",null,1,null,"Acre",110,null,110,0,0,null,0,0,110,0,4400,0]
[null,"Property Taxes",null,1,null,"Acre",0,null,0,0,0,null,0,0,0,0,0,0]
[null,"Whole Farm Insurance",null,1,null,"Acre",0,null,0,0,0,null,0,0,0,0,0,0]
[null,null,null,1,null,null,0,null,0,0,0,null,0,0,0,0,0,0]
[null,null,null,1,null,null,0,null,0,{"$f":"E85*H85","v":0},0,null,0,0,0,0,0,0]
["Total Fixed Costs",null,null,null,null,null,null,null,162.01780984395137,{"$f":"+SUM(J73:J85)","v":0},null,null,0,{"$f":"+SUM(N73:N85)","v":0},162.01780984395137,{"$f":"+SUM(P73:P85)","v":0},6480.7123937580545,{"$f":"+SUM(R73:R85)","v":0}]
["Total Specified Costs",null,null,null,null,null,null,null,5376.6714908867953,{"$f":"+J67+J86","v":0},null,null,0,{"$f":"+N67+N86","v":0},5376.6714908867953,{"$f":"+P67+P86","v":0},215066.85963547174,{"$f":"+R67+R86","v":0}]
[]
["Returns Above Specified Costs",null,null,null,null,null,null,null,1823.3285091132047,{"$f":"+J13-J87","v":0},null,null,0,{"$f":"+N13-N87","v":0},1823.3285091132047,{"$f":"+P13-P87","v":0},72933.140364528255,{"$f":"+R13-R87","v":0}]
[]
["    Breakeven Price to Cover Total Costs",null,null,null,null,null,11.948158868637323,{"$f":"IF(E10=0,\"n/a\",(YTotExp-(YTotExp+YTotRet-J10))/E10)","v":"n/a"},"CWT"]
[]
[null,null,null,"Example Breakeven Prices"]
[null,"Example","Example","To Cover",null,null,"To Cover"]
[null,"Yield","Yield","Variable",null,null,"Total"]
[null,"Percent","CWT","Costs",null,null,"Costs"]
[null,0.75,337.5,15.450825721608428,null,null,15.930878491516431]
[null,0.9,405,12.875688101340357,null,null,13.275732076263692]
[null,1,450,11.58811929120632,null,null,11.948158868637323]
[null,1.1000000000000001,495.00000000000006,10.534653901096654,null,null,10.86196260785211]
[null,1.25,562.5,9.2704954329650562,null,null,9.5585270949098575]
[]
["  Developed by Samuel Zapata, Assistant Professor and Extension Economist, Texas A&M AgriLife Extension, 956-968-5581.  "]
[]
["Information presented is prepared solely as a general guide and not intended to recognize or predict the costs and returns from any one operation.  Brand names are mentioned only as examples and imply no endorsement."]

{"sheet":"WatermelonDryland","index":29,"n_rows":94,"n_cols":18,"rows_kept":94,"cut":false,"hidden":false,"merged":[[81,3,81,8],[93,0,93,11],[0,0,0,11],[1,0,1,11],[2,0,2,11],[3,0,3,11]]}
["Projections for Planning Purposes Only -- Not to be Used without Updating"]
["2023 Estimated Costs and Returns per Acre"]
["Watermelon, Open Pollinated Varieties, Dryland, Rio Grande Valley"]
["Enter your name for this budget in the cell above."]
["Enter  Your Values in the cells highlighed in MAROON."]
[null,null,null,null,"Your Acres",null,null,null,null,null,null,null,null,null,null,null,null,"Your"]
[null,null,"Crop Acres",40,null,null,null,null,null,null,null,"Your",null,null,null,null,"Enterprise","Enterprise"]
[null,null,null,null,"Your",null,null,"Your","Cash","Your","Landlord","Landlord",null,"Your",null,"Your","Total","Total"]
["REVENUE",null,null,"Quantity","Quantity","Units","$/Unit","$/Unit","Total","Total","Share","Share","Landlord","Landlord","Tenant","Tenant","(40 acres)",{"$f":"\"(\" & E7 & \" acres)\"","v":"( acres)"}]
[null,"Watermelon, Allsweet",null,250,null,"CWT",14,null,3500,{"$f":"E10*H10","v":0},0,null,0,{"$f":"J10*L10","v":0},3500,{"$f":"+J10-N10","v":0},140000,{"$f":"+J10*E$7","v":0}]
[null,null,null,0,null,null,0,null,0,0,0,null,0,0,0,{"$f":"+J11-N11","v":0},0,0]
[null,null,null,0,null,null,0,null,0,0,0,null,0,0,0,0,0,0]
["Total Revenue",null,null,null,null,null,null,null,3500,{"$f":"SUM(J10:J12)","v":0},null,null,0,{"$f":"SUM(N10:N12)","v":0},3500,{"$f":"SUM(P10:P12)","v":0},140000,{"$f":"SUM(R10:R12)","v":0}]
[null,null,null,null,null,null,null,null,null,null,null,null,null,null,null,null,"Enterprise","Enterprise"]
["VARIABLE COSTS",null,null,"Quantity","Quantity","Units","$/Unit","$/Unit","Total","Total","Share","Share","Landlord","Landlord","Tenant","Tenant","Total","Total"]
["Production Costs"]
[null,"Fertilizer"]
[null,"","Fertilizer 10-34-0",1.5,null,"CWT",39.75,null,59.625,{"$f":"E18*H18","v":0},0,null,0,{"$f":"J18*L18","v":0},59.625,{"$f":"+J18-N18","v":0},2385,{"$f":"+J18*E$7","v":0}]
[null,"Custom"]
[null,"","Bee Rental",1,null,"Hive",85,null,85,0,0,null,0,0,85,0,3400,0]
[null,"","Harvest and Sell Watermelons",250,null,"CWT",8.5,null,2125,0,0,null,0,0,2125,0,85000,0]
[null,"Insecticide"]
[null,"","Asana XL ",11.6,null,"Ounce",0.62460937500000002,null,7.2454687499999997,0,0,null,0,0,7.2454687499999997,0,289.81874999999997,0]
[null,"Seed"]
[null,"","Watermelon Seed,  OP",3,null,"Thousand",7,null,21,0,0,null,0,0,21,0,840,0]
[null,"Herbicide"]
[null,"","Trifluralin 4EC",2,null,"Pint",4.7475000000000005,null,9.495000000000001,0,0,null,0,0,9.495000000000001,0,379.80000000000007,0]
[null,"Fungicides"]
[null,"","Bravo Ultrex",1,null,"Pound",10.232481751824817,null,10.232481751824817,0,0,null,0,0,10.232481751824817,0,409.29927007299273,0]
[null,"","Quadris",32,null,"Ounce",1.5621093749999999,null,49.987499999999997,0,0,null,0,0,49.987499999999997,0,1999.5,0]
[null,"Other Labor"]
[null,"","Unallocated Labor",0.93359999999999999,null,"Hour",15,null,14.004,0,0,null,0,0,14.004,0,560.16,0]
[null,null,null,0,null,null,0,null,0,0,0,null,0,0,0,0,0,0]
[null,null,null,0,null,null,0,null,0,0,0,null,0,0,0,0,0,0]
[null,null,null,0,null,null,0,null,0,{"$f":"E35*H35","v":0},0,null,0,{"$f":"J35*L35","v":0},0,{"$f":"+J35-N35","v":0},0,{"$f":"+J35*E$7","v":0}]
[null,"Machinery Labor"]
[null,null,"Tractors/Self-Propelled",1.43,null,"Hour",17.21,null,24.610299999999999,{"$f":"E37*H37","v":0},0,null,0,{"$f":"J37*L37","v":0},24.610299999999999,{"$f":"+J37-N37","v":0},984.41199999999992,{"$f":"+J37*E$7","v":0}]
[null,null,"Other Labor",0,null,"Hour",17.21,null,0,{"$f":"E38*H38","v":0},0,null,0,{"$f":"J38*L38","v":0},0,{"$f":"+J38-N38","v":0},0,{"$f":"+J38*E$7","v":0}]
[]
[null,"Diesel Fuel"]
[null,null,"Pickup/General Use Equipment",1,null,"Acre",0,null,0,{"$f":"E41*H41","v":0},0,null,0,{"$f":"J41*L41","v":0},0,{"$f":"+J41-N41","v":0},0,{"$f":"+J41*E$7","v":0}]
[null,null,"Tractors/Self-Propelled",9.23,null,"Gallon",2.2400000000000002,null,20.675200000000004,{"$f":"E42*H42","v":0},0,null,0,{"$f":"J42*L42","v":0},20.675200000000004,{"$f":"+J42-N42","v":0},827.00800000000015,{"$f":"+J42*E$7","v":0}]
[]
[null,"Gasoline"]
[null,null,"Pickup/General Use Equipment",1,null,"Acre",0,null,0,{"$f":"E45*H45","v":0},0,null,0,{"$f":"J45*L45","v":0},0,{"$f":"+J45-N45","v":0},0,{"$f":"+J45*E$7","v":0}]
[null,null,"Tractors/Self-Propelled",0,null,"Gallon",2.09,null,0,{"$f":"E46*H46","v":0},0,null,0,{"$f":"J46*L46","v":0},0,{"$f":"+J46-N46","v":0},0,{"$f":"+J46*E$7","v":0}]
[]
[null,"Repairs & Maintenance"]
[null,null,"Pickup/General Use Equipment",1,null,"Acre",0,null,0,{"$f":"E49*H49","v":0},0,null,0,{"$f":"J49*L49","v":0},0,{"$f":"+J49-N49","v":0},0,{"$f":"+J49*E$7","v":0}]
[null,null,"Irrigation Equipment",1,null,"Acre",0,null,0,0,0,null,0,0,0,0,0,0]
[null,null,"Tractors/Self-Propelled",1,null,"Acre",21.515418248579113,null,21.515418248579113,0,0,null,0,0,21.515418248579113,0,860.6167299431645,0]
[null,null,"Implements",1,null,"Acre",15.919754686485556,null,15.919754686485556,0,0,null,0,0,15.919754686485556,0,636.79018745942221,0]
[null,null,null,null,null,null,null,null,0,0,0,null,0,0,0,0,0,0]
[null,null,null,null,null,null,null,null,0,0,0,null,0,0,0,0,0,0]
[null,"Interest on Credit Line",null,null,null,null,0.08,null,7.0072537470318874,{"$f":"+SUM(J17:J54)/2*H55","v":0},null,null,0,{"$f":"+SUM(N17:N54)/2*L55","v":0},7.0072537470318874,{"$f":"+SUM(P17:P54)/2*L55","v":0},280.29014988127551,{"$f":"+J55*E$7","v":0}]
["Total Variable Costs",null,null,null,null,null,null,null,2471.3173771839211,{"$f":"SUM(J18:J55)","v":0},null,null,0,{"$f":"SUM(N18:N55)","v":0},2471.3173771839211,{"$f":"SUM(P18:P55)","v":0},98852.695087356871,{"$f":"SUM(R18:R55)","v":0}]
["Planned Returns Above Variable Costs:",null,null,null,null,null,null,null,1028.6826228160789,{"$f":"+J13-J56","v":0},null,null,0,{"$f":"+N13-N56","v":0},1028.6826228160789,{"$f":"+P13-P56","v":0},41147.304912643129,{"$f":"+R13-R56","v":0}]
[null,"Breakeven Price to Cover Variable Costs",null,null,null,null,9.8852695087356839,{"$f":"IF(E10=0,\"n/a\",(YVarExp-(YTotExp+YTotRet-J10))/E10)","v":"n/a"},"CWT"]
[null,null,null,null,null,null,null,null,null,null,null,null,null,null,null,null,"Enterprise","Enterprise"]
["FIXED COSTS",null,null,"Quantity","Quantity","Units","$/Unit","$/Unit","Total","Total","Share","Share","Landlord","Landlord","Tenant","Tenant","Total","Total"]
[null,"Machinery Depreciation"]
[null,null,"Tractors/Self-Propelled",1,null,"Acre",22.135393630235821,null,22.135393630235821,{"$f":"E62*H62","v":0},0,null,0,{"$f":"J62*L62","v":0},22.135393630235821,{"$f":"+J62-N62","v":0},885.41574520943288,{"$f":"+J62*E$7","v":0}]
[null,null,"Implements",1,null,"Acre",18.931872041341325,null,18.931872041341325,0,0,null,0,{"$f":"J63*L63","v":0},18.931872041341325,0,757.27488165365298,0]
[null,"Equipment Investment"]
[null,null,"Tractors/Self-Propelled",172.44185682909523,null,"Dollars",0.08,null,13.795348546327618,{"$f":"E65*H65","v":0},0,null,0,{"$f":"J65*L65","v":0},13.795348546327618,{"$f":"+J65-N65","v":0},551.81394185310478,{"$f":"+J65*E$7","v":0}]
[null,null,"Implements",85.399513376517262,null,"Dollars",0.08,null,6.8319610701213813,0,0,null,0,{"$f":"J66*L66","v":0},6.8319610701213813,0,273.27844280485527,0]
[null,"Salaried Labor",null,1,null,"Acre",0,null,0,0,0,null,0,{"$f":"J67*L67","v":0},0,{"$f":"+J67-N67","v":0},0,{"$f":"+J67*E$7","v":0}]
[null,"Management Fee, Owner/Operator Labor",null,1,null,"Acre",0,null,0,0,0,null,0,0,0,0,0,0]
[null,"Allocated Establishment Cost",null,1,null,"Acre",0,null,0,0,0,null,0,0,0,0,0,0]
[null,"Cash Rent, South Texas",null,1,null,"Acre",65,null,65,0,0,null,0,0,65,0,2600,0]
[null,"Property Taxes",null,1,null,"Acre",0,null,0,0,0,null,0,0,0,0,0,0]
[null,"Whole Farm Insurance",null,1,null,"Acre",0,null,0,0,0,null,0,0,0,0,0,0]
[null,null,null,1,null,null,0,null,0,0,0,null,0,0,0,0,0,0]
[null,null,null,1,null,null,0,null,0,{"$f":"E74*H74","v":0},0,null,0,0,0,0,0,0]
["Total Fixed Costs",null,null,null,null,null,null,null,126.69457528802614,{"$f":"+SUM(J62:J74)","v":0},null,null,0,{"$f":"+SUM(N62:N74)","v":0},126.69457528802614,{"$f":"+SUM(P62:P74)","v":0},5067.7830115210463,{"$f":"+SUM(R62:R74)","v":0}]
["Total Specified Costs",null,null,null,null,null,null,null,2598.0119524719471,{"$f":"+J56+J75","v":0},null,null,0,{"$f":"+N56+N75","v":0},2598.0119524719471,{"$f":"+P56+P75","v":0},103920.47809887792,{"$f":"+R56+R75","v":0}]
[]
["Returns Above Specified Costs",null,null,null,null,null,null,null,901.9880475280529,{"$f":"+J13-J76","v":0},null,null,0,{"$f":"+N13-N76","v":0},901.9880475280529,{"$f":"+P13-P76","v":0},36079.521901122076,{"$f":"+R13-R76","v":0}]
[]
["    Breakeven Price to Cover Total Costs",null,null,null,null,null,10.392047809887789,{"$f":"IF(E10=0,\"n/a\",(YTotExp-(YTotExp+YTotRet-J10))/E10)","v":"n/a"},"CWT"]
[]
[null,null,null,"Example Breakeven Prices"]
[null,"Example","Example","To Cover",null,null,"To Cover"]
[null,"Yield","Yield","Variable",null,null,"Total"]
[null,"Percent","CWT","Costs",null,null,"Costs"]
[null,0.75,187.5,13.180359344980912,null,null,13.856063746517052]
[null,0.9,225,10.983632787484094,null,null,11.546719788764209]
[null,1,250,9.8852695087356839,null,null,10.392047809887789]
[null,1.1000000000000001,275,8.9866086443051678,null,null,9.4473161908070811]
[null,1.25,312.5,7.9082156069885476,null,null,8.3136382479102302]
[]
["  Developed by Samuel Zapata, Assistant Professor and Extension Economist, Texas A&M AgriLife Extension, 956-968-5581.  "]
[]
["Information presented is prepared solely as a general guide and not intended to recognize or predict the costs and returns from any one operation.  Brand names are mentioned only as examples and imply no endorsement."]

{"sheet":"Livestock Budget","index":30,"n_rows":116,"n_cols":8,"rows_kept":116,"cut":false,"hidden":false,"merged":[[98,4,98,5],[98,6,98,7],[104,2,104,7],[108,2,110,2],[108,3,110,3],[108,4,110,4],[108,5,108,7],[95,4,95,5],[95,6,95,7],[96,4,96,5],[96,6,96,7],[97,4,97,5],[97,6,97,7],[94,4,94,5],[94,6,94,7],[0,0,0,6],[2,0,2,6],[92,1,92,7],[93,4,93,5],[93,6,93,7]]}
["Estimated Costs and Returns per Animal or Breeding Female"]
[]
["Livestock Budget"]
[]
["Number of Head of Livestock",null,null,0]
[]
["Enter Your Values in the cells highlighed in MAROON.",null,null,null,null,null,null,"Enterprise"]
["REVENUE",null,"Head","Quantity","Units","$/Unit","Total","Total"]
[null,"Males Sold",0,0,"CWT",0,{"$f":"IF($D$5=0,0,C9/$D$5*D9*F9)","v":0},{"$f":"+G9*$D$5","v":0}]
[null,"Females Sold",0,0,"CWT",0,{"$f":"IF($D$5=0,0,C10/$D$5*D10*F10)","v":0},{"$f":"+G10*$D$5","v":0}]
[null,"Cull Breeding Females",0,0,"CWT",0,0,0]
[null,"Cull Breeding Males",0,0,"CWT",0,0,0]
[null,"Stocker or Feed Animal",0,0,"CWT",0,0,0]
[null,"Other Revenue",0,0,"CWT",0,0,0]
[null,"Other Revenue",0,0,"CWT",0,0,0]
[null,"Other Revenue",0,0,"CWT",0,0,0]
[]
["Total Revenue",null,null,null,null,null,{"$f":"+SUM(G9:G17)","v":0},{"$f":"+SUM(H9:H17)","v":0}]
[]
[null,null,null,null,null,null,null,"Enterprise"]
["VARIABLE COSTS",null,null,"Quantity","Units","$/Unit","Total","Total"]
["Production Costs"]
[null,"Animal Purchase Price, if applicable",null,0,"Cwt",0,{"$f":"D23*F23","v":0},{"$f":"+G23*$D$5","v":0}]
[null,"Pasture",{"$f":"+SUM(G25:G28)","v":0}]
[null,null,"Pasture 1",0,"Acre",0,{"$f":"D25*F25","v":0},{"$f":"+G25*$D$5","v":0}]
[null,null,"Pasture 2",0,"Acre",0,0,0]
[null,null,"Pasture 3",0,"Acre",0,0,0]
[null,null,"Pasture 4",0,"Acre",0,0,0]
[null,"Feed",{"$f":"SUM(G30:G37)","v":0}]
[null,null,"Hay",0,"Bales",0,{"$f":"D30*F30","v":0},{"$f":"+G30*$D$5","v":0}]
[null,null,"Supplement",0,"Cwt,lb,etc",0,{"$f":"D31*F31","v":0},{"$f":"+G31*$D$5","v":0}]
[null,null,"Salt Minerals",0,"Cwt",0,0,0]
[null,null,"Other Feed",0,"Cwt,lb,etc",0,0,0]
[null,null,"Other Feed",0,"Cwt,lb,etc",0,0,0]
[null,null,"Other Feed",0,"Cwt,lb,etc",0,0,0]
[null,null,"Other Feed",0,"Cwt,lb,etc",0,0,0]
[null,null,"Other Feed",0,"Cwt,lb,etc",0,0,0]
[null,"Health",{"$f":"SUM(G39:G48)","v":0}]
[null,null,"Vet/Medicine 1",0,"Visit,dose,cc's, etc.",0,{"$f":"D39*F39","v":0},{"$f":"+G39*$D$5","v":0}]
[null,null,"Vet/Medicine 2",0,"Visit,dose,cc's, etc.",0,0,0]
[null,null,"Vet/Medicine 3",0,"Visit,dose,cc's, etc.",0,0,0]
[null,null,"Vet/Medicine 4",0,"Visit,dose,cc's, etc.",0,0,0]
[null,null,"Vet/Medicine 5",0,"Visit,dose,cc's, etc.",0,0,0]
[null,null,"Vet/Medicine 6",0,"Visit,dose,cc's, etc.",0,0,0]
[null,null,"Vet/Medicine 7",0,"Visit,dose,cc's, etc.",0,0,0]
[null,null,"Vet/Medicine 8",0,"Visit,dose,cc's, etc.",0,0,0]
[null,null,"Vet/Medicine 9",0,"Visit,dose,cc's, etc.",0,0,0]
[null,null,"Vet/Medicine 10",0,"Visit,dose,cc's, etc.",0,0,0]
[]
[null,"Fuel, Lube, Repair",null,1,"Head",0,0,0]
[]
[null,"Labor",null,0,"Hours",0,0,0]
[]
[null,"Other Variable Expense",null,0,"Cwt,lb,etc",0,0,0]
[null,"Other Variable Expense",null,0,"Cwt,lb,etc",0,0,0]
[null,"Other Variable Expense",null,0,"Cwt,lb,etc",0,0,0]
[null,"Other Variable Expense",null,0,"Cwt,lb,etc",0,0,0]
[null,"Other Variable Expense",null,0,"Cwt,lb,etc",0,0,0]
[null,"Other Variable Expense",null,0,"Cwt,lb,etc",0,0,0]
[]
[null,"Operating Interest",null,null,null,0,{"$f":"+SUM(G23:G59)/2*F61","v":0},0]
[]
["Total Variable Costs",null,null,null,null,null,{"$f":"+SUM(G23:G62)","v":0},{"$f":"+SUM(H23:H62)","v":0}]
[]
["Planned Returns Above Variable Costs",null,null,null,null,null,{"$f":"+G18-G63","v":0},{"$f":"+H18-H63","v":0}]
[]
[null,"Breakeven Price to Cover Variable Costs",null,null,{"$f":"IF((H101/100+C13*D13)=0,0,(G63-SUM(G11:G12,G14:G16))/(H101/100+C13/D5*D13))","v":0},{"$f":"+E9","v":"CWT"}]
[]
[null,null,null,null,null,null,null,"Enterprise"]
["FIXED COSTS",null,null,"Quantity","Units","$/Unit","Total","Total"]
[null,"Depreciation - Equipment",null,0,"Head,$,etc",0,{"$f":"D71*F71","v":0},{"$f":"+G71*$D$5","v":0}]
[null,"Depreciation - Livestock",null,0,"Head,$,etc",0,{"$f":"D72*F72","v":0},0]
[null,"Equipment Investment",null,0,"Head,$,etc",0,0,0]
[null,"Insurance",null,0,"Head,$,etc",0,0,0]
[null,"Management Fee",null,0,"Head,$,etc",0,0,0]
[null,"Owner/Operator Labor",null,0,"Head,$,etc",0,0,0]
[null,"Salaried Labor",null,0,"Head,$,etc",0,0,0]
[null,"Other Fixed Expense",null,0,"Head,$,etc",0,0,0]
[null,"Other Fixed Expense",null,0,"Head,$,etc",0,0,0]
[null,"Other Fixed Expense",null,0,"Head,$,etc",0,0,0]
[null,"Other Fixed Expense",null,0,"Head,$,etc",0,0,0]
[null,"Other Fixed Expense",null,0,"Head,$,etc",0,0,0]
[]
[null,null,null,"Total Fixed Costs",null,null,{"$f":"+SUM(G71:G83)","v":0},{"$f":"+SUM(H71:H83)","v":0}]
[]
[null,null,null,"Total Specified Costs",null,null,{"$f":"+G63+G84","v":0},{"$f":"+H63+H84","v":0}]
[]
[null,null,null,"Returns Above Specifiied Costs",null,null,{"$f":"+G18-G86","v":0},{"$f":"+H18-H86","v":0}]
[]
[null,"Breakeven Price to Cover Total Costs",null,null,{"$f":"IF((H101/100+C13*D13)=0,0,(G86-SUM(G11:G12,G14:G16))/(H101/100+C13/D5*D13))","v":0},{"$f":"+F67","v":"CWT"}]
[]
[]
[null,"Sensitivity Analysis for Your Breeding Herd or Flock Values"]
[null,"Your Weaning Percent","Your Gross Sales per Head","Pounds Produced per Head",{"$f":"\"Your Breakeven Pay Weight to Cover Total Cost\"","v":"Your Breakeven Pay Weight to Cover Total Cost"},null,"Your Average Breakeven Price to Cover Total Cost"]
[null,{"$f":"+B96-0.03","v":-0.06},{"$f":"+IF($B$97=0,0,YTotRet-$G$9-$G$10+($G$9+$G$10)*B95/$B$97)","v":0},{"$f":"IF($B$97=0,0,$H$101*B95/$B$97+$H$102)","v":0},{"$f":"IF($C$97=0,0,(YTotExp-($G$18-$G$9-$G$10))/(YPrice/100)/(B95-$C$11/$D$5))","v":0},null,{"$f":"IF(D95-$H$102=0,0,(YTotExp-($G$18-$G$9-$G$10))/(D95-$H$102)*100)","v":0}]
[null,{"$f":"+B97-0.03","v":-0.03},{"$f":"+IF($B$97=0,0,YTotRet-$G$9-$G$10+($G$9+$G$10)*B96/$B$97)","v":0},{"$f":"IF($B$97=0,0,$H$101*B96/$B$97+$H$102)","v":0},{"$f":"IF($C$97=0,0,(YTotExp-($G$18-$G$9-$G$10))/(YPrice/100)/(B96-$C$11/$D$5))","v":0},null,{"$f":"IF(D96-$H$102=0,0,(YTotExp-($G$18-$G$9-$G$10))/(D96-$H$102)*100)","v":0}]
[null,0,{"$f":"+G18","v":0},{"$f":"H101+H102","v":0},{"$f":"IF($C$97=0,0,(YTotExp-($G$18-$G$9-$G$10))/(YPrice/100)/(B97-$C$11/$D$5))","v":0},null,{"$f":"IF(D97-$H$102=0,0,(YTotExp-($G$18-$G$9-$G$10))/(D97-$H$102)*100)","v":0}]
[null,{"$f":"+B97+0.03","v":0.03},{"$f":"+IF($B$97=0,0,YTotRet-$G$9-$G$10+($G$9+$G$10)*B98/$B$97)","v":0},{"$f":"IF($B$97=0,0,$H$101*B98/$B$97+$H$102)","v":0},{"$f":"IF($C$97=0,0,(YTotExp-($G$18-$G$9-$G$10))/(YPrice/100)/(B98-$C$11/$D$5))","v":0},null,{"$f":"IF(D98-$H$102=0,0,(YTotExp-($G$18-$G$9-$G$10))/(D98-$H$102)*100)","v":0}]
[null,{"$f":"+B98+0.03","v":0.06},{"$f":"+IF($B$97=0,0,YTotRet-$G$9-$G$10+($G$9+$G$10)*B99/$B$97)","v":0},{"$f":"IF($B$97=0,0,$H$101*B99/$B$97+$H$102)","v":0},{"$f":"IF($C$97=0,0,(YTotExp-($G$18-$G$9-$G$10))/(YPrice/100)/(B99-$C$11/$D$5))","v":0},null,{"$f":"IF(D99-$H$102=0,0,(YTotExp-($G$18-$G$9-$G$10))/(D99-$H$102)*100)","v":0}]
[]
[null,null,"Your Male Price",null,null,{"$f":"+F9","v":0},null,{"$f":"IF(D5=0,0,(C9*D9+C10*D10)*100/D5)","v":0}]
[null,null,"Your Female Price",null,null,{"$f":"+F10","v":0},null,{"$f":"IF(D5=0,0,(C11*D11+C12*D12)*100/D5)","v":0}]
[null,null,"Your Weighted Average Price ($/cwt)",null,null,{"$f":"+IF((C9*D9+C10*D10)=0,F13,(G9+G10)/((C9*D9+C10*D10)/D5))","v":0}]
[]
[null,null,"Your Stocker or Feeder Breakeven Sensitivity Analysis"]
[null,null,"Your Average Daily Gain",null,0,"Pounds per Day"]
[null,null,{"$f":"+\"Your Animal\"&IF(M25=\"Stocker\",\" Grazing\",\" Feeding\")&\" Days\"","v":"Your Animal Feeding Days"},null,0,"Days"]
[null,null,"Your Sale Shrink",null,0]
[null,null,"Average Daily Gain    (Pounds/day)","Net Pay Weight with Shrink   (Pounds)",null,{"$f":"+\"Purchase Weight (Pounds/Head): \"&D23*100","v":"Purchase Weight (Pounds/Head): 0"},null,"Sales Price/Cwt of $Total"]
[null,null,null,null,null,{"$f":"\"Sales Price        \"&IF(F13=\"\",\".00\",TEXT(F13,\"#.00\"))","v":"Sales Price        .00"},null,{"$f":"\"Purchase Price        \"&IF(F23=\"\",\".00\",TEXT(F23,\"#.00\"))","v":"Purchase Price        .00"}]
[null,null,null,null,null,"Breakeven Purchase Price ($/CWT)",null,"Breakeven Sales Price ($/CWT)"]
[null,null,{"$f":"+C114*1.2","v":0},{"$f":"+(C112*$E$107+$D$23*100)*(1-$E$108)","v":0},null,{"$f":"IF($D$23=0,0,(((D112*$F$13/100*($C$13/$D$5))-($G$86-SUM($G$14:$G$16)-$G$23))/(100*$D$23))*100)","v":0},null,{"$f":"IF($C$13=0,0,($G$86-SUM($G$14:$G$16))/(D112*($C$13/$D$5)*100))","v":0}]
[null,null,{"$f":"+C114*1.1","v":0},{"$f":"+(C113*$E$107+$D$23*100)*(1-$E$108)","v":0},null,{"$f":"IF($D$23=0,0,(((D113*$F$13/100*($C$13/$D$5))-($G$86-SUM($G$14:$G$16)-$G$23))/(100*$D$23))*100)","v":0},null,{"$f":"IF($C$13=0,0,($G$86-SUM($G$14:$G$16))/(D113*($C$13/$D$5)*100))","v":0}]
[null,null,{"$f":"+E106","v":0},{"$f":"+(C114*$E$107+$D$23*100)*(1-$E$108)","v":0},null,{"$f":"IF($D$23=0,0,(((D114*$F$13/100*($C$13/$D$5))-($G$86-SUM($G$14:$G$16)-$G$23))/(100*$D$23))*100)","v":0},null,{"$f":"IF($C$13=0,0,($G$86-SUM($G$14:$G$16))/(D114*($C$13/$D$5)*100))","v":0}]
[null,null,{"$f":"+C114*0.9","v":0},{"$f":"+(C115*$E$107+$D$23*100)*(1-$E$108)","v":0},null,{"$f":"IF($D$23=0,0,(((D115*$F$13/100*($C$13/$D$5))-($G$86-SUM($G$14:$G$16)-$G$23))/(100*$D$23))*100)","v":0},null,{"$f":"IF($C$13=0,0,($G$86-SUM($G$14:$G$16))/(D115*($C$13/$D$5)*100))","v":0}]
[null,null,{"$f":"+C114*0.8","v":0},{"$f":"+(C116*$E$107+$D$23*100)*(1-$E$108)","v":0},null,{"$f":"IF($D$23=0,0,(((D116*$F$13/100*($C$13/$D$5))-($G$86-SUM($G$14:$G$16)-$G$23))/(100*$D$23))*100)","v":0},null,{"$f":"IF($C$13=0,0,($G$86-SUM($G$14:$G$16))/(D116*($C$13/$D$5)*100))","v":0}]

{"sheet":"Crop Budget","index":31,"n_rows":155,"n_cols":7,"rows_kept":155,"cut":false,"hidden":false,"merged":[[0,0,0,6],[2,0,2,5],[146,1,146,6]]}
["Estimated Costs and Returns per Acre"]
[]
["Crop Enterprise"]
[]
["Number of Acres of Crop",null,null,0]
[]
["Enter Your Values in the cells highlighed in MAROON.",null,null,null,null,null,"Enterprise"]
["REVENUE",null,"Quantity","Units","$/Unit","Total","Total"]
[null,"Primary Product",0,"Cwt,lb,etc",0,{"$f":"C9*E9","v":0},{"$f":"+F9*$D$5","v":0}]
[null,"Secondary Product",0,"Cwt,lb,etc",0,{"$f":"C10*E10","v":0},{"$f":"+F10*$D$5","v":0}]
[null,"Secondary Product",0,"Cwt,lb,etc",0,0,0]
[null,"Secondary Product",0,"Cwt,lb,etc",0,0,0]
[null,"Secondary Product",0,"Cwt,lb,etc",0,0,0]
[null,"Secondary Product",0,"Cwt,lb,etc",0,0,0]
[null,"Secondary Product",0,"Cwt,lb,etc",0,0,0]
[null,"Secondary Product",0,"Cwt,lb,etc",0,0,0]
[]
["Total Revenue",null,null,null,null,{"$f":"+SUM(F9:F16)","v":0},{"$f":"+SUM(G9:G16)","v":0}]
[]
[null,null,null,null,null,null,"Enterprise"]
["VARIABLE COSTS",null,"Quantity","Units","$/Unit","Total","Total"]
[]
["Custom Field and Harvest Operations"]
[null,"Custom Field Operation 1",0,"Acre",0,{"$f":"C24*E24","v":0},{"$f":"+F24*$D$5","v":0}]
[null,"Custom Field Operation 2",0,"Acre",0,0,0]
[null,"Custom Field Operation 3",0,"Acre",0,0,0]
[null,"Custom Field Operation 4",0,"Acre",0,0,0]
[null,"Custom Field Operation 5",0,"Acre",0,0,0]
[null,"Custom Field Operation 6",0,"Acre",0,0,0]
["Machinery Expenses"]
[null,"Diesel",0,"Gallon",0,{"$f":"C31*E31","v":0},0]
[null,"Gasoline",0,"Gallon",0,0,0]
[null,"Lube",0,"Acre",0,0,0]
[null,"Repairs",0,"Acre",0,0,0]
[null,"Other Machinery Expense 1",0,"Acre",0,0,0]
[null,"Other Machinery Expense 2",0,"Acre",0,0,0]
["Labor"]
[null,"Labor 1",0,"Hour",0,{"$f":"C38*E38","v":0},0]
[null,"Labor 2",0,"Hour",0,0,0]
[null,"Labor 3",0,"Hour",0,0,0]
[null,"Labor 4",0,"Hour",0,0,0]
[null,"Labor 5",0,"Hour",0,0,0]
[null,"Irrigation Labor",0,"Hour",0,0,0]
["Seed or Transplants"]
[null,"Seed",0,"Pound",0,{"$f":"C45*E45","v":0},0]
[null,"Seed Treatment",0,"Pound",0,0,0]
[null,"Seed Fee",0,"Pound",0,0,0]
[null,"Transplants",0,"Thousand",0,0,0]
[null,"Mulch",0,"Foot",0,0,0]
[null,"Other Seed or Transplant",0,"Pound",0,0,0]
["Fertilizer and Lime"]
[null,"Fertlizer 1",0,"Pound",0,{"$f":"C52*E52","v":0},0]
[null,"Fertlizer 2",0,"Pound",0,0,0]
[null,"Fertlizer 3",0,"Pound",0,0,0]
[null,"Fertlizer 4",0,"Pound",0,0,0]
[null,"Fertlizer 5",0,"Pound",0,0,0]
[null,"Lime",0,"Ton",0,0,0]
[null,"Other Soil Amendment 1",0,"Pound",0,0,0]
[null,"Other Soil Amendment 2",0,"Pound",0,0,0]
["Herbicides"]
[null,"Herbicide 1",0,"Lb,Oz,Acre",0,{"$f":"C61*E61","v":0},0]
[null,"Herbicide 2",0,"Lb,Oz,Acre",0,0,0]
[null,"Herbicide 3",0,"Lb,Oz,Acre",0,0,0]
[null,"Herbicide 4",0,"Lb,Oz,Acre",0,0,0]
[null,"Herbicide 5",0,"Lb,Oz,Acre",0,0,0]
[null,"Herbicide 6",0,"Lb,Oz,Acre",0,0,0]
["Insecticides"]
[null,"Insecticide 1",0,"Lb,Oz,Acre",0,{"$f":"C68*E68","v":0},0]
[null,"Insecticide 2",0,"Lb,Oz,Acre",0,0,0]
[null,"Insecticide 3",0,"Lb,Oz,Acre",0,0,0]
[null,"Insecticide 4",0,"Lb,Oz,Acre",0,0,0]
[null,"Insecticide 5",0,"Lb,Oz,Acre",0,0,0]
[null,"Insecticide 6",0,"Lb,Oz,Acre",0,0,0]
["Fungicides"]
[null,"Fungicide 1",0,"Lb,Oz,Acre",0,{"$f":"C75*E75","v":0},0]
[null,"Fungicide 2",0,"Lb,Oz,Acre",0,0,0]
[null,"Fungicide 3",0,"Lb,Oz,Acre",0,0,0]
[null,"Fungicide 4",0,"Lb,Oz,Acre",0,0,0]
[null,"Fungicide 5",0,"Lb,Oz,Acre",0,0,0]
[null,"Fungicide 6",0,"Lb,Oz,Acre",0,0,0]
["Growth Regulators"]
[null,"Growth Regulator 1",0,"Lb,Oz,Acre",0,{"$f":"C82*E82","v":0},0]
[null,"Growth Regulator 2",0,"Lb,Oz,Acre",0,0,0]
[null,"Growth Regulator 3",0,"Lb,Oz,Acre",0,0,0]
[null,"Growth Regulator 4",0,"Lb,Oz,Acre",0,0,0]
[null,"Growth Regulator 5",0,"Lb,Oz,Acre",0,0,0]
[null,"Growth Regulator 6",0,"Lb,Oz,Acre",0,0,0]
["Other Chemicals"]
[null,"Fumigant",0,"Lb,Oz,Acre",0,{"$f":"C89*E89","v":0},0]
[null,"Other Chemical 1",0,"Lb,Oz,Acre",0,0,{"$f":"+F90*$D$5","v":0}]
[null,"Other Chemical 2",0,"Lb,Oz,Acre",0,0,{"$f":"+F91*$D$5","v":0}]
[null,"Other Chemical 3",0,"Lb,Oz,Acre",0,0,{"$f":"+F92*$D$5","v":0}]
[null,"Other Chemical 4",0,"Lb,Oz,Acre",0,0,{"$f":"+F93*$D$5","v":0}]
[null,"Other Chemical 5",0,"Lb,Oz,Acre",0,0,{"$f":"+F94*$D$5","v":0}]
["Irrigation"]
[null,"Well Expense",0,"Acre",0,{"$f":"C96*E96","v":0},{"$f":"+F96*$D$5","v":0}]
[null,"Pump Fuel",0,"Mcf,kWh,Gallon",0,0,0]
[null,"Pump Expense",0,"Acre",0,0,0]
[null,"Irrigation Equipment Expense",0,"Acre",0,0,0]
[null,"Repairs",0,"Acre",0,0,0]
[null,"Drip Tape",0,"Foot,Acre",0,0,0]
[null,"Water Cost",0,"AcIn,Gallon",0,0,0]
[null,"Other Irrigation Expense 1",0,"Acre",0,0,0]
[null,"Other Irrigation Expense 2",0,"Acre",0,0,0]
["Miscellaneous Expenses"]
[null,"Crop Insurance",0,"Acre",0,{"$f":"C106*E106","v":0},0]
[null,"Other Variable Expense 1",0,"Enter Unit",0,0,0]
[null,"Other Variable Expense 2",0,"Enter Unit",0,0,0]
[null,"Other Variable Expense 3",0,"Enter Unit",0,0,0]
[null,"Other Variable Expense 4",0,"Enter Unit",0,0,0]
[null,"Other Variable Expense 5",0,"Enter Unit",0,0,0]
[null,"Other Variable Expense 6",0,"Enter Unit",0,0,0]
[null,"Other Variable Expense 7",0,"Enter Unit",0,0,0]
[null,"Other Variable Expense 8",0,"Enter Unit",0,0,0]
[]
[null,"Operating Interest",null,null,0,{"$f":"+SUM(F23:F115)/2*E116","v":0},{"$f":"+F116*$D$6","v":0}]
[]
["Total Variable Costs",null,null,null,null,{"$f":"+SUM(F23:F116)","v":0},{"$f":"+SUM(G23:G116)","v":0}]
[]
["Planned Returns Above Variable Costs",null,null,null,null,{"$f":"+F18-F118","v":0},{"$f":"+G18-G118","v":0}]
[]
[null,"Breakeven Price to Cover Variable Costs",null,null,{"$f":"+IF(C9=0,0,F118-SUM(F10:F16)/C9)","v":0},{"$f":"+D9","v":"Cwt,lb,etc"}]
[]
[null,null,null,null,null,null,"Enterprise"]
["FIXED COSTS",null,"Quantity","Units","$/Unit","Total","Total"]
[null,"Land Rent or Expense",1,"Acre",0,{"$f":"C126*E126","v":0},{"$f":"+F126*$D$6","v":0}]
[null,"Depreciation - Equipment",1,"Acre",0,{"$f":"C127*E127","v":0},0]
[null,"Equipment Investment",0,"$",0,0,0]
[null,"Insurance",1,"Acre",0,0,0]
[null,"Management Fee",1,"Acre",0,0,0]
[null,"Owner/Operator Labor",0,"Acre",0,0,0]
[null,"Salaried Labor",1,"Acre,$,etc",0,0,0]
[null,"Other Fixed Expense",0,"Acre,$,etc",0,0,0]
[null,"Other Fixed Expense",0,"Acre,$,etc",0,0,0]
[null,"Other Fixed Expense",0,"Acre,$,etc",0,0,0]
[null,"Other Fixed Expense",0,"Acre,$,etc",0,0,0]
[null,"Other Fixed Expense",0,"Acre,$,etc",0,0,0]
[]
[null,null,null,"Total Fixed Costs",null,{"$f":"+SUM(F126:F137)","v":0},{"$f":"+SUM(G126:G137)","v":0}]
[]
[null,null,null,"Total Specified Costs",null,{"$f":"+F118+F139","v":0},{"$f":"+G118+G139","v":0}]
[]
[null,null,null,"Returns Above Specifiied Costs",null,{"$f":"+F18-F141","v":0},{"$f":"+G18-G141","v":0}]
[]
[null,"Breakeven Price to Cover Total Costs",null,null,{"$f":"+IF(C9=0,0,F141-SUM(F10:F16)/C9)","v":0},{"$f":"+D9","v":"Cwt,lb,etc"}]
[]
[null,"Breakeven Prices for Your Crop"]
[null,null,null,null,"Price To Cover",null,"Price To Cover"]
[null,"Yield","Yield",null,"Variable",null,"Total"]
[null,"Percent",{"$f":"+D9","v":"Cwt,lb,etc"},null,"Costs",null,"Costs"]
[null,0.75,{"$f":"+$C$153*B151","v":0},null,{"$f":"+IF(C151=0,0,($F$118-SUM($F$10:$F$16))/C151)","v":0},null,{"$f":"+IF(C151=0,0,($F$141-SUM($F$10:$F$16))/C151)","v":0}]
[null,0.9,{"$f":"+$C$153*B152","v":0},null,{"$f":"+IF(C152=0,0,($F$118-SUM($F$10:$F$16))/C152)","v":0},null,{"$f":"+IF(C152=0,0,($F$141-SUM($F$10:$F$16))/C152)","v":0}]
[null,1,{"$f":"+C9","v":0},null,{"$f":"+IF(C153=0,0,($F$118-SUM($F$10:$F$16))/C153)","v":0},null,{"$f":"+IF(C153=0,0,($F$141-SUM($F$10:$F$16))/C153)","v":0}]
[null,1.1000000000000001,0,null,{"$f":"+IF(C154=0,0,($F$118-SUM($F$10:$F$16))/C154)","v":0},null,{"$f":"+IF(C154=0,0,($F$141-SUM($F$10:$F$16))/C154)","v":0}]
[null,1.25,0,null,{"$f":"+IF(C155=0,0,($F$118-SUM($F$10:$F$16))/C155)","v":0},null,{"$f":"+IF(C155=0,0,($F$141-SUM($F$10:$F$16))/C155)","v":0}]

{"sheet":"Comparative Returns - Cash Rent","index":32,"n_rows":46,"n_cols":11,"rows_kept":46,"cut":false,"hidden":false,"merged":[[2,7,2,10],[2,4,2,5],[2,1,2,2]]}
["Comparative Returns - Cash Rent"]
[]
[null,"Returns Above Total Specified Expenses",null,null,"Total Direct Expenses",null,null,"Breakeven Yield to Cover Total Costs at Price Entered"]
[null,"Total Costs","Variable Costs",null,"Total Costs","Variable Costs",null,"Price","Units","Total Costs","Variable Costs"]
["FIELD CROPS"]
[]
[{"$f":"+CornConventionalTill!A3","v":"Corn, Conventional Tillage, Furrow Irrigated, Rio Grande Valley"},{"$f":"+CornConventionalTill!TotRet","v":150.33014882792088},{"$f":"+CornConventionalTill!VarRet","v":294.75042521202067},null,{"$f":"+CornConventionalTill!TotExp","v":689.66985117207912},{"$f":"+CornConventionalTill!VarExp","v":545.24957478797933},null,{"$f":"+CornConventionalTill!Price","v":6},{"$f":"+CornConventionalTill!Unit","v":"Bushel"},{"$f":"+IF($H7=0,0,E7/$H7)","v":114.94497519534652},{"$f":"+IF($H7=0,0,F7/$H7)","v":90.874929131329893}]
[{"$f":"+CornRducedTill!A3","v":"Corn, Reduced Tillage, Furrow Irrigated, Rio Grande Valley"},{"$f":"+CornRducedTill!TotRet","v":233.89217163628928},{"$f":"+CornRducedTill!VarRet","v":351.23488211293102},null,{"$f":"+CornRducedTill!TotExp","v":606.10782836371072},{"$f":"+CornRducedTill!VarExp","v":488.76511788706898},null,{"$f":"+CornRducedTill!Price","v":6},{"$f":"+CornRducedTill!Unit","v":"Bushel"},101.01797139395178,81.460852981178164]
[{"$f":"+CottonConventionalTill!A3","v":"Cotton, Conventional Tillage, Furrow Irrigated, Rio Grande Valley"},{"$f":"+CottonConventionalTill!TotRet","v":41.514676139395533},{"$f":"+CottonConventionalTill!VarRet","v":220.43426314406895},null,{"$f":"+CottonConventionalTill!TotExp","v":1085.8973238606045},{"$f":"+CottonConventionalTill!VarExp","v":906.97773685593108},null,{"$f":"+CottonConventionalTill!Price","v":0.9},{"$f":"+CottonConventionalTill!Unit","v":"Pound"},1206.5525820673383,1007.7530409510346]
[{"$f":"+CottonReducedTill!A3","v":"Cotton, Reduced Tillage, GMO, Furrow Irrigated, Rio Grande Valley"},{"$f":"+CottonReducedTill!TotRet","v":280.58978943261309},{"$f":"+CottonReducedTill!VarRet","v":430.32308066197845},null,{"$f":"+CottonReducedTill!TotExp","v":1164.810210567387},{"$f":"+CottonReducedTill!VarExp","v":1015.0769193380216},null,{"$f":"+CottonReducedTill!Price","v":0.9},{"$f":"+CottonReducedTill!Unit","v":"Pound"},1294.2335672970967,1127.8632437089129]
[{"$f":"+CottonDryland!A3","v":"Cotton, Conventional Tillage, Dryland, Rio Grande Valley"},{"$f":"+CottonDryland!TotRet","v":18.254942119845737},{"$f":"+CottonDryland!VarRet","v":171.28780546281848},null,{"$f":"+CottonDryland!TotExp","v":814.29545788015423},{"$f":"+CottonDryland!VarExp","v":661.26259453718149},null,{"$f":"+CottonDryland!Price","v":0.9},{"$f":"+CottonDryland!Unit","v":"Pound"},904.7727309779491,734.73621615242382]
[{"$f":"+SorghumConventionalTill!A3","v":"Grain Sorghum, Conventional Tillage, Furrow Irrigated, Rio Grande Valley"},{"$f":"+SorghumConventionalTill!TotRet","v":-42.497636412359839},{"$f":"+SorghumConventionalTill!VarRet","v":114.77377900976342},null,{"$f":"+SorghumConventionalTill!TotExp","v":508.69763641235983},{"$f":"+SorghumConventionalTill!VarExp","v":351.42622099023657},null,{"$f":"+SorghumConventionalTill!Price","v":10.36},{"$f":"+SorghumConventionalTill!Unit","v":"CWT"},49.102088456791492,33.921449902532487]
[{"$f":"+SorghumReducedTill!A3","v":"Grain Sorghum, Reduced Tillage, Furrow Irrigated, Rio Grande Valley"},{"$f":"+SorghumReducedTill!TotRet","v":40.484398583040786},{"$f":"+SorghumReducedTill!VarRet","v":160.93648171822832},null,{"$f":"+SorghumReducedTill!TotExp","v":425.7156014169592},{"$f":"+SorghumReducedTill!VarExp","v":305.26351828177167},null,{"$f":"+SorghumReducedTill!Price","v":10.36},{"$f":"+SorghumReducedTill!Unit","v":"CWT"},41.092239519011507,29.46559056773858]
[{"$f":"+SorghumDryland!A3","v":"Grain Sorghum, Conventional Tillage, Dryland, Rio Grande Valley"},{"$f":"+SorghumDryland!TotRet","v":-17.205410311136347},{"$f":"+SorghumDryland!VarRet","v":103.87956841051405},null,{"$f":"+SorghumDryland!TotExp","v":328.0054103111363},{"$f":"+SorghumDryland!VarExp","v":206.9204315894859},null,{"$f":"+SorghumDryland!Price","v":10.36},{"$f":"+SorghumDryland!Unit","v":"CWT"},31.660753891036325,19.973014632189759]
[{"$f":"+SugarCanePlant!A3","v":"Sugar Cane, Planted, Furrow Irrigated, Rio Grande Valley"},{"$f":"+SugarCanePlant!TotRet","v":-1191.8397952409491},{"$f":"+SugarCanePlant!VarRet","v":-1040.4506831724248},null,{"$f":"+SugarCanePlant!TotExp","v":2661.8397952409491},{"$f":"+SugarCanePlant!VarExp","v":2510.4506831724248},null,{"$f":"+SugarCanePlant!Price","v":29.4},{"$f":"+SugarCanePlant!Unit","v":"Ton"},90.538768545610523,85.38947901947023]
[{"$f":"+SugarCaneRatoon!A3","v":"Sugar Cane, Ratoon, Furrow Irrigated, Rio Grande Valley"},{"$f":"+SugarCaneRatoon!TotRet","v":-120.1736116829295},{"$f":"+SugarCaneRatoon!VarRet","v":20.76118495375249},null,{"$f":"+SugarCaneRatoon!TotExp","v":1237.3736116829295},{"$f":"+SugarCaneRatoon!VarExp","v":1096.4388150462476},null,{"$f":"+SugarCaneRatoon!Price","v":29.4},{"$f":"+SugarCaneRatoon!Unit","v":"Ton"},42.087537812344543,37.293837246471007]
[{"$f":"+HayProduction!A3","v":"Hay Production, Furrow Irrigated, Rio Grande Valley"},{"$f":"+HayProduction!TotRet","v":1466.0297702183364},{"$f":"+HayProduction!VarRet","v":1601.0289073057868},null,{"$f":"+HayProduction!TotExp","v":1868.2902297816638},{"$f":"+HayProduction!VarExp","v":1733.2910926942134},null,{"$f":"+HayProduction!Price","v":92.62},{"$f":"+HayProduction!Unit","v":"Bale (950 lb)"},20.171563698787129,18.714004455778593]
[{"$f":"+HayEstablishment!A3","v":"Hay Establishment, Furrow Irrigated, Rio Grande Valley"},{"$f":"+HayEstablishment!TotRet","v":-596.63886371074705},{"$f":"+HayEstablishment!VarRet","v":-501.36318781156422},null,{"$f":"+HayEstablishment!TotExp","v":596.63886371074705},{"$f":"+HayEstablishment!VarExp","v":501.36318781156422},null,{"$f":"+HayEstablishment!Price","v":0},{"$f":"+HayEstablishment!Unit","v":""},0,0]
[]
["HORTICULTURAL CROPS"]
[]
[{"$f":"+Cabbage!A3","v":"Cabbage, Fresh Market, Furrow Irrigated, Rio Grande Valley"},{"$f":"+Cabbage!TotRet","v":3059.3048451643654},{"$f":"+Cabbage!VarRet","v":3254.91927602546},null,{"$f":"+Cabbage!TotExp","v":5190.6951548356346},{"$f":"+Cabbage!VarExp","v":4995.08072397454},null,{"$f":"+Cabbage!Price","v":11},{"$f":"+Cabbage!Unit","v":"Carton"},{"$f":"+IF($H22=0,0,E22/$H22)","v":471.88137771233045},454.09824763404907]
[{"$f":"+Cantaloupe!A3","v":"Cantaloupe, Plastic Mulch, Drip Irrigated, Rio Grande Valley"},{"$f":"+Cantaloupe!TotRet","v":-1006.5924425870508},{"$f":"+Cantaloupe!VarRet","v":-844.86428469273233},null,{"$f":"+Cantaloupe!TotExp","v":4806.5924425870508},{"$f":"+Cantaloupe!VarExp","v":4644.8642846927323},null,{"$f":"+Cantaloupe!Price","v":9.5},{"$f":"+Cantaloupe!Unit","v":"Carton"},505.95709921968955,488.93308259923498]
[{"$f":"+HoneyDew!A3","v":"Honeydew, Plastic Mulch, Drip Irrigated, Rio Grande Valley"},{"$f":"+HoneyDew!TotRet","v":-35.233465728059855},{"$f":"+HoneyDew!VarRet","v":127.17264962362697},null,{"$f":"+HoneyDew!TotExp","v":7235.2334657280599},{"$f":"+HoneyDew!VarExp","v":7072.827350376373},null,{"$f":"+HoneyDew!Price","v":9},{"$f":"+HoneyDew!Unit","v":"Carton"},803.91482952534,785.86970559737483]
[{"$f":"+Onion!A3","v":"Onion, Hybrid Yellow Varieties, Furrow Irrigated, Rio Grande Valley"},{"$f":"+Onion!TotRet","v":1787.0796195371659},{"$f":"+Onion!VarRet","v":1985.3461383020058},null,{"$f":"+Onion!TotExp","v":5712.9203804628341},{"$f":"+Onion!VarExp","v":5514.6538616979942},null,{"$f":"+Onion!Price","v":10},{"$f":"+Onion!Unit","v":"Sack"},571.29203804628344,551.46538616979944]
[{"$f":"+Watermelon!A3","v":"Watermelon, Seedless, Plastic Mulch, Drip Irrigated, Rio Grande Valley"},{"$f":"+Watermelon!TotRet","v":1823.3285091132047},{"$f":"+Watermelon!VarRet","v":1985.3463189571557},null,{"$f":"+Watermelon!TotExp","v":5376.6714908867953},{"$f":"+Watermelon!VarExp","v":5214.6536810428443},null,{"$f":"+Watermelon!Price","v":16},{"$f":"+Watermelon!Unit","v":"CWT"},336.0419681804247,325.91585506517777]
[{"$f":"+WatermelonDryland!A3","v":"Watermelon, Open Pollinated Varieties, Dryland, Rio Grande Valley"},{"$f":"+WatermelonDryland!TotRet","v":901.9880475280529},{"$f":"+WatermelonDryland!VarRet","v":1028.6826228160789},null,{"$f":"+WatermelonDryland!TotExp","v":2598.0119524719471},{"$f":"+WatermelonDryland!VarExp","v":2471.3173771839211},null,{"$f":"+WatermelonDryland!Price","v":14},{"$f":"+WatermelonDryland!Unit","v":"CWT"},{"$f":"+IF($H27=0,0,E27/$H27)","v":185.5722823194248},{"$f":"+IF($H27=0,0,F27/$H27)","v":176.5226697988515}]
[]
["CITRUS CROPS"]
[]
[{"$f":"GrapefruitYear1!A3","v":"Grapefruit, Year 1, Orchard Establishment, Flood Irrigated, Rio Grande Valley"},{"$f":"GrapefruitYear1!TotRet","v":-5213.3833692346279},{"$f":"GrapefruitYear1!VarRet","v":-5094.5573688205259},null,{"$f":"GrapefruitYear1!TotExp","v":5213.3833692346279},{"$f":"GrapefruitYear1!VarExp","v":5094.5573688205259},null,{"$f":"GrapefruitYear1!Price","v":0},{"$f":"GrapefruitYear1!Unit","v":""},{"$f":"IF(H31=0,0,E31/H31)","v":0},{"$f":"IF(H31=0,0,F31/H31)","v":0}]
[{"$f":"GrapefruitYear2!A3","v":"Grapefruit, Year 2, Orchard Establishment, Flood Irrigated, Rio Grande Valley"},{"$f":"GrapefruitYear2!TotRet","v":-1316.7838286866822},{"$f":"GrapefruitYear2!VarRet","v":-1197.9578282725804},null,{"$f":"GrapefruitYear2!TotExp","v":1316.7838286866822},{"$f":"GrapefruitYear2!VarExp","v":1197.9578282725804},null,{"$f":"GrapefruitYear2!Price","v":0},{"$f":"GrapefruitYear2!Unit","v":""},{"$f":"IF(H32=0,0,E32/H32)","v":0},{"$f":"IF(H32=0,0,F32/H32)","v":0}]
[{"$f":"+GrapefruitYear3!A3","v":"Grapefruit, Year 3, Orchard Establishment, Flood Irrigated, Rio Grande Valley"},{"$f":"+GrapefruitYear3!TotRet","v":-2177.6197545951572},{"$f":"+GrapefruitYear3!VarRet","v":-1916.319505347562},null,{"$f":"+GrapefruitYear3!TotExp","v":3072.3697545951572},{"$f":"+GrapefruitYear3!VarExp","v":2811.069505347562},null,{"$f":"+GrapefruitYear3!Price","v":298.25},{"$f":"+GrapefruitYear3!Unit","v":"Ton"},{"$f":"+IF($H33=0,0,E33/$H33)","v":10.301323569472446},9.4252120883405262]
[{"$f":"+GrapefruitYear4!A3","v":"Grapefruit, Year 4, Orchard Establishment, Flood Irrigated, Rio Grande Valley"},{"$f":"+GrapefruitYear4!TotRet","v":-1398.6996306054853},{"$f":"+GrapefruitYear4!VarRet","v":-1137.39938135789},null,{"$f":"+GrapefruitYear4!TotExp","v":3188.1996306054853},{"$f":"+GrapefruitYear4!VarExp","v":2926.89938135789},null,{"$f":"+GrapefruitYear4!Price","v":298.25},{"$f":"+GrapefruitYear4!Unit","v":"Ton"},10.689688618962231,9.8135771378303094]
[{"$f":"+GrapefruitYear5!A3","v":"Grapefruit, Year 5, Orchard Establishment, Flood Irrigated, Rio Grande Valley"},{"$f":"+GrapefruitYear5!TotRet","v":-472.22123937260903},{"$f":"+GrapefruitYear5!VarRet","v":-210.92099012501376},null,{"$f":"+GrapefruitYear5!TotExp","v":3156.471239372609},{"$f":"+GrapefruitYear5!VarExp","v":2895.1709901250138},null,{"$f":"+GrapefruitYear5!Price","v":298.25},{"$f":"+GrapefruitYear5!Unit","v":"Ton"},10.583306753973542,9.7071952728416218]
[{"$f":"+GrapefruitYear6!A3","v":"Grapefruit, Year 6, Orchard Establishment, Flood Irrigated, Rio Grande Valley"},{"$f":"+GrapefruitYear6!TotRet","v":987.30036939451475},{"$f":"+GrapefruitYear6!VarRet","v":1248.60061864211},null,{"$f":"+GrapefruitYear6!TotExp","v":3188.1996306054853},{"$f":"+GrapefruitYear6!VarExp","v":2926.89938135789},null,{"$f":"+GrapefruitYear6!Price","v":298.25},{"$f":"+GrapefruitYear6!Unit","v":"Ton"},10.689688618962231,9.8135771378303094]
[{"$f":"+GrapefruitYear7!A3","v":"Grapefruit, Year 7, Orchard Establishment, Flood Irrigated, Rio Grande Valley"},{"$f":"+GrapefruitYear7!TotRet","v":2147.0051989835556},{"$f":"+GrapefruitYear7!VarRet","v":2408.3054482311509},null,{"$f":"+GrapefruitYear7!TotExp","v":3221.4948010164444},{"$f":"+GrapefruitYear7!VarExp","v":2960.1945517688491},null,{"$f":"+GrapefruitYear7!Price","v":298.25},{"$f":"+GrapefruitYear7!Unit","v":"Ton"},10.801323725118003,9.925212243986083]
[{"$f":"+GrapefruitYear8!A3","v":"Grapefruit, Year 8, Orchard Establishment, Flood Irrigated, Rio Grande Valley"},{"$f":"+GrapefruitYear8!TotRet","v":2743.5051989835556},{"$f":"+GrapefruitYear8!VarRet","v":3004.8054482311509},null,{"$f":"+GrapefruitYear8!TotExp","v":3221.4948010164444},{"$f":"+GrapefruitYear8!VarExp","v":2960.1945517688491},null,{"$f":"+GrapefruitYear8!Price","v":298.25},{"$f":"+GrapefruitYear8!Unit","v":"Ton"},{"$f":"+IF($H38=0,0,E38/$H38)","v":10.801323725118003},9.925212243986083]
[{"$f":"+OrangesNavel!A3","v":"Oranges, Early Orange, Mature Orchard, Flood Irrigated, Rio Grande Valley"},{"$f":"+OrangesNavel!TotRet","v":2210.6527512744469},{"$f":"+OrangesNavel!VarRet","v":2471.9530005220422},null,{"$f":"+OrangesNavel!TotExp","v":3301.1590134314347},{"$f":"+OrangesNavel!VarExp","v":3039.8587641838394},null,{"$f":"+OrangesNavel!Price","v":306.21176470588233},{"$f":"+OrangesNavel!Unit","v":"Ton"},{"$f":"+IF($H39=0,0,E39/$H39)","v":10.780640700079605},{"$f":"+IF($H39=0,0,F39/$H39)","v":9.9273088579847233}]
[{"$f":"+OrangesValencias!A3","v":"Oranges, Valencias, Mature Orchard, Flood Irrigated, Rio Grande Valley"},{"$f":"+OrangesValencias!TotRet","v":5583.8858832647784},{"$f":"+OrangesValencias!VarRet","v":5845.1861325123737},null,{"$f":"+OrangesValencias!TotExp","v":3119.6435284999275},{"$f":"+OrangesValencias!VarExp","v":2858.3432792523322},null,{"$f":"+OrangesValencias!Price","v":483.52941176470586},{"$f":"+OrangesValencias!Unit","v":"Ton"},{"$f":"+IF($H40=0,0,E40/$H40)","v":6.4518175163623805},{"$f":"+IF($H40=0,0,F40/$H40)","v":5.9114155410328042}]
[]
["LIVESTOCK"]
[]
[{"$f":"+#REF!","v":{"$error":"#REF!"}},{"$f":"+[0]!TotRet","v":{"$error":"#NAME?"}},{"$f":"+[0]!VarRet","v":{"$error":"#NAME?"}},null,{"$f":"+[0]!TotExp","v":{"$error":"#NAME?"}},{"$f":"+[0]!VarExp","v":{"$error":"#NAME?"}},null,{"$f":"+[0]!Price","v":{"$error":"#NAME?"}},{"$f":"+[0]!Unit","v":{"$error":"#NAME?"}},{"$f":"+IF($H44=0,0,E44/$H44)","v":{"$error":"#NAME?"}},{"$error":"#NAME?"}]
[{"$f":"+#REF!","v":{"$error":"#REF!"}},{"$f":"+[0]!TotRet","v":{"$error":"#NAME?"}},{"$f":"+[0]!VarRet","v":{"$error":"#NAME?"}},null,{"$f":"+[0]!TotExp","v":{"$error":"#NAME?"}},{"$f":"+[0]!VarExp","v":{"$error":"#NAME?"}},null,{"$f":"+[0]!Price","v":{"$error":"#NAME?"}},{"$f":"+[0]!Unit","v":{"$error":"#NAME?"}},{"$error":"#NAME?"},{"$error":"#NAME?"}]
[{"$f":"+#REF!","v":{"$error":"#REF!"}},{"$f":"+[0]!TotRet","v":{"$error":"#NAME?"}},{"$f":"+[0]!VarRet","v":{"$error":"#NAME?"}},null,{"$f":"+[0]!TotExp","v":{"$error":"#NAME?"}},{"$f":"+[0]!VarExp","v":{"$error":"#NAME?"}},null,{"$f":"+[0]!Price","v":{"$error":"#NAME?"}},{"$f":"+[0]!Unit","v":{"$error":"#NAME?"}},{"$f":"+IF($H46=0,0,E46/$H46)","v":{"$error":"#NAME?"}},{"$f":"+IF($H46=0,0,F46/$H46)","v":{"$error":"#NAME?"}}]

{"sheet":"Comparative Returns-Share Rent","index":33,"n_rows":46,"n_cols":28,"rows_kept":46,"cut":false,"hidden":false,"merged":[[2,23,2,27],[2,1,2,3],[2,5,2,7],[2,9,2,13],[2,15,2,17],[2,19,2,21]]}
["Comparative Returns - Share Rent"]
[]
["Variable Costs to the right of Total Costs","Returns Above Total Specified Expenses",null,null,null,"Total Direct Expenses",null,null,null,"Breakeven Yield to Cover Total Costs at Price Entered",null,null,null,null,null,"Returns Above Variable Specified Expenses",null,null,null,"Variable Direct Expenses",null,null,null,"Breakeven Yield to Cover Variavle Costs at Price Entered"]
[null,"Total","Tenant","Landlord",null,"Total","Tenant","Landlord",null,"Price","Units","Total","Tenant","Landlord",null,"Total","Tenant","Landlord",null,"Total","Tenant","Landlord",null,"Price","Units","Total","Tenant","Landlord"]
["FORAGE CROPS"]
[]
[{"$f":"+CornConventionalTill!A3","v":"Corn, Conventional Tillage, Furrow Irrigated, Rio Grande Valley"},{"$f":"+CornConventionalTill!TotRet","v":150.33014882792088},{"$f":"+CornConventionalTill!TTotRet","v":150.33014882792088},{"$f":"+CornConventionalTill!LTotRet","v":0},null,{"$f":"+CornConventionalTill!TotExp","v":689.66985117207912},{"$f":"+CornConventionalTill!TTotExp","v":689.66985117207912},{"$f":"+CornConventionalTill!LTotExp","v":0},null,{"$f":"+CornConventionalTill!Price","v":6},{"$f":"+CornConventionalTill!Unit","v":"Bushel"},{"$f":"+IF($J7=0,0,F7/$J7)","v":114.94497519534652},{"$f":"+IF($J7=0,0,G7/$J7)","v":114.94497519534652},{"$f":"+IF($J7=0,0,H7/$J7)","v":0},null,{"$f":"+CornConventionalTill!VarRet","v":294.75042521202067},{"$f":"+CornConventionalTill!TVarRet","v":294.75042521202067},{"$f":"+CornConventionalTill!LVarRet","v":0},null,{"$f":"+CornConventionalTill!VarExp","v":545.24957478797933},{"$f":"+CornConventionalTill!TVarExp","v":545.24957478797933},{"$f":"+CornConventionalTill!LVarExp","v":0},null,{"$f":"+CornConventionalTill!Price","v":6},{"$f":"+CornConventionalTill!Unit","v":"Bushel"},{"$f":"+IF($J7=0,0,T7/$J7)","v":90.874929131329893},{"$f":"+IF($J7=0,0,U7/$J7)","v":90.874929131329893},{"$f":"+IF($J7=0,0,V7/$J7)","v":0}]
[{"$f":"+CornRducedTill!A3","v":"Corn, Reduced Tillage, Furrow Irrigated, Rio Grande Valley"},{"$f":"+CornRducedTill!TotRet","v":233.89217163628928},{"$f":"+CornRducedTill!TTotRet","v":233.89217163628928},{"$f":"+CornRducedTill!LTotRet","v":0},null,{"$f":"+CornRducedTill!TotExp","v":606.10782836371072},{"$f":"+CornRducedTill!TTotExp","v":606.10782836371072},{"$f":"+CornRducedTill!LTotExp","v":0},null,{"$f":"+CornRducedTill!Price","v":6},{"$f":"+CornRducedTill!Unit","v":"Bushel"},101.01797139395178,101.01797139395178,0,null,{"$f":"+CornRducedTill!VarRet","v":351.23488211293102},{"$f":"+CornRducedTill!TVarRet","v":351.23488211293102},{"$f":"+CornRducedTill!LVarRet","v":0},null,{"$f":"+CornRducedTill!VarExp","v":488.76511788706898},{"$f":"+CornRducedTill!TVarExp","v":488.76511788706898},{"$f":"+CornRducedTill!LVarExp","v":0},null,{"$f":"+CornRducedTill!Price","v":6},{"$f":"+CornRducedTill!Unit","v":"Bushel"},81.460852981178164,81.460852981178164,0]
[{"$f":"+CottonConventionalTill!A3","v":"Cotton, Conventional Tillage, Furrow Irrigated, Rio Grande Valley"},{"$f":"+CottonConventionalTill!TotRet","v":41.514676139395533},{"$f":"+CottonConventionalTill!TTotRet","v":41.514676139395533},{"$f":"+CottonConventionalTill!LTotRet","v":0},null,{"$f":"+CottonConventionalTill!TotExp","v":1085.8973238606045},{"$f":"+CottonConventionalTill!TTotExp","v":1085.8973238606045},{"$f":"+CottonConventionalTill!LTotExp","v":0},null,{"$f":"+CottonConventionalTill!Price","v":0.9},{"$f":"+CottonConventionalTill!Unit","v":"Pound"},1206.5525820673383,1206.5525820673383,0,null,{"$f":"+CottonConventionalTill!VarRet","v":220.43426314406895},{"$f":"+CottonConventionalTill!TVarRet","v":220.43426314406895},{"$f":"+CottonConventionalTill!LVarRet","v":0},null,{"$f":"+CottonConventionalTill!VarExp","v":906.97773685593108},{"$f":"+CottonConventionalTill!TVarExp","v":906.97773685593108},{"$f":"+CottonConventionalTill!LVarExp","v":0},null,{"$f":"+CottonConventionalTill!Price","v":0.9},{"$f":"+CottonConventionalTill!Unit","v":"Pound"},1007.7530409510346,1007.7530409510346,0]
[{"$f":"+CottonReducedTill!A3","v":"Cotton, Reduced Tillage, GMO, Furrow Irrigated, Rio Grande Valley"},{"$f":"+CottonReducedTill!TotRet","v":280.58978943261309},{"$f":"+CottonReducedTill!TTotRet","v":280.58978943261309},{"$f":"+CottonReducedTill!LTotRet","v":0},null,{"$f":"+CottonReducedTill!TotExp","v":1164.810210567387},{"$f":"+CottonReducedTill!TTotExp","v":1164.810210567387},{"$f":"+CottonReducedTill!LTotExp","v":0},null,{"$f":"+CottonReducedTill!Price","v":0.9},{"$f":"+CottonReducedTill!Unit","v":"Pound"},1294.2335672970967,1294.2335672970967,0,null,{"$f":"+CottonReducedTill!VarRet","v":430.32308066197845},{"$f":"+CottonReducedTill!TVarRet","v":430.32308066197845},{"$f":"+CottonReducedTill!LVarRet","v":0},null,{"$f":"+CottonReducedTill!VarExp","v":1015.0769193380216},{"$f":"+CottonReducedTill!TVarExp","v":1015.0769193380216},{"$f":"+CottonReducedTill!LVarExp","v":0},null,{"$f":"+CottonReducedTill!Price","v":0.9},{"$f":"+CottonReducedTill!Unit","v":"Pound"},1127.8632437089129,1127.8632437089129,0]
[{"$f":"+CottonDryland!A3","v":"Cotton, Conventional Tillage, Dryland, Rio Grande Valley"},{"$f":"+CottonDryland!TotRet","v":18.254942119845737},{"$f":"+CottonDryland!TTotRet","v":18.254942119845737},{"$f":"+CottonDryland!LTotRet","v":0},null,{"$f":"+CottonDryland!TotExp","v":814.29545788015423},{"$f":"+CottonDryland!TTotExp","v":814.29545788015423},{"$f":"+CottonDryland!LTotExp","v":0},null,{"$f":"+CottonDryland!Price","v":0.9},{"$f":"+CottonDryland!Unit","v":"Pound"},904.7727309779491,904.7727309779491,0,null,{"$f":"+CottonDryland!VarRet","v":171.28780546281848},{"$f":"+CottonDryland!TVarRet","v":171.28780546281848},{"$f":"+CottonDryland!LVarRet","v":0},null,{"$f":"+CottonDryland!VarExp","v":661.26259453718149},{"$f":"+CottonDryland!TVarExp","v":661.26259453718149},{"$f":"+CottonDryland!LVarExp","v":0},null,{"$f":"+CottonDryland!Price","v":0.9},{"$f":"+CottonDryland!Unit","v":"Pound"},734.73621615242382,734.73621615242382,0]
[{"$f":"+SorghumConventionalTill!A3","v":"Grain Sorghum, Conventional Tillage, Furrow Irrigated, Rio Grande Valley"},{"$f":"+SorghumConventionalTill!TotRet","v":-42.497636412359839},{"$f":"+SorghumConventionalTill!TTotRet","v":-42.497636412359839},{"$f":"+SorghumConventionalTill!LTotRet","v":0},null,{"$f":"+SorghumConventionalTill!TotExp","v":508.69763641235983},{"$f":"+SorghumConventionalTill!TTotExp","v":508.69763641235983},{"$f":"+SorghumConventionalTill!LTotExp","v":0},null,{"$f":"+SorghumConventionalTill!Price","v":10.36},{"$f":"+SorghumConventionalTill!Unit","v":"CWT"},49.102088456791492,49.102088456791492,0,null,{"$f":"+SorghumConventionalTill!VarRet","v":114.77377900976342},{"$f":"+SorghumConventionalTill!TVarRet","v":114.77377900976342},{"$f":"+SorghumConventionalTill!LVarRet","v":0},null,{"$f":"+SorghumConventionalTill!VarExp","v":351.42622099023657},{"$f":"+SorghumConventionalTill!TVarExp","v":351.42622099023657},{"$f":"+SorghumConventionalTill!LVarExp","v":0},null,{"$f":"+SorghumConventionalTill!Price","v":10.36},{"$f":"+SorghumConventionalTill!Unit","v":"CWT"},33.921449902532487,33.921449902532487,0]
[{"$f":"+SorghumReducedTill!A3","v":"Grain Sorghum, Reduced Tillage, Furrow Irrigated, Rio Grande Valley"},{"$f":"+SorghumReducedTill!TotRet","v":40.484398583040786},{"$f":"+SorghumReducedTill!TTotRet","v":40.484398583040786},{"$f":"+SorghumReducedTill!LTotRet","v":0},null,{"$f":"+SorghumReducedTill!TotExp","v":425.7156014169592},{"$f":"+SorghumReducedTill!TTotExp","v":425.7156014169592},{"$f":"+SorghumReducedTill!LTotExp","v":0},null,{"$f":"+SorghumReducedTill!Price","v":10.36},{"$f":"+SorghumReducedTill!Unit","v":"CWT"},41.092239519011507,41.092239519011507,0,null,{"$f":"+SorghumReducedTill!VarRet","v":160.93648171822832},{"$f":"+SorghumReducedTill!TVarRet","v":160.93648171822832},{"$f":"+SorghumReducedTill!LVarRet","v":0},null,{"$f":"+SorghumReducedTill!VarExp","v":305.26351828177167},{"$f":"+SorghumReducedTill!TVarExp","v":305.26351828177167},{"$f":"+SorghumReducedTill!LVarExp","v":0},null,{"$f":"+SorghumReducedTill!Price","v":10.36},{"$f":"+SorghumReducedTill!Unit","v":"CWT"},29.46559056773858,29.46559056773858,0]
[{"$f":"+SorghumDryland!A3","v":"Grain Sorghum, Conventional Tillage, Dryland, Rio Grande Valley"},{"$f":"+SorghumDryland!TotRet","v":-17.205410311136347},{"$f":"+SorghumDryland!TTotRet","v":-17.205410311136347},{"$f":"+SorghumDryland!LTotRet","v":0},null,{"$f":"+SorghumDryland!TotExp","v":328.0054103111363},{"$f":"+SorghumDryland!TTotExp","v":328.0054103111363},{"$f":"+SorghumDryland!LTotExp","v":0},null,{"$f":"+SorghumDryland!Price","v":10.36},{"$f":"+SorghumDryland!Unit","v":"CWT"},31.660753891036325,31.660753891036325,0,null,{"$f":"+SorghumDryland!VarRet","v":103.87956841051405},{"$f":"+SorghumDryland!TVarRet","v":103.87956841051405},{"$f":"+SorghumDryland!LVarRet","v":0},null,{"$f":"+SorghumDryland!VarExp","v":206.9204315894859},{"$f":"+SorghumDryland!TVarExp","v":206.9204315894859},{"$f":"+SorghumDryland!LVarExp","v":0},null,{"$f":"+SorghumDryland!Price","v":10.36},{"$f":"+SorghumDryland!Unit","v":"CWT"},19.973014632189759,19.973014632189759,0]
[{"$f":"+SugarCanePlant!A3","v":"Sugar Cane, Planted, Furrow Irrigated, Rio Grande Valley"},{"$f":"+SugarCanePlant!TotRet","v":-1191.8397952409491},{"$f":"+SugarCanePlant!TTotRet","v":-1191.8397952409491},{"$f":"+SugarCanePlant!LTotRet","v":0},null,{"$f":"+SugarCanePlant!TotExp","v":2661.8397952409491},{"$f":"+SugarCanePlant!TTotExp","v":2661.8397952409491},{"$f":"+SugarCanePlant!LTotExp","v":0},null,{"$f":"+SugarCanePlant!Price","v":29.4},{"$f":"+SugarCanePlant!Unit","v":"Ton"},90.538768545610523,90.538768545610523,0,null,{"$f":"+SugarCanePlant!VarRet","v":-1040.4506831724248},{"$f":"+SugarCanePlant!TVarRet","v":-1040.4506831724248},{"$f":"+SugarCanePlant!LVarRet","v":0},null,{"$f":"+SugarCanePlant!VarExp","v":2510.4506831724248},{"$f":"+SugarCanePlant!TVarExp","v":2510.4506831724248},{"$f":"+SugarCanePlant!LVarExp","v":0},null,{"$f":"+SugarCanePlant!Price","v":29.4},{"$f":"+SugarCanePlant!Unit","v":"Ton"},85.38947901947023,85.38947901947023,0]
[{"$f":"+SugarCaneRatoon!A3","v":"Sugar Cane, Ratoon, Furrow Irrigated, Rio Grande Valley"},{"$f":"+SugarCaneRatoon!TotRet","v":-120.1736116829295},{"$f":"+SugarCaneRatoon!TTotRet","v":-120.1736116829295},{"$f":"+SugarCaneRatoon!LTotRet","v":0},null,{"$f":"+SugarCaneRatoon!TotExp","v":1237.3736116829295},{"$f":"+SugarCaneRatoon!TTotExp","v":1237.3736116829295},{"$f":"+SugarCaneRatoon!LTotExp","v":0},null,{"$f":"+SugarCaneRatoon!Price","v":29.4},{"$f":"+SugarCaneRatoon!Unit","v":"Ton"},42.087537812344543,42.087537812344543,0,null,{"$f":"+SugarCaneRatoon!VarRet","v":20.76118495375249},{"$f":"+SugarCaneRatoon!TVarRet","v":20.76118495375249},{"$f":"+SugarCaneRatoon!LVarRet","v":0},null,{"$f":"+SugarCaneRatoon!VarExp","v":1096.4388150462476},{"$f":"+SugarCaneRatoon!TVarExp","v":1096.4388150462476},{"$f":"+SugarCaneRatoon!LVarExp","v":0},null,{"$f":"+SugarCaneRatoon!Price","v":29.4},{"$f":"+SugarCaneRatoon!Unit","v":"Ton"},37.293837246471007,37.293837246471007,0]
[{"$f":"+HayProduction!A3","v":"Hay Production, Furrow Irrigated, Rio Grande Valley"},{"$f":"+HayProduction!TotRet","v":1466.0297702183364},{"$f":"+HayProduction!TTotRet","v":1466.0297702183364},{"$f":"+HayProduction!LTotRet","v":0},null,{"$f":"+HayProduction!TotExp","v":1868.2902297816638},{"$f":"+HayProduction!TTotExp","v":1868.2902297816638},{"$f":"+HayProduction!LTotExp","v":0},null,{"$f":"+HayProduction!Price","v":92.62},{"$f":"+HayProduction!Unit","v":"Bale (950 lb)"},20.171563698787129,20.171563698787129,0,null,{"$f":"+HayProduction!VarRet","v":1601.0289073057868},{"$f":"+HayProduction!TVarRet","v":1601.0289073057868},{"$f":"+HayProduction!LVarRet","v":0},null,{"$f":"+HayProduction!VarExp","v":1733.2910926942134},{"$f":"+HayProduction!TVarExp","v":1733.2910926942134},{"$f":"+HayProduction!LVarExp","v":0},null,{"$f":"+HayProduction!Price","v":92.62},{"$f":"+HayProduction!Unit","v":"Bale (950 lb)"},18.714004455778593,18.714004455778593,0]
[{"$f":"+HayEstablishment!A3","v":"Hay Establishment, Furrow Irrigated, Rio Grande Valley"},{"$f":"+HayEstablishment!TotRet","v":-596.63886371074705},{"$f":"+HayEstablishment!TTotRet","v":-596.63886371074705},{"$f":"+HayEstablishment!LTotRet","v":0},null,{"$f":"+HayEstablishment!TotExp","v":596.63886371074705},{"$f":"+HayEstablishment!TTotExp","v":596.63886371074705},{"$f":"+HayEstablishment!LTotExp","v":0},null,{"$f":"+HayEstablishment!Price","v":0},{"$f":"+HayEstablishment!Unit","v":""},0,0,0,null,{"$f":"+HayEstablishment!VarRet","v":-501.36318781156422},{"$f":"+HayEstablishment!TVarRet","v":-501.36318781156422},{"$f":"+HayEstablishment!LVarRet","v":0},null,{"$f":"+HayEstablishment!VarExp","v":501.36318781156422},{"$f":"+HayEstablishment!TVarExp","v":501.36318781156422},{"$f":"+HayEstablishment!LVarExp","v":0},null,{"$f":"+HayEstablishment!Price","v":0},{"$f":"+HayEstablishment!Unit","v":""},0,0,0]
[]
["FIELD CROPS - IRRIGATED"]
[]
[{"$f":"+Cabbage!A3","v":"Cabbage, Fresh Market, Furrow Irrigated, Rio Grande Valley"},{"$f":"+Cabbage!TotRet","v":3059.3048451643654},{"$f":"+Cabbage!TTotRet","v":3059.3048451643654},{"$f":"+Cabbage!LTotRet","v":0},null,{"$f":"+Cabbage!TotExp","v":5190.6951548356346},{"$f":"+Cabbage!TTotExp","v":5190.6951548356346},{"$f":"+Cabbage!LTotExp","v":0},null,{"$f":"+Cabbage!Price","v":11},{"$f":"+Cabbage!Unit","v":"Carton"},{"$f":"+IF($J22=0,0,F22/$J22)","v":471.88137771233045},471.88137771233045,0,null,{"$f":"+Cabbage!VarRet","v":3254.91927602546},{"$f":"+Cabbage!TVarRet","v":3254.91927602546},{"$f":"+Cabbage!LVarRet","v":0},null,{"$f":"+Cabbage!VarExp","v":4995.08072397454},{"$f":"+Cabbage!TVarExp","v":4995.08072397454},{"$f":"+Cabbage!LVarExp","v":0},null,{"$f":"+Cabbage!Price","v":11},{"$f":"+Cabbage!Unit","v":"Carton"},{"$f":"+IF($J22=0,0,T22/$J22)","v":454.09824763404907},454.09824763404907,0]
[{"$f":"+Cantaloupe!A3","v":"Cantaloupe, Plastic Mulch, Drip Irrigated, Rio Grande Valley"},{"$f":"+Cantaloupe!TotRet","v":-1006.5924425870508},{"$f":"+Cantaloupe!TTotRet","v":-1006.5924425870508},{"$f":"+Cantaloupe!LTotRet","v":0},null,{"$f":"+Cantaloupe!TotExp","v":4806.5924425870508},{"$f":"+Cantaloupe!TTotExp","v":4806.5924425870508},{"$f":"+Cantaloupe!LTotExp","v":0},null,{"$f":"+Cantaloupe!Price","v":9.5},{"$f":"+Cantaloupe!Unit","v":"Carton"},505.95709921968955,505.95709921968955,0,null,{"$f":"+Cantaloupe!VarRet","v":-844.86428469273233},{"$f":"+Cantaloupe!TVarRet","v":-844.86428469273233},{"$f":"+Cantaloupe!LVarRet","v":0},null,{"$f":"+Cantaloupe!VarExp","v":4644.8642846927323},{"$f":"+Cantaloupe!TVarExp","v":4644.8642846927323},{"$f":"+Cantaloupe!LVarExp","v":0},null,{"$f":"+Cantaloupe!Price","v":9.5},{"$f":"+Cantaloupe!Unit","v":"Carton"},488.93308259923498,488.93308259923498,0]
[{"$f":"+HoneyDew!A3","v":"Honeydew, Plastic Mulch, Drip Irrigated, Rio Grande Valley"},{"$f":"+HoneyDew!TotRet","v":-35.233465728059855},{"$f":"+HoneyDew!TTotRet","v":-35.233465728059855},{"$f":"+HoneyDew!LTotRet","v":0},null,{"$f":"+HoneyDew!TotExp","v":7235.2334657280599},{"$f":"+HoneyDew!TTotExp","v":7235.2334657280599},{"$f":"+HoneyDew!LTotExp","v":0},null,{"$f":"+HoneyDew!Price","v":9},{"$f":"+HoneyDew!Unit","v":"Carton"},803.91482952534,803.91482952534,0,null,{"$f":"+HoneyDew!VarRet","v":127.17264962362697},{"$f":"+HoneyDew!TVarRet","v":127.17264962362697},{"$f":"+HoneyDew!LVarRet","v":0},null,{"$f":"+HoneyDew!VarExp","v":7072.827350376373},{"$f":"+HoneyDew!TVarExp","v":7072.827350376373},{"$f":"+HoneyDew!LVarExp","v":0},null,{"$f":"+HoneyDew!Price","v":9},{"$f":"+HoneyDew!Unit","v":"Carton"},785.86970559737483,785.86970559737483,0]
[{"$f":"+Onion!A3","v":"Onion, Hybrid Yellow Varieties, Furrow Irrigated, Rio Grande Valley"},{"$f":"+Onion!TotRet","v":1787.0796195371659},{"$f":"+Onion!TTotRet","v":1787.0796195371659},{"$f":"+Onion!LTotRet","v":0},null,{"$f":"+Onion!TotExp","v":5712.9203804628341},{"$f":"+Onion!TTotExp","v":5712.9203804628341},{"$f":"+Onion!LTotExp","v":0},null,{"$f":"+Onion!Price","v":10},{"$f":"+Onion!Unit","v":"Sack"},571.29203804628344,571.29203804628344,0,null,{"$f":"+Onion!VarRet","v":1985.3461383020058},{"$f":"+Onion!TVarRet","v":1985.3461383020058},{"$f":"+Onion!LVarRet","v":0},null,{"$f":"+Onion!VarExp","v":5514.6538616979942},{"$f":"+Onion!TVarExp","v":5514.6538616979942},{"$f":"+Onion!LVarExp","v":0},null,{"$f":"+Onion!Price","v":10},{"$f":"+Onion!Unit","v":"Sack"},551.46538616979944,551.46538616979944,0]
[{"$f":"+Watermelon!A3","v":"Watermelon, Seedless, Plastic Mulch, Drip Irrigated, Rio Grande Valley"},{"$f":"+Watermelon!TotRet","v":1823.3285091132047},{"$f":"+Watermelon!TTotRet","v":1823.3285091132047},{"$f":"+Watermelon!LTotRet","v":0},null,{"$f":"+Watermelon!TotExp","v":5376.6714908867953},{"$f":"+Watermelon!TTotExp","v":5376.6714908867953},{"$f":"+Watermelon!LTotExp","v":0},null,{"$f":"+Watermelon!Price","v":16},{"$f":"+Watermelon!Unit","v":"CWT"},336.0419681804247,336.0419681804247,0,null,{"$f":"+Watermelon!VarRet","v":1985.3463189571557},{"$f":"+Watermelon!TVarRet","v":1985.3463189571557},{"$f":"+Watermelon!LVarRet","v":0},null,{"$f":"+Watermelon!VarExp","v":5214.6536810428443},{"$f":"+Watermelon!TVarExp","v":5214.6536810428443},{"$f":"+Watermelon!LVarExp","v":0},null,{"$f":"+Watermelon!Price","v":16},{"$f":"+Watermelon!Unit","v":"CWT"},325.91585506517777,325.91585506517777,0]
[{"$f":"+WatermelonDryland!A3","v":"Watermelon, Open Pollinated Varieties, Dryland, Rio Grande Valley"},{"$f":"+WatermelonDryland!TotRet","v":901.9880475280529},{"$f":"+WatermelonDryland!TTotRet","v":901.9880475280529},{"$f":"+WatermelonDryland!LTotRet","v":0},null,{"$f":"+WatermelonDryland!TotExp","v":2598.0119524719471},{"$f":"+WatermelonDryland!TTotExp","v":2598.0119524719471},{"$f":"+WatermelonDryland!LTotExp","v":0},null,{"$f":"+WatermelonDryland!Price","v":14},{"$f":"+WatermelonDryland!Unit","v":"CWT"},{"$f":"+IF($J27=0,0,F27/$J27)","v":185.5722823194248},{"$f":"+IF($J27=0,0,G27/$J27)","v":185.5722823194248},{"$f":"+IF($J27=0,0,H27/$J27)","v":0},null,{"$f":"+WatermelonDryland!VarRet","v":1028.6826228160789},{"$f":"+WatermelonDryland!TVarRet","v":1028.6826228160789},{"$f":"+WatermelonDryland!LVarRet","v":0},null,{"$f":"+WatermelonDryland!VarExp","v":2471.3173771839211},{"$f":"+WatermelonDryland!TVarExp","v":2471.3173771839211},{"$f":"+WatermelonDryland!LVarExp","v":0},null,{"$f":"+WatermelonDryland!Price","v":14},{"$f":"+WatermelonDryland!Unit","v":"CWT"},{"$f":"+IF($J27=0,0,T27/$J27)","v":176.5226697988515},{"$f":"+IF($J27=0,0,U27/$J27)","v":176.5226697988515},{"$f":"+IF($J27=0,0,V27/$J27)","v":0}]
[]
["FIELD CROPS - DRYLAND"]
[]
[{"$f":"GrapefruitYear1!A3","v":"Grapefruit, Year 1, Orchard Establishment, Flood Irrigated, Rio Grande Valley"},{"$f":"GrapefruitYear1!TotRet","v":-5213.3833692346279},{"$f":"GrapefruitYear1!TTotRet","v":-5213.3833692346279},{"$f":"GrapefruitYear1!LTotRet","v":0},null,{"$f":"GrapefruitYear1!TotExp","v":5213.3833692346279},{"$f":"GrapefruitYear1!TTotExp","v":5213.3833692346279},{"$f":"GrapefruitYear1!LTotExp","v":0},null,{"$f":"GrapefruitYear1!Price","v":0},{"$f":"GrapefruitYear1!Unit","v":""},{"$f":"IF(J31=0,0,F31/J31)","v":0},{"$f":"IF(J31=0,0,G31/J31)","v":0},{"$f":"IF(J31=0,0,H31/J31)","v":0},null,{"$f":"GrapefruitYear1!VarRet","v":-5094.5573688205259},{"$f":"GrapefruitYear1!TVarRet","v":-5094.5573688205259},{"$f":"GrapefruitYear1!LVarRet","v":0},null,{"$f":"GrapefruitYear1!VarExp","v":5094.5573688205259},{"$f":"GrapefruitYear1!TVarExp","v":5094.5573688205259},{"$f":"GrapefruitYear1!LVarExp","v":0},null,{"$f":"GrapefruitYear1!Price","v":0},{"$f":"GrapefruitYear1!Unit","v":""},{"$f":"IF(J31=0,0,T31/J31)","v":0},{"$f":"IF(J31=0,0,U31/J31)","v":0},{"$f":"IF(J31=0,0,V31/J31)","v":0}]
[{"$f":"GrapefruitYear2!A3","v":"Grapefruit, Year 2, Orchard Establishment, Flood Irrigated, Rio Grande Valley"},{"$f":"GrapefruitYear2!TotRet","v":-1316.7838286866822},{"$f":"GrapefruitYear2!TTotRet","v":-1316.7838286866822},{"$f":"GrapefruitYear2!LTotRet","v":0},null,{"$f":"GrapefruitYear2!TotExp","v":1316.7838286866822},{"$f":"GrapefruitYear2!TTotExp","v":1316.7838286866822},{"$f":"GrapefruitYear2!LTotExp","v":0},null,{"$f":"GrapefruitYear2!Price","v":0},{"$f":"GrapefruitYear2!Unit","v":""},{"$f":"IF(J32=0,0,F32/J32)","v":0},{"$f":"IF(J32=0,0,G32/J32)","v":0},{"$f":"IF(J32=0,0,H32/J32)","v":0},null,{"$f":"GrapefruitYear2!VarRet","v":-1197.9578282725804},{"$f":"GrapefruitYear2!TVarRet","v":-1197.9578282725804},{"$f":"GrapefruitYear2!LVarRet","v":0},null,{"$f":"GrapefruitYear2!VarExp","v":1197.9578282725804},{"$f":"GrapefruitYear2!TVarExp","v":1197.9578282725804},{"$f":"GrapefruitYear2!LVarExp","v":0},null,{"$f":"GrapefruitYear2!Price","v":0},{"$f":"GrapefruitYear2!Unit","v":""},{"$f":"IF(J32=0,0,T32/J32)","v":0},{"$f":"IF(J32=0,0,U32/J32)","v":0},{"$f":"IF(J32=0,0,V32/J32)","v":0}]
[{"$f":"+GrapefruitYear3!A3","v":"Grapefruit, Year 3, Orchard Establishment, Flood Irrigated, Rio Grande Valley"},{"$f":"+GrapefruitYear3!TotRet","v":-2177.6197545951572},{"$f":"+GrapefruitYear3!TTotRet","v":-2177.6197545951572},{"$f":"+GrapefruitYear3!LTotRet","v":0},null,{"$f":"+GrapefruitYear3!TotExp","v":3072.3697545951572},{"$f":"+GrapefruitYear3!TTotExp","v":3072.3697545951572},{"$f":"+GrapefruitYear3!LTotExp","v":0},null,{"$f":"+GrapefruitYear3!Price","v":298.25},{"$f":"+GrapefruitYear3!Unit","v":"Ton"},{"$f":"+IF($J33=0,0,F33/$J33)","v":10.301323569472446},10.301323569472446,0,null,{"$f":"+GrapefruitYear3!VarRet","v":-1916.319505347562},{"$f":"+GrapefruitYear3!TVarRet","v":-1916.319505347562},{"$f":"+GrapefruitYear3!LVarRet","v":0},null,{"$f":"+GrapefruitYear3!VarExp","v":2811.069505347562},{"$f":"+GrapefruitYear3!TVarExp","v":2811.069505347562},{"$f":"+GrapefruitYear3!LVarExp","v":0},null,{"$f":"+GrapefruitYear3!Price","v":298.25},{"$f":"+GrapefruitYear3!Unit","v":"Ton"},{"$f":"+IF($J33=0,0,T33/$J33)","v":9.4252120883405262},9.4252120883405262,0]
[{"$f":"+GrapefruitYear4!A3","v":"Grapefruit, Year 4, Orchard Establishment, Flood Irrigated, Rio Grande Valley"},{"$f":"+GrapefruitYear4!TotRet","v":-1398.6996306054853},{"$f":"+GrapefruitYear4!TTotRet","v":-1398.6996306054853},{"$f":"+GrapefruitYear4!LTotRet","v":0},null,{"$f":"+GrapefruitYear4!TotExp","v":3188.1996306054853},{"$f":"+GrapefruitYear4!TTotExp","v":3188.1996306054853},{"$f":"+GrapefruitYear4!LTotExp","v":0},null,{"$f":"+GrapefruitYear4!Price","v":298.25},{"$f":"+GrapefruitYear4!Unit","v":"Ton"},10.689688618962231,10.689688618962231,0,null,{"$f":"+GrapefruitYear4!VarRet","v":-1137.39938135789},{"$f":"+GrapefruitYear4!TVarRet","v":-1137.39938135789},{"$f":"+GrapefruitYear4!LVarRet","v":0},null,{"$f":"+GrapefruitYear4!VarExp","v":2926.89938135789},{"$f":"+GrapefruitYear4!TVarExp","v":2926.89938135789},{"$f":"+GrapefruitYear4!LVarExp","v":0},null,{"$f":"+GrapefruitYear4!Price","v":298.25},{"$f":"+GrapefruitYear4!Unit","v":"Ton"},9.8135771378303094,9.8135771378303094,0]
[{"$f":"+GrapefruitYear5!A3","v":"Grapefruit, Year 5, Orchard Establishment, Flood Irrigated, Rio Grande Valley"},{"$f":"+GrapefruitYear5!TotRet","v":-472.22123937260903},{"$f":"+GrapefruitYear5!TTotRet","v":-472.22123937260903},{"$f":"+GrapefruitYear5!LTotRet","v":0},null,{"$f":"+GrapefruitYear5!TotExp","v":3156.471239372609},{"$f":"+GrapefruitYear5!TTotExp","v":3156.471239372609},{"$f":"+GrapefruitYear5!LTotExp","v":0},null,{"$f":"+GrapefruitYear5!Price","v":298.25},{"$f":"+GrapefruitYear5!Unit","v":"Ton"},10.583306753973542,10.583306753973542,0,null,{"$f":"+GrapefruitYear5!VarRet","v":-210.92099012501376},{"$f":"+GrapefruitYear5!TVarRet","v":-210.92099012501376},{"$f":"+GrapefruitYear5!LVarRet","v":0},null,{"$f":"+GrapefruitYear5!VarExp","v":2895.1709901250138},{"$f":"+GrapefruitYear5!TVarExp","v":2895.1709901250138},{"$f":"+GrapefruitYear5!LVarExp","v":0},null,{"$f":"+GrapefruitYear5!Price","v":298.25},{"$f":"+GrapefruitYear5!Unit","v":"Ton"},9.7071952728416218,9.7071952728416218,0]
[{"$f":"+GrapefruitYear6!A3","v":"Grapefruit, Year 6, Orchard Establishment, Flood Irrigated, Rio Grande Valley"},{"$f":"+GrapefruitYear6!TotRet","v":987.30036939451475},{"$f":"+GrapefruitYear6!TTotRet","v":987.30036939451475},{"$f":"+GrapefruitYear6!LTotRet","v":0},null,{"$f":"+GrapefruitYear6!TotExp","v":3188.1996306054853},{"$f":"+GrapefruitYear6!TTotExp","v":3188.1996306054853},{"$f":"+GrapefruitYear6!LTotExp","v":0},null,{"$f":"+GrapefruitYear6!Price","v":298.25},{"$f":"+GrapefruitYear6!Unit","v":"Ton"},10.689688618962231,10.689688618962231,0,null,{"$f":"+GrapefruitYear6!VarRet","v":1248.60061864211},{"$f":"+GrapefruitYear6!TVarRet","v":1248.60061864211},{"$f":"+GrapefruitYear6!LVarRet","v":0},null,{"$f":"+GrapefruitYear6!VarExp","v":2926.89938135789},{"$f":"+GrapefruitYear6!TVarExp","v":2926.89938135789},{"$f":"+GrapefruitYear6!LVarExp","v":0},null,{"$f":"+GrapefruitYear6!Price","v":298.25},{"$f":"+GrapefruitYear6!Unit","v":"Ton"},9.8135771378303094,9.8135771378303094,0]
[{"$f":"+GrapefruitYear7!A3","v":"Grapefruit, Year 7, Orchard Establishment, Flood Irrigated, Rio Grande Valley"},{"$f":"+GrapefruitYear7!TotRet","v":2147.0051989835556},{"$f":"+GrapefruitYear7!TTotRet","v":2147.0051989835556},{"$f":"+GrapefruitYear7!LTotRet","v":0},null,{"$f":"+GrapefruitYear7!TotExp","v":3221.4948010164444},{"$f":"+GrapefruitYear7!TTotExp","v":3221.4948010164444},{"$f":"+GrapefruitYear7!LTotExp","v":0},null,{"$f":"+GrapefruitYear7!Price","v":298.25},{"$f":"+GrapefruitYear7!Unit","v":"Ton"},10.801323725118003,10.801323725118003,0,null,{"$f":"+GrapefruitYear7!VarRet","v":2408.3054482311509},{"$f":"+GrapefruitYear7!TVarRet","v":2408.3054482311509},{"$f":"+GrapefruitYear7!LVarRet","v":0},null,{"$f":"+GrapefruitYear7!VarExp","v":2960.1945517688491},{"$f":"+GrapefruitYear7!TVarExp","v":2960.1945517688491},{"$f":"+GrapefruitYear7!LVarExp","v":0},null,{"$f":"+GrapefruitYear7!Price","v":298.25},{"$f":"+GrapefruitYear7!Unit","v":"Ton"},9.925212243986083,9.925212243986083,0]
[{"$f":"+GrapefruitYear8!A3","v":"Grapefruit, Year 8, Orchard Establishment, Flood Irrigated, Rio Grande Valley"},{"$f":"+GrapefruitYear8!TotRet","v":2743.5051989835556},{"$f":"+GrapefruitYear8!TTotRet","v":2743.5051989835556},{"$f":"+GrapefruitYear8!LTotRet","v":0},null,{"$f":"+GrapefruitYear8!TotExp","v":3221.4948010164444},{"$f":"+GrapefruitYear8!TTotExp","v":3221.4948010164444},{"$f":"+GrapefruitYear8!LTotExp","v":0},null,{"$f":"+GrapefruitYear8!Price","v":298.25},{"$f":"+GrapefruitYear8!Unit","v":"Ton"},{"$f":"+IF($J38=0,0,F38/$J38)","v":10.801323725118003},10.801323725118003,0,null,{"$f":"+GrapefruitYear8!VarRet","v":3004.8054482311509},{"$f":"+GrapefruitYear8!TVarRet","v":3004.8054482311509},{"$f":"+GrapefruitYear8!LVarRet","v":0},null,{"$f":"+GrapefruitYear8!VarExp","v":2960.1945517688491},{"$f":"+GrapefruitYear8!TVarExp","v":2960.1945517688491},{"$f":"+GrapefruitYear8!LVarExp","v":0},null,{"$f":"+GrapefruitYear8!Price","v":298.25},{"$f":"+GrapefruitYear8!Unit","v":"Ton"},{"$f":"+IF($J38=0,0,T38/$J38)","v":9.925212243986083},9.925212243986083,0]
[{"$f":"+OrangesNavel!A3","v":"Oranges, Early Orange, Mature Orchard, Flood Irrigated, Rio Grande Valley"},{"$f":"+OrangesNavel!TotRet","v":2210.6527512744469},{"$f":"+OrangesNavel!TTotRet","v":2210.6527512744469},{"$f":"+OrangesNavel!LTotRet","v":0},null,{"$f":"+OrangesNavel!TotExp","v":3301.1590134314347},{"$f":"+OrangesNavel!TTotExp","v":3301.1590134314347},{"$f":"+OrangesNavel!LTotExp","v":0},null,{"$f":"+OrangesNavel!Price","v":306.21176470588233},{"$f":"+OrangesNavel!Unit","v":"Ton"},{"$f":"+IF($J39=0,0,F39/$J39)","v":10.780640700079605},10.780640700079605,0,null,{"$f":"+OrangesNavel!VarRet","v":2471.9530005220422},{"$f":"+OrangesNavel!TVarRet","v":2471.9530005220422},{"$f":"+OrangesNavel!LVarRet","v":0},null,{"$f":"+OrangesNavel!VarExp","v":3039.8587641838394},{"$f":"+OrangesNavel!TVarExp","v":3039.8587641838394},{"$f":"+OrangesNavel!LVarExp","v":0},null,{"$f":"+OrangesNavel!Price","v":306.21176470588233},{"$f":"+OrangesNavel!Unit","v":"Ton"},{"$f":"+IF($J39=0,0,T39/$J39)","v":9.9273088579847233},9.9273088579847233,0]
[{"$f":"+OrangesValencias!A3","v":"Oranges, Valencias, Mature Orchard, Flood Irrigated, Rio Grande Valley"},{"$f":"+OrangesValencias!TotRet","v":5583.8858832647784},{"$f":"+OrangesValencias!TTotRet","v":5583.8858832647784},{"$f":"+OrangesValencias!LTotRet","v":0},null,{"$f":"+OrangesValencias!TotExp","v":3119.6435284999275},{"$f":"+OrangesValencias!TTotExp","v":3119.6435284999275},{"$f":"+OrangesValencias!LTotExp","v":0},null,{"$f":"+OrangesValencias!Price","v":483.52941176470586},{"$f":"+OrangesValencias!Unit","v":"Ton"},6.4518175163623805,6.4518175163623805,0,null,{"$f":"+OrangesValencias!VarRet","v":5845.1861325123737},{"$f":"+OrangesValencias!TVarRet","v":5845.1861325123737},{"$f":"+OrangesValencias!LVarRet","v":0},null,{"$f":"+OrangesValencias!VarExp","v":2858.3432792523322},{"$f":"+OrangesValencias!TVarExp","v":2858.3432792523322},{"$f":"+OrangesValencias!LVarExp","v":0},null,{"$f":"+OrangesValencias!Price","v":483.52941176470586},{"$f":"+OrangesValencias!Unit","v":"Ton"},5.9114155410328042,5.9114155410328042,0]
[]
["LIVESTOCK"]
[]
[{"$f":"+#REF!","v":{"$error":"#REF!"}},{"$f":"+[0]!TotRet","v":{"$error":"#NAME?"}},null,null,null,{"$f":"+[0]!TotExp","v":{"$error":"#NAME?"}},null,null,null,{"$f":"+[0]!Price","v":{"$error":"#NAME?"}},{"$f":"+[0]!Unit","v":{"$error":"#NAME?"}},{"$f":"+IF($J44=0,0,F44/$J44)","v":{"$error":"#NAME?"}},null,null,null,{"$f":"+[0]!VarRet","v":{"$error":"#NAME?"}},null,null,null,{"$f":"+[0]!VarExp","v":{"$error":"#NAME?"}},null,null,null,{"$f":"+[0]!Price","v":{"$error":"#NAME?"}},{"$f":"+[0]!Unit","v":{"$error":"#NAME?"}},{"$f":"+IF($J44=0,0,T44/$J44)","v":{"$error":"#NAME?"}}]
[{"$f":"+#REF!","v":{"$error":"#REF!"}},{"$f":"+[0]!TotRet","v":{"$error":"#NAME?"}},null,null,null,{"$f":"+[0]!TotExp","v":{"$error":"#NAME?"}},null,null,null,{"$f":"+[0]!Price","v":{"$error":"#NAME?"}},{"$f":"+[0]!Unit","v":{"$error":"#NAME?"}},{"$f":"+IF($J45=0,0,F45/$J45)","v":{"$error":"#NAME?"}},null,null,null,{"$f":"+[0]!VarRet","v":{"$error":"#NAME?"}},null,null,null,{"$f":"+[0]!VarExp","v":{"$error":"#NAME?"}},null,null,null,{"$f":"+[0]!Price","v":{"$error":"#NAME?"}},{"$f":"+[0]!Unit","v":{"$error":"#NAME?"}},{"$f":"+IF($J45=0,0,T45/$J45)","v":{"$error":"#NAME?"}}]
[{"$f":"+#REF!","v":{"$error":"#REF!"}},{"$f":"+[0]!TotRet","v":{"$error":"#NAME?"}},null,null,null,{"$f":"+[0]!TotExp","v":{"$error":"#NAME?"}},null,null,null,{"$f":"+[0]!Price","v":{"$error":"#NAME?"}},{"$f":"+[0]!Unit","v":{"$error":"#NAME?"}},{"$f":"+IF($J46=0,0,F46/$J46)","v":{"$error":"#NAME?"}},null,null,null,{"$f":"+[0]!VarRet","v":{"$error":"#NAME?"}},null,null,null,{"$f":"+[0]!VarExp","v":{"$error":"#NAME?"}},null,null,null,{"$f":"+[0]!Price","v":{"$error":"#NAME?"}},{"$f":"+[0]!Unit","v":{"$error":"#NAME?"}},{"$f":"+IF($J46=0,0,T46/$J46)","v":{"$error":"#NAME?"}}]

{"sheet":"Your Returns - Cash Rent","index":34,"n_rows":51,"n_cols":12,"rows_kept":51,"cut":false,"hidden":false,"merged":[[2,2,2,3],[2,5,2,6],[2,8,2,11]]}
["Your Returns - Cash Rent"]
[]
[null,"Quantity ","Returns Above Total Specified Expenses",null,null,"Total Direct Expenses",null,null,"Breakeven Yield to Cover Total Costs at Price Entered"]
[null,"Acres, AUs,  or Head","Total Costs","Variable Costs",null,"Total Costs","Variable Costs",null,"Price","Units","Total Costs","Variable Costs"]
["FIELD CROPS"]
[]
[{"$f":"+CornConventionalTill!A3","v":"Corn, Conventional Tillage, Furrow Irrigated, Rio Grande Valley"},{"$f":"+CornConventionalTill!E7","v":0},{"$f":"+CornConventionalTill!YTotRet","v":0},{"$f":"+CornConventionalTill!YVarRet","v":0},null,{"$f":"+CornConventionalTill!YTotExp","v":0},{"$f":"+CornConventionalTill!YVarExp","v":0},null,{"$f":"+CornConventionalTill!YPrice","v":0},{"$f":"+CornConventionalTill!Unit","v":"Bushel"},{"$f":"+IF($I7=0,0,F7/$I7)","v":0},{"$f":"+IF($I7=0,0,G7/$I7)","v":0}]
[{"$f":"+CornRducedTill!A3","v":"Corn, Reduced Tillage, Furrow Irrigated, Rio Grande Valley"},{"$f":"+CornRducedTill!E7","v":0},{"$f":"+CornRducedTill!YTotRet","v":0},{"$f":"+CornRducedTill!YVarRet","v":0},null,{"$f":"+CornRducedTill!YTotExp","v":0},{"$f":"+CornRducedTill!YVarExp","v":0},null,{"$f":"+CornRducedTill!YPrice","v":0},{"$f":"+CornRducedTill!Unit","v":"Bushel"},0,0]
[{"$f":"+CottonConventionalTill!A3","v":"Cotton, Conventional Tillage, Furrow Irrigated, Rio Grande Valley"},{"$f":"+CottonConventionalTill!E7","v":0},{"$f":"+CottonConventionalTill!YTotRet","v":0},{"$f":"+CottonConventionalTill!YVarRet","v":0},null,{"$f":"+CottonConventionalTill!YTotExp","v":0},{"$f":"+CottonConventionalTill!YVarExp","v":0},null,{"$f":"+CottonConventionalTill!YPrice","v":0},{"$f":"+CottonConventionalTill!Unit","v":"Pound"},0,0]
[{"$f":"+CottonReducedTill!A3","v":"Cotton, Reduced Tillage, GMO, Furrow Irrigated, Rio Grande Valley"},{"$f":"+CottonReducedTill!E7","v":0},{"$f":"+CottonReducedTill!YTotRet","v":0},{"$f":"+CottonReducedTill!YVarRet","v":0},null,{"$f":"+CottonReducedTill!YTotExp","v":0},{"$f":"+CottonReducedTill!YVarExp","v":0},null,{"$f":"+CottonReducedTill!YPrice","v":0},{"$f":"+CottonReducedTill!Unit","v":"Pound"},0,0]
[{"$f":"+CottonDryland!A3","v":"Cotton, Conventional Tillage, Dryland, Rio Grande Valley"},{"$f":"+CottonDryland!E7","v":0},{"$f":"+CottonDryland!YTotRet","v":0},{"$f":"+CottonDryland!YVarRet","v":0},null,{"$f":"+CottonDryland!YTotExp","v":0},{"$f":"+CottonDryland!YVarExp","v":0},null,{"$f":"+CottonDryland!YPrice","v":0},{"$f":"+CottonDryland!Unit","v":"Pound"},0,0]
[{"$f":"+SorghumConventionalTill!A3","v":"Grain Sorghum, Conventional Tillage, Furrow Irrigated, Rio Grande Valley"},{"$f":"+SorghumConventionalTill!E7","v":0},{"$f":"+SorghumConventionalTill!YTotRet","v":0},{"$f":"+SorghumConventionalTill!YVarRet","v":0},null,{"$f":"+SorghumConventionalTill!YTotExp","v":0},{"$f":"+SorghumConventionalTill!YVarExp","v":0},null,{"$f":"+SorghumConventionalTill!YPrice","v":0},{"$f":"+SorghumConventionalTill!Unit","v":"CWT"},0,0]
[{"$f":"+SorghumReducedTill!A3","v":"Grain Sorghum, Reduced Tillage, Furrow Irrigated, Rio Grande Valley"},{"$f":"+SorghumReducedTill!E7","v":0},{"$f":"+SorghumReducedTill!YTotRet","v":0},{"$f":"+SorghumReducedTill!YVarRet","v":0},null,{"$f":"+SorghumReducedTill!YTotExp","v":0},{"$f":"+SorghumReducedTill!YVarExp","v":0},null,{"$f":"+SorghumReducedTill!YPrice","v":0},{"$f":"+SorghumReducedTill!Unit","v":"CWT"},0,0]
[{"$f":"+SorghumDryland!A3","v":"Grain Sorghum, Conventional Tillage, Dryland, Rio Grande Valley"},{"$f":"+SorghumDryland!E7","v":0},{"$f":"+SorghumDryland!YTotRet","v":0},{"$f":"+SorghumDryland!YVarRet","v":0},null,{"$f":"+SorghumDryland!YTotExp","v":0},{"$f":"+SorghumDryland!YVarExp","v":0},null,{"$f":"+SorghumDryland!YPrice","v":0},{"$f":"+SorghumDryland!Unit","v":"CWT"},0,0]
[{"$f":"+SugarCanePlant!A3","v":"Sugar Cane, Planted, Furrow Irrigated, Rio Grande Valley"},{"$f":"+SugarCanePlant!E7","v":0},{"$f":"+SugarCanePlant!YTotRet","v":0},{"$f":"+SugarCanePlant!YVarRet","v":0},null,{"$f":"+SugarCanePlant!YTotExp","v":0},{"$f":"+SugarCanePlant!YVarExp","v":0},null,{"$f":"+SugarCanePlant!YPrice","v":0},{"$f":"+SugarCanePlant!Unit","v":"Ton"},0,0]
[{"$f":"+SugarCaneRatoon!A3","v":"Sugar Cane, Ratoon, Furrow Irrigated, Rio Grande Valley"},{"$f":"+SugarCaneRatoon!E7","v":0},{"$f":"+SugarCaneRatoon!YTotRet","v":0},{"$f":"+SugarCaneRatoon!YVarRet","v":0},null,{"$f":"+SugarCaneRatoon!YTotExp","v":0},{"$f":"+SugarCaneRatoon!YVarExp","v":0},null,{"$f":"+SugarCaneRatoon!YPrice","v":0},{"$f":"+SugarCaneRatoon!Unit","v":"Ton"},0,0]
[{"$f":"+HayProduction!A3","v":"Hay Production, Furrow Irrigated, Rio Grande Valley"},{"$f":"+HayProduction!E7","v":0},{"$f":"+HayProduction!YTotRet","v":0},{"$f":"+HayProduction!YVarRet","v":0},null,{"$f":"+HayProduction!YTotExp","v":0},{"$f":"+HayProduction!YVarExp","v":0},null,{"$f":"+HayProduction!YPrice","v":0},{"$f":"+HayProduction!Unit","v":"Bale (950 lb)"},0,0]
[{"$f":"+HayEstablishment!A3","v":"Hay Establishment, Furrow Irrigated, Rio Grande Valley"},{"$f":"+HayEstablishment!E7","v":0},{"$f":"+HayEstablishment!YTotRet","v":0},{"$f":"+HayEstablishment!YVarRet","v":0},null,{"$f":"+HayEstablishment!YTotExp","v":0},{"$f":"+HayEstablishment!YVarExp","v":0},null,{"$f":"+HayEstablishment!YPrice","v":0},{"$f":"+HayEstablishment!Unit","v":""},0,0]
[]
["HORTICULTURAL CROPS"]
[]
[{"$f":"+Cabbage!A3","v":"Cabbage, Fresh Market, Furrow Irrigated, Rio Grande Valley"},{"$f":"+Cabbage!E7","v":0},{"$f":"+Cabbage!YTotRet","v":0},{"$f":"+Cabbage!YVarRet","v":0},null,{"$f":"+Cabbage!YTotExp","v":0},{"$f":"+Cabbage!YVarExp","v":0},null,{"$f":"+Cabbage!YPrice","v":0},{"$f":"+Cabbage!Unit","v":"Carton"},{"$f":"+IF($I22=0,0,F22/$I22)","v":0},0]
[{"$f":"+Cantaloupe!A3","v":"Cantaloupe, Plastic Mulch, Drip Irrigated, Rio Grande Valley"},{"$f":"+Cantaloupe!E7","v":0},{"$f":"+Cantaloupe!YTotRet","v":0},{"$f":"+Cantaloupe!YVarRet","v":0},null,{"$f":"+Cantaloupe!YTotExp","v":0},{"$f":"+Cantaloupe!YVarExp","v":0},null,{"$f":"+Cantaloupe!YPrice","v":0},{"$f":"+Cantaloupe!Unit","v":"Carton"},0,0]
[{"$f":"+Onion!A3","v":"Onion, Hybrid Yellow Varieties, Furrow Irrigated, Rio Grande Valley"},{"$f":"+Onion!E7","v":0},{"$f":"+Onion!YTotRet","v":0},{"$f":"+Onion!YVarRet","v":0},null,{"$f":"+Onion!YTotExp","v":0},{"$f":"+Onion!YVarExp","v":0},null,{"$f":"+Onion!YPrice","v":0},{"$f":"+Onion!Unit","v":"Sack"},0,0]
[{"$f":"+HoneyDew!A3","v":"Honeydew, Plastic Mulch, Drip Irrigated, Rio Grande Valley"},{"$f":"+HoneyDew!E7","v":0},{"$f":"+HoneyDew!YTotRet","v":0},{"$f":"+HoneyDew!YVarRet","v":0},null,{"$f":"+HoneyDew!YTotExp","v":0},{"$f":"+HoneyDew!YVarExp","v":0},null,{"$f":"+HoneyDew!YPrice","v":0},{"$f":"+HoneyDew!Unit","v":"Carton"},0,0]
[{"$f":"+Watermelon!A3","v":"Watermelon, Seedless, Plastic Mulch, Drip Irrigated, Rio Grande Valley"},{"$f":"+Watermelon!E7","v":0},{"$f":"+Watermelon!YTotRet","v":0},{"$f":"+Watermelon!YVarRet","v":0},null,{"$f":"+Watermelon!YTotExp","v":0},{"$f":"+Watermelon!YVarExp","v":0},null,{"$f":"+Watermelon!YPrice","v":0},{"$f":"+Watermelon!Unit","v":"CWT"},0,0]
[{"$f":"+WatermelonDryland!A3","v":"Watermelon, Open Pollinated Varieties, Dryland, Rio Grande Valley"},{"$f":"+WatermelonDryland!E7","v":0},{"$f":"+WatermelonDryland!YTotRet","v":0},{"$f":"+WatermelonDryland!YVarRet","v":0},null,{"$f":"+WatermelonDryland!YTotExp","v":0},{"$f":"+WatermelonDryland!YVarExp","v":0},null,{"$f":"+WatermelonDryland!YPrice","v":0},{"$f":"+WatermelonDryland!Unit","v":"CWT"},{"$f":"+IF($I27=0,0,F27/$I27)","v":0},{"$f":"+IF($I27=0,0,G27/$I27)","v":0}]
[]
["CITRUS CROPS"]
[]
[{"$f":"GrapefruitYear1!A3","v":"Grapefruit, Year 1, Orchard Establishment, Flood Irrigated, Rio Grande Valley"},{"$f":"GrapefruitYear1!E7","v":0},{"$f":"GrapefruitYear1!YTotRet","v":0},{"$f":"GrapefruitYear1!YVarRet","v":0},null,{"$f":"GrapefruitYear1!YTotExp","v":0},{"$f":"GrapefruitYear1!YVarExp","v":0},null,{"$f":"GrapefruitYear1!YPrice","v":0},{"$f":"GrapefruitYear1!Unit","v":""},{"$f":"IF(I31=0,0,F31/I31)","v":0},{"$f":"IF(I31=0,0,G31/I31)","v":0}]
[{"$f":"GrapefruitYear2!A3","v":"Grapefruit, Year 2, Orchard Establishment, Flood Irrigated, Rio Grande Valley"},{"$f":"GrapefruitYear2!E7","v":0},{"$f":"GrapefruitYear2!YTotRet","v":0},{"$f":"GrapefruitYear2!YVarRet","v":0},null,{"$f":"GrapefruitYear2!YTotExp","v":0},{"$f":"GrapefruitYear2!YVarExp","v":0},null,{"$f":"GrapefruitYear2!YPrice","v":0},{"$f":"GrapefruitYear2!Unit","v":""},{"$f":"IF(I32=0,0,F32/I32)","v":0},{"$f":"IF(I32=0,0,G32/I32)","v":0}]
[{"$f":"+GrapefruitYear3!A3","v":"Grapefruit, Year 3, Orchard Establishment, Flood Irrigated, Rio Grande Valley"},{"$f":"+GrapefruitYear3!E7","v":0},{"$f":"+GrapefruitYear3!YTotRet","v":0},{"$f":"+GrapefruitYear3!YVarRet","v":0},null,{"$f":"+GrapefruitYear3!YTotExp","v":0},{"$f":"+GrapefruitYear3!YVarExp","v":0},null,{"$f":"+GrapefruitYear3!YPrice","v":0},{"$f":"+GrapefruitYear3!Unit","v":"Ton"},{"$f":"+IF($I33=0,0,F33/$I33)","v":0},0]
[{"$f":"+GrapefruitYear4!A3","v":"Grapefruit, Year 4, Orchard Establishment, Flood Irrigated, Rio Grande Valley"},{"$f":"+GrapefruitYear4!E7","v":0},{"$f":"+GrapefruitYear4!YTotRet","v":0},{"$f":"+GrapefruitYear4!YVarRet","v":0},null,{"$f":"+GrapefruitYear4!YTotExp","v":0},{"$f":"+GrapefruitYear4!YVarExp","v":0},null,{"$f":"+GrapefruitYear4!YPrice","v":0},{"$f":"+GrapefruitYear4!Unit","v":"Ton"},0,0]
[{"$f":"+GrapefruitYear5!A3","v":"Grapefruit, Year 5, Orchard Establishment, Flood Irrigated, Rio Grande Valley"},{"$f":"+GrapefruitYear5!E7","v":0},{"$f":"+GrapefruitYear5!YTotRet","v":0},{"$f":"+GrapefruitYear5!YVarRet","v":0},null,{"$f":"+GrapefruitYear5!YTotExp","v":0},{"$f":"+GrapefruitYear5!YVarExp","v":0},null,{"$f":"+GrapefruitYear5!YPrice","v":0},{"$f":"+GrapefruitYear5!Unit","v":"Ton"},0,0]
[{"$f":"+GrapefruitYear6!A3","v":"Grapefruit, Year 6, Orchard Establishment, Flood Irrigated, Rio Grande Valley"},{"$f":"+GrapefruitYear6!E7","v":0},{"$f":"+GrapefruitYear6!YTotRet","v":0},{"$f":"+GrapefruitYear6!YVarRet","v":0},null,{"$f":"+GrapefruitYear6!YTotExp","v":0},{"$f":"+GrapefruitYear6!YVarExp","v":0},null,{"$f":"+GrapefruitYear6!YPrice","v":0},{"$f":"+GrapefruitYear6!Unit","v":"Ton"},0,0]
[{"$f":"+GrapefruitYear7!A3","v":"Grapefruit, Year 7, Orchard Establishment, Flood Irrigated, Rio Grande Valley"},{"$f":"+GrapefruitYear7!E7","v":0},{"$f":"+GrapefruitYear7!YTotRet","v":0},{"$f":"+GrapefruitYear7!YVarRet","v":0},null,{"$f":"+GrapefruitYear7!YTotExp","v":0},{"$f":"+GrapefruitYear7!YVarExp","v":0},null,{"$f":"+GrapefruitYear7!YPrice","v":0},{"$f":"+GrapefruitYear7!Unit","v":"Ton"},0,0]
[{"$f":"+GrapefruitYear8!A3","v":"Grapefruit, Year 8, Orchard Establishment, Flood Irrigated, Rio Grande Valley"},{"$f":"+GrapefruitYear8!E7","v":0},{"$f":"+GrapefruitYear8!YTotRet","v":0},{"$f":"+GrapefruitYear8!YVarRet","v":0},null,{"$f":"+GrapefruitYear8!YTotExp","v":0},{"$f":"+GrapefruitYear8!YVarExp","v":0},null,{"$f":"+GrapefruitYear8!YPrice","v":0},{"$f":"+GrapefruitYear8!Unit","v":"Ton"},{"$f":"+IF($I38=0,0,F38/$I38)","v":0},0]
[{"$f":"+OrangesNavel!A3","v":"Oranges, Early Orange, Mature Orchard, Flood Irrigated, Rio Grande Valley"},{"$f":"+OrangesNavel!E7","v":0},{"$f":"+OrangesNavel!YTotRet","v":0},{"$f":"+OrangesNavel!YVarRet","v":0},null,{"$f":"+OrangesNavel!YTotExp","v":0},{"$f":"+OrangesNavel!YVarExp","v":0},null,{"$f":"+OrangesNavel!YPrice","v":0},{"$f":"+OrangesNavel!Unit","v":"Ton"},{"$f":"+IF($I39=0,0,F39/$I39)","v":0},{"$f":"+IF($I39=0,0,G39/$I39)","v":0}]
[{"$f":"+OrangesValencias!A3","v":"Oranges, Valencias, Mature Orchard, Flood Irrigated, Rio Grande Valley"},{"$f":"+OrangesValencias!E7","v":0},{"$f":"+OrangesValencias!YTotRet","v":0},{"$f":"+OrangesValencias!YVarRet","v":0},null,{"$f":"+OrangesValencias!YTotExp","v":0},{"$f":"+OrangesValencias!YVarExp","v":0},null,{"$f":"+OrangesValencias!YPrice","v":0},{"$f":"+OrangesValencias!Unit","v":"Ton"},{"$f":"+IF($I40=0,0,F40/$I40)","v":0},{"$f":"+IF($I40=0,0,G40/$I40)","v":0}]
[]
["LIVESTOCK"]
[]
[{"$f":"+#REF!","v":{"$error":"#REF!"}},{"$f":"+#REF!","v":{"$error":"#REF!"}},{"$f":"+[0]!YTotRet","v":{"$error":"#NAME?"}},{"$f":"+[0]!YVarRet","v":{"$error":"#NAME?"}},null,{"$f":"+[0]!YTotExp","v":{"$error":"#NAME?"}},{"$f":"+[0]!YVarExp","v":{"$error":"#NAME?"}},null,{"$f":"+[0]!YPrice","v":{"$error":"#NAME?"}},{"$f":"+[0]!Unit","v":{"$error":"#NAME?"}},{"$f":"+IF($I44=0,0,F44/$I44)","v":{"$error":"#NAME?"}},{"$error":"#NAME?"}]
[{"$f":"+#REF!","v":{"$error":"#REF!"}},{"$f":"+#REF!","v":{"$error":"#REF!"}},{"$f":"+[0]!YTotRet","v":{"$error":"#NAME?"}},{"$f":"+[0]!YVarRet","v":{"$error":"#NAME?"}},null,{"$f":"+[0]!YTotExp","v":{"$error":"#NAME?"}},{"$f":"+[0]!YVarExp","v":{"$error":"#NAME?"}},null,{"$f":"+[0]!YPrice","v":{"$error":"#NAME?"}},{"$f":"+[0]!Unit","v":{"$error":"#NAME?"}},{"$error":"#NAME?"},{"$error":"#NAME?"}]
[{"$f":"+#REF!","v":{"$error":"#REF!"}},{"$f":"+#REF!","v":{"$error":"#REF!"}},{"$f":"+[0]!YTotRet","v":{"$error":"#NAME?"}},{"$f":"+[0]!YVarRet","v":{"$error":"#NAME?"}},null,{"$f":"+[0]!YTotExp","v":{"$error":"#NAME?"}},{"$f":"+[0]!YVarExp","v":{"$error":"#NAME?"}},null,{"$f":"+[0]!YPrice","v":{"$error":"#NAME?"}},{"$f":"+[0]!Unit","v":{"$error":"#NAME?"}},{"$f":"+IF($I46=0,0,F46/$I46)","v":{"$error":"#NAME?"}},{"$f":"+IF($I46=0,0,G46/$I46)","v":{"$error":"#NAME?"}}]
[]
["OTHER BUDGETS"]
[]
[{"$f":"+'Livestock Budget'!A3","v":"Livestock Budget"},{"$f":"+'Livestock Budget'!D5","v":0},{"$f":"+'Livestock Budget'!YTotRet","v":0},{"$f":"+'Livestock Budget'!YVarRet","v":0},null,{"$f":"+'Livestock Budget'!YTotExp","v":0},{"$f":"+'Livestock Budget'!YVarExp","v":0},null,{"$f":"+'Livestock Budget'!YPrice","v":0},{"$f":"+'Livestock Budget'!Unit","v":"CWT"},{"$f":"+IF($I50=0,0,F50/$I50)","v":0},{"$f":"+IF($I50=0,0,G50/$I50)","v":0}]
[{"$f":"+'Crop Budget'!A3","v":"Crop Enterprise"},{"$f":"+'Crop Budget'!D5","v":0},{"$f":"+'Crop Budget'!YTotRet","v":0},{"$f":"+'Crop Budget'!YVarRet","v":0},null,{"$f":"+'Crop Budget'!YTotExp","v":0},{"$f":"+'Crop Budget'!YVarExp","v":0},null,{"$f":"+'Crop Budget'!YPrice","v":0},{"$f":"+'Crop Budget'!Unit","v":"Cwt,lb,etc"},{"$f":"+IF($I51=0,0,F51/$I51)","v":0},{"$f":"+IF($I51=0,0,G51/$I51)","v":0}]

{"sheet":"Your Returns-Share Rent","index":35,"n_rows":63,"n_cols":29,"rows_kept":63,"cut":false,"hidden":false,"merged":[[2,24,2,28],[2,2,2,4],[2,6,2,8],[2,10,2,14],[2,16,2,18],[2,20,2,22]]}
["Your Returns - Share Rent"]
[]
["Variable Costs to the right of Total Costs","Quantity ","Returns Above Total Specified Expenses",null,null,null,"Total Direct Expenses",null,null,null,"Breakeven Yield to Cover Total Costs at Price Entered",null,null,null,null,null,"Returns Above Variable Specified Expenses",null,null,null,"Variable Direct Expenses",null,null,null,"Breakeven Yield to Cover Variavle Costs at Price Entered"]
[null,"Acres, AUs,  or Head","Total","Tenant","Landlord",null,"Total","Tenant","Landlord",null,"Price","Units","Total","Tenant","Landlord",null,"Total","Tenant","Landlord",null,"Total","Tenant","Landlord",null,"Price","Units","Total","Tenant","Landlord"]
["FIELD CROPS"]
[]
[{"$f":"+CornConventionalTill!A3","v":"Corn, Conventional Tillage, Furrow Irrigated, Rio Grande Valley"},{"$f":"+CornConventionalTill!E7","v":0},{"$f":"+CornConventionalTill!YTotRet","v":0},{"$f":"+CornConventionalTill!YTTotRet","v":0},{"$f":"+CornConventionalTill!YLTotRet","v":0},null,{"$f":"+CornConventionalTill!YTotExp","v":0},{"$f":"+CornConventionalTill!YTTotExp","v":0},{"$f":"+CornConventionalTill!YLTotExp","v":0},null,{"$f":"+CornConventionalTill!YPrice","v":0},{"$f":"+CornConventionalTill!Unit","v":"Bushel"},{"$f":"+IF($K7=0,0,G7/$K7)","v":0},{"$f":"+IF($K7=0,0,H7/$K7)","v":0},{"$f":"+IF($K7=0,0,I7/$K7)","v":0},null,{"$f":"+CornConventionalTill!YVarRet","v":0},{"$f":"+CornConventionalTill!YTVarRet","v":0},{"$f":"+CornConventionalTill!YLVarRet","v":0},null,{"$f":"+CornConventionalTill!YVarExp","v":0},{"$f":"+CornConventionalTill!YTVarExp","v":0},{"$f":"+CornConventionalTill!YLVarExp","v":0},null,{"$f":"+CornConventionalTill!YPrice","v":0},{"$f":"+CornConventionalTill!Unit","v":"Bushel"},{"$f":"+IF($K7=0,0,U7/$K7)","v":0},{"$f":"+IF($K7=0,0,V7/$K7)","v":0},{"$f":"+IF($K7=0,0,W7/$K7)","v":0}]
[{"$f":"+CornRducedTill!A3","v":"Corn, Reduced Tillage, Furrow Irrigated, Rio Grande Valley"},{"$f":"+CornRducedTill!E7","v":0},{"$f":"+CornRducedTill!YTotRet","v":0},{"$f":"+CornRducedTill!YTTotRet","v":0},{"$f":"+CornRducedTill!YLTotRet","v":0},null,{"$f":"+CornRducedTill!YTotExp","v":0},{"$f":"+CornRducedTill!YTTotExp","v":0},{"$f":"+CornRducedTill!YLTotExp","v":0},null,{"$f":"+CornRducedTill!YPrice","v":0},{"$f":"+CornRducedTill!Unit","v":"Bushel"},0,0,0,null,{"$f":"+CornRducedTill!YVarRet","v":0},{"$f":"+CornRducedTill!YTVarRet","v":0},{"$f":"+CornRducedTill!YLVarRet","v":0},null,{"$f":"+CornRducedTill!YVarExp","v":0},{"$f":"+CornRducedTill!YTVarExp","v":0},{"$f":"+CornRducedTill!YLVarExp","v":0},null,{"$f":"+CornRducedTill!YPrice","v":0},{"$f":"+CornRducedTill!Unit","v":"Bushel"},0,0,0]
[{"$f":"+CottonConventionalTill!A3","v":"Cotton, Conventional Tillage, Furrow Irrigated, Rio Grande Valley"},{"$f":"+CottonConventionalTill!E7","v":0},{"$f":"+CottonConventionalTill!YTotRet","v":0},{"$f":"+CottonConventionalTill!YTTotRet","v":0},{"$f":"+CottonConventionalTill!YLTotRet","v":0},null,{"$f":"+CottonConventionalTill!YTotExp","v":0},{"$f":"+CottonConventionalTill!YTTotExp","v":0},{"$f":"+CottonConventionalTill!YLTotExp","v":0},null,{"$f":"+CottonConventionalTill!YPrice","v":0},{"$f":"+CottonConventionalTill!Unit","v":"Pound"},0,0,0,null,{"$f":"+CottonConventionalTill!YVarRet","v":0},{"$f":"+CottonConventionalTill!YTVarRet","v":0},{"$f":"+CottonConventionalTill!YLVarRet","v":0},null,{"$f":"+CottonConventionalTill!YVarExp","v":0},{"$f":"+CottonConventionalTill!YTVarExp","v":0},{"$f":"+CottonConventionalTill!YLVarExp","v":0},null,{"$f":"+CottonConventionalTill!YPrice","v":0},{"$f":"+CottonConventionalTill!Unit","v":"Pound"},0,0,0]
[{"$f":"+CottonReducedTill!A3","v":"Cotton, Reduced Tillage, GMO, Furrow Irrigated, Rio Grande Valley"},{"$f":"+CottonReducedTill!E7","v":0},{"$f":"+CottonReducedTill!YTotRet","v":0},{"$f":"+CottonReducedTill!YTTotRet","v":0},{"$f":"+CottonReducedTill!YLTotRet","v":0},null,{"$f":"+CottonReducedTill!YTotExp","v":0},{"$f":"+CottonReducedTill!YTTotExp","v":0},{"$f":"+CottonReducedTill!YLTotExp","v":0},null,{"$f":"+CottonReducedTill!YPrice","v":0},{"$f":"+CottonReducedTill!Unit","v":"Pound"},0,0,0,null,{"$f":"+CottonReducedTill!YVarRet","v":0},{"$f":"+CottonReducedTill!YTVarRet","v":0},{"$f":"+CottonReducedTill!YLVarRet","v":0},null,{"$f":"+CottonReducedTill!YVarExp","v":0},{"$f":"+CottonReducedTill!YTVarExp","v":0},{"$f":"+CottonReducedTill!YLVarExp","v":0},null,{"$f":"+CottonReducedTill!YPrice","v":0},{"$f":"+CottonReducedTill!Unit","v":"Pound"},0,0,0]
[{"$f":"+CottonDryland!A3","v":"Cotton, Conventional Tillage, Dryland, Rio Grande Valley"},{"$f":"+CottonDryland!E7","v":0},{"$f":"+CottonDryland!YTotRet","v":0},{"$f":"+CottonDryland!YTTotRet","v":0},{"$f":"+CottonDryland!YLTotRet","v":0},null,{"$f":"+CottonDryland!YTotExp","v":0},{"$f":"+CottonDryland!YTTotExp","v":0},{"$f":"+CottonDryland!YLTotExp","v":0},null,{"$f":"+CottonDryland!YPrice","v":0},{"$f":"+CottonDryland!Unit","v":"Pound"},0,0,0,null,{"$f":"+CottonDryland!YVarRet","v":0},{"$f":"+CottonDryland!YTVarRet","v":0},{"$f":"+CottonDryland!YLVarRet","v":0},null,{"$f":"+CottonDryland!YVarExp","v":0},{"$f":"+CottonDryland!YTVarExp","v":0},{"$f":"+CottonDryland!YLVarExp","v":0},null,{"$f":"+CottonDryland!YPrice","v":0},{"$f":"+CottonDryland!Unit","v":"Pound"},0,0,0]
[{"$f":"+SorghumConventionalTill!A3","v":"Grain Sorghum, Conventional Tillage, Furrow Irrigated, Rio Grande Valley"},{"$f":"+SorghumConventionalTill!E7","v":0},{"$f":"+SorghumConventionalTill!YTotRet","v":0},{"$f":"+SorghumConventionalTill!YTTotRet","v":0},{"$f":"+SorghumConventionalTill!YLTotRet","v":0},null,{"$f":"+SorghumConventionalTill!YTotExp","v":0},{"$f":"+SorghumConventionalTill!YTTotExp","v":0},{"$f":"+SorghumConventionalTill!YLTotExp","v":0},null,{"$f":"+SorghumConventionalTill!YPrice","v":0},{"$f":"+SorghumConventionalTill!Unit","v":"CWT"},0,0,0,null,{"$f":"+SorghumConventionalTill!YVarRet","v":0},{"$f":"+SorghumConventionalTill!YTVarRet","v":0},{"$f":"+SorghumConventionalTill!YLVarRet","v":0},null,{"$f":"+SorghumConventionalTill!YVarExp","v":0},{"$f":"+SorghumConventionalTill!YTVarExp","v":0},{"$f":"+SorghumConventionalTill!YLVarExp","v":0},null,{"$f":"+SorghumConventionalTill!YPrice","v":0},{"$f":"+SorghumConventionalTill!Unit","v":"CWT"},0,0,0]
[{"$f":"+SorghumReducedTill!A3","v":"Grain Sorghum, Reduced Tillage, Furrow Irrigated, Rio Grande Valley"},{"$f":"+SorghumReducedTill!E7","v":0},{"$f":"+SorghumReducedTill!YTotRet","v":0},{"$f":"+SorghumReducedTill!YTTotRet","v":0},{"$f":"+SorghumReducedTill!YLTotRet","v":0},null,{"$f":"+SorghumReducedTill!YTotExp","v":0},{"$f":"+SorghumReducedTill!YTTotExp","v":0},{"$f":"+SorghumReducedTill!YLTotExp","v":0},null,{"$f":"+SorghumReducedTill!YPrice","v":0},{"$f":"+SorghumReducedTill!Unit","v":"CWT"},0,0,0,null,{"$f":"+SorghumReducedTill!YVarRet","v":0},{"$f":"+SorghumReducedTill!YTVarRet","v":0},{"$f":"+SorghumReducedTill!YLVarRet","v":0},null,{"$f":"+SorghumReducedTill!YVarExp","v":0},{"$f":"+SorghumReducedTill!YTVarExp","v":0},{"$f":"+SorghumReducedTill!YLVarExp","v":0},null,{"$f":"+SorghumReducedTill!YPrice","v":0},{"$f":"+SorghumReducedTill!Unit","v":"CWT"},0,0,0]
[{"$f":"+SorghumDryland!A3","v":"Grain Sorghum, Conventional Tillage, Dryland, Rio Grande Valley"},{"$f":"+SorghumDryland!E7","v":0},{"$f":"+SorghumDryland!YTotRet","v":0},{"$f":"+SorghumDryland!YTTotRet","v":0},{"$f":"+SorghumDryland!YLTotRet","v":0},null,{"$f":"+SorghumDryland!YTotExp","v":0},{"$f":"+SorghumDryland!YTTotExp","v":0},{"$f":"+SorghumDryland!YLTotExp","v":0},null,{"$f":"+SorghumDryland!YPrice","v":0},{"$f":"+SorghumDryland!Unit","v":"CWT"},0,0,0,null,{"$f":"+SorghumDryland!YVarRet","v":0},{"$f":"+SorghumDryland!YTVarRet","v":0},{"$f":"+SorghumDryland!YLVarRet","v":0},null,{"$f":"+SorghumDryland!YVarExp","v":0},{"$f":"+SorghumDryland!YTVarExp","v":0},{"$f":"+SorghumDryland!YLVarExp","v":0},null,{"$f":"+SorghumDryland!YPrice","v":0},{"$f":"+SorghumDryland!Unit","v":"CWT"},0,0,0]
[{"$f":"+SugarCanePlant!A3","v":"Sugar Cane, Planted, Furrow Irrigated, Rio Grande Valley"},{"$f":"+SugarCanePlant!E7","v":0},{"$f":"+SugarCanePlant!YTotRet","v":0},{"$f":"+SugarCanePlant!YTTotRet","v":0},{"$f":"+SugarCanePlant!YLTotRet","v":0},null,{"$f":"+SugarCanePlant!YTotExp","v":0},{"$f":"+SugarCanePlant!YTTotExp","v":0},{"$f":"+SugarCanePlant!YLTotExp","v":0},null,{"$f":"+SugarCanePlant!YPrice","v":0},{"$f":"+SugarCanePlant!Unit","v":"Ton"},0,0,0,null,{"$f":"+SugarCanePlant!YVarRet","v":0},{"$f":"+SugarCanePlant!YTVarRet","v":0},{"$f":"+SugarCanePlant!YLVarRet","v":0},null,{"$f":"+SugarCanePlant!YVarExp","v":0},{"$f":"+SugarCanePlant!YTVarExp","v":0},{"$f":"+SugarCanePlant!YLVarExp","v":0},null,{"$f":"+SugarCanePlant!YPrice","v":0},{"$f":"+SugarCanePlant!Unit","v":"Ton"},0,0,0]
[{"$f":"+SugarCaneRatoon!A3","v":"Sugar Cane, Ratoon, Furrow Irrigated, Rio Grande Valley"},{"$f":"+SugarCaneRatoon!E7","v":0},{"$f":"+SugarCaneRatoon!YTotRet","v":0},{"$f":"+SugarCaneRatoon!YTTotRet","v":0},{"$f":"+SugarCaneRatoon!YLTotRet","v":0},null,{"$f":"+SugarCaneRatoon!YTotExp","v":0},{"$f":"+SugarCaneRatoon!YTTotExp","v":0},{"$f":"+SugarCaneRatoon!YLTotExp","v":0},null,{"$f":"+SugarCaneRatoon!YPrice","v":0},{"$f":"+SugarCaneRatoon!Unit","v":"Ton"},0,0,0,null,{"$f":"+SugarCaneRatoon!YVarRet","v":0},{"$f":"+SugarCaneRatoon!YTVarRet","v":0},{"$f":"+SugarCaneRatoon!YLVarRet","v":0},null,{"$f":"+SugarCaneRatoon!YVarExp","v":0},{"$f":"+SugarCaneRatoon!YTVarExp","v":0},{"$f":"+SugarCaneRatoon!YLVarExp","v":0},null,{"$f":"+SugarCaneRatoon!YPrice","v":0},{"$f":"+SugarCaneRatoon!Unit","v":"Ton"},0,0,0]
[{"$f":"+HayProduction!A3","v":"Hay Production, Furrow Irrigated, Rio Grande Valley"},{"$f":"+HayProduction!E7","v":0},{"$f":"+HayProduction!YTotRet","v":0},{"$f":"+HayProduction!YTTotRet","v":0},{"$f":"+HayProduction!YLTotRet","v":0},null,{"$f":"+HayProduction!YTotExp","v":0},{"$f":"+HayProduction!YTTotExp","v":0},{"$f":"+HayProduction!YLTotExp","v":0},null,{"$f":"+HayProduction!YPrice","v":0},{"$f":"+HayProduction!Unit","v":"Bale (950 lb)"},0,0,0,null,{"$f":"+HayProduction!YVarRet","v":0},{"$f":"+HayProduction!YTVarRet","v":0},{"$f":"+HayProduction!YLVarRet","v":0},null,{"$f":"+HayProduction!YVarExp","v":0},{"$f":"+HayProduction!YTVarExp","v":0},{"$f":"+HayProduction!YLVarExp","v":0},null,{"$f":"+HayProduction!YPrice","v":0},{"$f":"+HayProduction!Unit","v":"Bale (950 lb)"},0,0,0]
[{"$f":"+HayEstablishment!A3","v":"Hay Establishment, Furrow Irrigated, Rio Grande Valley"},{"$f":"+HayEstablishment!E7","v":0},{"$f":"+HayEstablishment!YTotRet","v":0},{"$f":"+HayEstablishment!YTTotRet","v":0},{"$f":"+HayEstablishment!YLTotRet","v":0},null,{"$f":"+HayEstablishment!YTotExp","v":0},{"$f":"+HayEstablishment!YTTotExp","v":0},{"$f":"+HayEstablishment!YLTotExp","v":0},null,{"$f":"+HayEstablishment!YPrice","v":0},{"$f":"+HayEstablishment!Unit","v":""},0,0,0,null,{"$f":"+HayEstablishment!YVarRet","v":0},{"$f":"+HayEstablishment!YTVarRet","v":0},{"$f":"+HayEstablishment!YLVarRet","v":0},null,{"$f":"+HayEstablishment!YVarExp","v":0},{"$f":"+HayEstablishment!YTVarExp","v":0},{"$f":"+HayEstablishment!YLVarExp","v":0},null,{"$f":"+HayEstablishment!YPrice","v":0},{"$f":"+HayEstablishment!Unit","v":""},0,0,0]
[]
["HORTICULTURAL CROPS"]
[]
[{"$f":"+Cabbage!A3","v":"Cabbage, Fresh Market, Furrow Irrigated, Rio Grande Valley"},{"$f":"+Cabbage!E7","v":0},{"$f":"+Cabbage!YTotRet","v":0},{"$f":"+Cabbage!YTTotRet","v":0},{"$f":"+Cabbage!YLTotRet","v":0},null,{"$f":"+Cabbage!YTotExp","v":0},{"$f":"+Cabbage!YTTotExp","v":0},{"$f":"+Cabbage!YLTotExp","v":0},null,{"$f":"+Cabbage!YPrice","v":0},{"$f":"+Cabbage!Unit","v":"Carton"},{"$f":"+IF($K22=0,0,G22/$K22)","v":0},0,0,null,{"$f":"+Cabbage!YVarRet","v":0},{"$f":"+Cabbage!YTVarRet","v":0},{"$f":"+Cabbage!YLVarRet","v":0},null,{"$f":"+Cabbage!YVarExp","v":0},{"$f":"+Cabbage!YTVarExp","v":0},{"$f":"+Cabbage!YLVarExp","v":0},null,{"$f":"+Cabbage!YPrice","v":0},{"$f":"+Cabbage!Unit","v":"Carton"},{"$f":"+IF($K22=0,0,U22/$K22)","v":0},0,0]
[{"$f":"+Cantaloupe!A3","v":"Cantaloupe, Plastic Mulch, Drip Irrigated, Rio Grande Valley"},{"$f":"+Cantaloupe!E7","v":0},{"$f":"+Cantaloupe!YTotRet","v":0},{"$f":"+Cantaloupe!YTTotRet","v":0},{"$f":"+Cantaloupe!YLTotRet","v":0},null,{"$f":"+Cantaloupe!YTotExp","v":0},{"$f":"+Cantaloupe!YTTotExp","v":0},{"$f":"+Cantaloupe!YLTotExp","v":0},null,{"$f":"+Cantaloupe!YPrice","v":0},{"$f":"+Cantaloupe!Unit","v":"Carton"},0,0,0,null,{"$f":"+Cantaloupe!YVarRet","v":0},{"$f":"+Cantaloupe!YTVarRet","v":0},{"$f":"+Cantaloupe!YLVarRet","v":0},null,{"$f":"+Cantaloupe!YVarExp","v":0},{"$f":"+Cantaloupe!YTVarExp","v":0},{"$f":"+Cantaloupe!YLVarExp","v":0},null,{"$f":"+Cantaloupe!YPrice","v":0},{"$f":"+Cantaloupe!Unit","v":"Carton"},0,0,0]
[{"$f":"+Onion!A3","v":"Onion, Hybrid Yellow Varieties, Furrow Irrigated, Rio Grande Valley"},{"$f":"+Onion!E7","v":0},{"$f":"+Onion!YTotRet","v":0},{"$f":"+Onion!YTTotRet","v":0},{"$f":"+Onion!YLTotRet","v":0},null,{"$f":"+Onion!YTotExp","v":0},{"$f":"+Onion!YTTotExp","v":0},{"$f":"+Onion!YLTotExp","v":0},null,{"$f":"+Onion!YPrice","v":0},{"$f":"+Onion!Unit","v":"Sack"},0,0,0,null,{"$f":"+Onion!YVarRet","v":0},{"$f":"+Onion!YTVarRet","v":0},{"$f":"+Onion!YLVarRet","v":0},null,{"$f":"+Onion!YVarExp","v":0},{"$f":"+Onion!YTVarExp","v":0},{"$f":"+Onion!YLVarExp","v":0},null,{"$f":"+Onion!YPrice","v":0},{"$f":"+Onion!Unit","v":"Sack"},0,0,0]
[{"$f":"+HoneyDew!A3","v":"Honeydew, Plastic Mulch, Drip Irrigated, Rio Grande Valley"},{"$f":"+HoneyDew!E7","v":0},{"$f":"+HoneyDew!YTotRet","v":0},{"$f":"+HoneyDew!YTTotRet","v":0},{"$f":"+HoneyDew!YLTotRet","v":0},null,{"$f":"+HoneyDew!YTotExp","v":0},{"$f":"+HoneyDew!YTTotExp","v":0},{"$f":"+HoneyDew!YLTotExp","v":0},null,{"$f":"+HoneyDew!YPrice","v":0},{"$f":"+HoneyDew!Unit","v":"Carton"},0,0,0,null,{"$f":"+HoneyDew!YVarRet","v":0},{"$f":"+HoneyDew!YTVarRet","v":0},{"$f":"+HoneyDew!YLVarRet","v":0},null,{"$f":"+HoneyDew!YVarExp","v":0},{"$f":"+HoneyDew!YTVarExp","v":0},{"$f":"+HoneyDew!YLVarExp","v":0},null,{"$f":"+HoneyDew!YPrice","v":0},{"$f":"+HoneyDew!Unit","v":"Carton"},0,0,0]
[{"$f":"+Watermelon!A3","v":"Watermelon, Seedless, Plastic Mulch, Drip Irrigated, Rio Grande Valley"},{"$f":"+Watermelon!E7","v":0},{"$f":"+Watermelon!YTotRet","v":0},{"$f":"+Watermelon!YTTotRet","v":0},{"$f":"+Watermelon!YLTotRet","v":0},null,{"$f":"+Watermelon!YTotExp","v":0},{"$f":"+Watermelon!YTTotExp","v":0},{"$f":"+Watermelon!YLTotExp","v":0},null,{"$f":"+Watermelon!YPrice","v":0},{"$f":"+Watermelon!Unit","v":"CWT"},0,0,0,null,{"$f":"+Watermelon!YVarRet","v":0},{"$f":"+Watermelon!YTVarRet","v":0},{"$f":"+Watermelon!YLVarRet","v":0},null,{"$f":"+Watermelon!YVarExp","v":0},{"$f":"+Watermelon!YTVarExp","v":0},{"$f":"+Watermelon!YLVarExp","v":0},null,{"$f":"+Watermelon!YPrice","v":0},{"$f":"+Watermelon!Unit","v":"CWT"},0,0,0]
[{"$f":"+WatermelonDryland!A3","v":"Watermelon, Open Pollinated Varieties, Dryland, Rio Grande Valley"},{"$f":"+WatermelonDryland!E7","v":0},{"$f":"+WatermelonDryland!YTotRet","v":0},{"$f":"+WatermelonDryland!YTTotRet","v":0},{"$f":"+WatermelonDryland!YLTotRet","v":0},null,{"$f":"+WatermelonDryland!YTotExp","v":0},{"$f":"+WatermelonDryland!YTTotExp","v":0},{"$f":"+WatermelonDryland!YLTotExp","v":0},null,{"$f":"+WatermelonDryland!YPrice","v":0},{"$f":"+WatermelonDryland!Unit","v":"CWT"},{"$f":"+IF($K27=0,0,G27/$K27)","v":0},{"$f":"+IF($K27=0,0,H27/$K27)","v":0},{"$f":"+IF($K27=0,0,I27/$K27)","v":0},null,{"$f":"+WatermelonDryland!YVarRet","v":0},{"$f":"+WatermelonDryland!YTVarRet","v":0},{"$f":"+WatermelonDryland!YLVarRet","v":0},null,{"$f":"+WatermelonDryland!YVarExp","v":0},{"$f":"+WatermelonDryland!YTVarExp","v":0},{"$f":"+WatermelonDryland!YLVarExp","v":0},null,{"$f":"+WatermelonDryland!YPrice","v":0},{"$f":"+WatermelonDryland!Unit","v":"CWT"},{"$f":"+IF($K27=0,0,U27/$K27)","v":0},{"$f":"+IF($K27=0,0,V27/$K27)","v":0},{"$f":"+IF($K27=0,0,W27/$K27)","v":0}]
[]
["CITRUS CROPS"]
[]
[{"$f":"GrapefruitYear1!A3","v":"Grapefruit, Year 1, Orchard Establishment, Flood Irrigated, Rio Grande Valley"},{"$f":"GrapefruitYear1!E7","v":0},{"$f":"GrapefruitYear1!YTotRet","v":0},{"$f":"GrapefruitYear1!YTTotRet","v":0},{"$f":"GrapefruitYear1!YLTotRet","v":0},null,{"$f":"GrapefruitYear1!YTotExp","v":0},{"$f":"[0]!YTTotExp","v":{"$error":"#NAME?"}},{"$f":"GrapefruitYear1!YLTotExp","v":0},null,{"$f":"GrapefruitYear1!YPrice","v":0},{"$f":"GrapefruitYear1!Unit","v":""},{"$f":"+IF($K31=0,0,G31/$K31)","v":0},0,0,null,{"$f":"GrapefruitYear1!YVarRet","v":0},{"$f":"GrapefruitYear1!YTVarRet","v":0},{"$f":"GrapefruitYear1!YLVarRet","v":0},null,{"$f":"GrapefruitYear1!YVarExp","v":0},{"$f":"GrapefruitYear1!YTVarExp","v":0},{"$f":"GrapefruitYear1!YLVarExp","v":0},null,{"$f":"GrapefruitYear1!YPrice","v":0},{"$f":"GrapefruitYear1!Unit","v":""},{"$f":"+IF($K31=0,0,U31/$K31)","v":0},0,0]
[{"$f":"GrapefruitYear2!A3","v":"Grapefruit, Year 2, Orchard Establishment, Flood Irrigated, Rio Grande Valley"},{"$f":"GrapefruitYear2!E7","v":0},{"$f":"GrapefruitYear2!YTotRet","v":0},{"$f":"GrapefruitYear2!YTTotRet","v":0},{"$f":"GrapefruitYear2!YLTotRet","v":0},null,{"$f":"GrapefruitYear2!YTotExp","v":0},{"$f":"[0]!YTTotExp","v":{"$error":"#NAME?"}},{"$f":"GrapefruitYear2!YLTotExp","v":0},null,{"$f":"GrapefruitYear2!YPrice","v":0},{"$f":"GrapefruitYear2!Unit","v":""},0,0,0,null,{"$f":"GrapefruitYear2!YVarRet","v":0},{"$f":"GrapefruitYear2!YTVarRet","v":0},{"$f":"GrapefruitYear2!YLVarRet","v":0},null,{"$f":"GrapefruitYear2!YVarExp","v":0},{"$f":"GrapefruitYear2!YTVarExp","v":0},{"$f":"GrapefruitYear2!YLVarExp","v":0},null,{"$f":"GrapefruitYear2!YPrice","v":0},{"$f":"GrapefruitYear2!Unit","v":""},0,0,0]
[{"$f":"+GrapefruitYear3!A3","v":"Grapefruit, Year 3, Orchard Establishment, Flood Irrigated, Rio Grande Valley"},{"$f":"+GrapefruitYear3!E7","v":0},{"$f":"+GrapefruitYear3!YTotRet","v":0},{"$f":"+GrapefruitYear3!YTTotRet","v":0},{"$f":"+GrapefruitYear3!YLTotRet","v":0},null,{"$f":"+GrapefruitYear3!YTotExp","v":0},{"$f":"+GrapefruitYear3!YTTotExp","v":0},{"$f":"+GrapefruitYear3!YLTotExp","v":0},null,{"$f":"+GrapefruitYear3!YPrice","v":0},{"$f":"+GrapefruitYear3!Unit","v":"Ton"},0,0,0,null,{"$f":"+GrapefruitYear3!YVarRet","v":0},{"$f":"+GrapefruitYear3!YTVarRet","v":0},{"$f":"+GrapefruitYear3!YLVarRet","v":0},null,{"$f":"+GrapefruitYear3!YVarExp","v":0},{"$f":"+GrapefruitYear3!YTVarExp","v":0},{"$f":"+GrapefruitYear3!YLVarExp","v":0},null,{"$f":"+GrapefruitYear3!YPrice","v":0},{"$f":"+GrapefruitYear3!Unit","v":"Ton"},0,0,0]
[{"$f":"+GrapefruitYear4!A3","v":"Grapefruit, Year 4, Orchard Establishment, Flood Irrigated, Rio Grande Valley"},{"$f":"+GrapefruitYear4!E7","v":0},{"$f":"+GrapefruitYear4!YTotRet","v":0},{"$f":"+GrapefruitYear4!YTTotRet","v":0},{"$f":"+GrapefruitYear4!YLTotRet","v":0},null,{"$f":"+GrapefruitYear4!YTotExp","v":0},{"$f":"+GrapefruitYear4!YTTotExp","v":0},{"$f":"+GrapefruitYear4!YLTotExp","v":0},null,{"$f":"+GrapefruitYear4!YPrice","v":0},{"$f":"+GrapefruitYear4!Unit","v":"Ton"},0,0,0,null,{"$f":"+GrapefruitYear4!YVarRet","v":0},{"$f":"+GrapefruitYear4!YTVarRet","v":0},{"$f":"+GrapefruitYear4!YLVarRet","v":0},null,{"$f":"+GrapefruitYear4!YVarExp","v":0},{"$f":"+GrapefruitYear4!YTVarExp","v":0},{"$f":"+GrapefruitYear4!YLVarExp","v":0},null,{"$f":"+GrapefruitYear4!YPrice","v":0},{"$f":"+GrapefruitYear4!Unit","v":"Ton"},0,0,0]
[{"$f":"+GrapefruitYear5!A3","v":"Grapefruit, Year 5, Orchard Establishment, Flood Irrigated, Rio Grande Valley"},{"$f":"+GrapefruitYear5!E7","v":0},{"$f":"+GrapefruitYear5!YTotRet","v":0},{"$f":"+GrapefruitYear5!YTTotRet","v":0},{"$f":"+GrapefruitYear5!YLTotRet","v":0},null,{"$f":"+GrapefruitYear5!YTotExp","v":0},{"$f":"+GrapefruitYear5!YTTotExp","v":0},{"$f":"+GrapefruitYear5!YLTotExp","v":0},null,{"$f":"+GrapefruitYear5!YPrice","v":0},{"$f":"+GrapefruitYear5!Unit","v":"Ton"},0,0,0,null,{"$f":"+GrapefruitYear5!YVarRet","v":0},{"$f":"+GrapefruitYear5!YTVarRet","v":0},{"$f":"+GrapefruitYear5!YLVarRet","v":0},null,{"$f":"+GrapefruitYear5!YVarExp","v":0},{"$f":"+GrapefruitYear5!YTVarExp","v":0},{"$f":"+GrapefruitYear5!YLVarExp","v":0},null,{"$f":"+GrapefruitYear5!YPrice","v":0},{"$f":"+GrapefruitYear5!Unit","v":"Ton"},0,0,0]
[{"$f":"+GrapefruitYear6!A3","v":"Grapefruit, Year 6, Orchard Establishment, Flood Irrigated, Rio Grande Valley"},{"$f":"+GrapefruitYear6!E7","v":0},{"$f":"+GrapefruitYear6!YTotRet","v":0},{"$f":"+GrapefruitYear6!YTTotRet","v":0},{"$f":"+GrapefruitYear6!YLTotRet","v":0},null,{"$f":"+GrapefruitYear6!YTotExp","v":0},{"$f":"+GrapefruitYear6!YTTotExp","v":0},{"$f":"+GrapefruitYear6!YLTotExp","v":0},null,{"$f":"+GrapefruitYear6!YPrice","v":0},{"$f":"+GrapefruitYear6!Unit","v":"Ton"},0,0,0,null,{"$f":"+GrapefruitYear6!YVarRet","v":0},{"$f":"+GrapefruitYear6!YTVarRet","v":0},{"$f":"+GrapefruitYear6!YLVarRet","v":0},null,{"$f":"+GrapefruitYear6!YVarExp","v":0},{"$f":"+GrapefruitYear6!YTVarExp","v":0},{"$f":"+GrapefruitYear6!YLVarExp","v":0},null,{"$f":"+GrapefruitYear6!YPrice","v":0},{"$f":"+GrapefruitYear6!Unit","v":"Ton"},0,0,0]
[{"$f":"+GrapefruitYear7!A3","v":"Grapefruit, Year 7, Orchard Establishment, Flood Irrigated, Rio Grande Valley"},{"$f":"+GrapefruitYear7!E7","v":0},{"$f":"+GrapefruitYear7!YTotRet","v":0},{"$f":"+GrapefruitYear7!YTTotRet","v":0},{"$f":"+GrapefruitYear7!YLTotRet","v":0},null,{"$f":"+GrapefruitYear7!YTotExp","v":0},{"$f":"+GrapefruitYear7!YTTotExp","v":0},{"$f":"+GrapefruitYear7!YLTotExp","v":0},null,{"$f":"+GrapefruitYear7!YPrice","v":0},{"$f":"+GrapefruitYear7!Unit","v":"Ton"},0,0,0,null,{"$f":"+GrapefruitYear7!YVarRet","v":0},{"$f":"+GrapefruitYear7!YTVarRet","v":0},{"$f":"+GrapefruitYear7!YLVarRet","v":0},null,{"$f":"+GrapefruitYear7!YVarExp","v":0},{"$f":"+GrapefruitYear7!YTVarExp","v":0},{"$f":"+GrapefruitYear7!YLVarExp","v":0},null,{"$f":"+GrapefruitYear7!YPrice","v":0},{"$f":"+GrapefruitYear7!Unit","v":"Ton"},0,0,0]
[{"$f":"+GrapefruitYear8!A3","v":"Grapefruit, Year 8, Orchard Establishment, Flood Irrigated, Rio Grande Valley"},{"$f":"+GrapefruitYear8!E7","v":0},{"$f":"+GrapefruitYear8!YTotRet","v":0},{"$f":"+GrapefruitYear8!YTTotRet","v":0},{"$f":"+GrapefruitYear8!YLTotRet","v":0},null,{"$f":"+GrapefruitYear8!YTotExp","v":0},{"$f":"+GrapefruitYear8!YTTotExp","v":0},{"$f":"+GrapefruitYear8!YLTotExp","v":0},null,{"$f":"+GrapefruitYear8!YPrice","v":0},{"$f":"+GrapefruitYear8!Unit","v":"Ton"},{"$f":"+IF($K38=0,0,G38/$K38)","v":0},{"$f":"+IF($K38=0,0,H38/$K38)","v":0},{"$f":"+IF($K38=0,0,I38/$K38)","v":0},null,{"$f":"+GrapefruitYear8!YVarRet","v":0},{"$f":"+GrapefruitYear8!YTVarRet","v":0},{"$f":"+GrapefruitYear8!YLVarRet","v":0},null,{"$f":"+GrapefruitYear8!YVarExp","v":0},{"$f":"+GrapefruitYear8!YTVarExp","v":0},{"$f":"+GrapefruitYear8!YLVarExp","v":0},null,{"$f":"+GrapefruitYear8!YPrice","v":0},{"$f":"+GrapefruitYear8!Unit","v":"Ton"},{"$f":"+IF($K38=0,0,U38/$K38)","v":0},{"$f":"+IF($K38=0,0,V38/$K38)","v":0},{"$f":"+IF($K38=0,0,W38/$K38)","v":0}]
[{"$f":"+OrangesNavel!A3","v":"Oranges, Early Orange, Mature Orchard, Flood Irrigated, Rio Grande Valley"},{"$f":"+OrangesNavel!E7","v":0},{"$f":"+OrangesNavel!YTotRet","v":0},{"$f":"+OrangesNavel!YTTotRet","v":0},{"$f":"+OrangesNavel!YLTotRet","v":0},null,{"$f":"+OrangesNavel!YTotExp","v":0},{"$f":"+OrangesNavel!YTTotExp","v":0},{"$f":"+OrangesNavel!YLTotExp","v":0},null,{"$f":"+OrangesNavel!YPrice","v":0},{"$f":"+OrangesNavel!Unit","v":"Ton"},{"$f":"+IF($K39=0,0,G39/$K39)","v":0},0,0,null,{"$f":"+OrangesNavel!YVarRet","v":0},{"$f":"+OrangesNavel!YTVarRet","v":0},{"$f":"+OrangesNavel!YLVarRet","v":0},null,{"$f":"+OrangesNavel!YVarExp","v":0},{"$f":"+OrangesNavel!YTVarExp","v":0},{"$f":"+OrangesNavel!YLVarExp","v":0},null,{"$f":"+OrangesNavel!YPrice","v":0},{"$f":"+OrangesNavel!Unit","v":"Ton"},{"$f":"+IF($K39=0,0,U39/$K39)","v":0},0,0]
[{"$f":"+OrangesValencias!A3","v":"Oranges, Valencias, Mature Orchard, Flood Irrigated, Rio Grande Valley"},{"$f":"+OrangesValencias!E7","v":0},{"$f":"+OrangesValencias!YTotRet","v":0},{"$f":"+OrangesValencias!YTTotRet","v":0},{"$f":"+OrangesValencias!YLTotRet","v":0},null,{"$f":"+OrangesValencias!YTotExp","v":0},{"$f":"+OrangesValencias!YTTotExp","v":0},{"$f":"+OrangesValencias!YLTotExp","v":0},null,{"$f":"+OrangesValencias!YPrice","v":0},{"$f":"+OrangesValencias!Unit","v":"Ton"},0,0,0,null,{"$f":"+OrangesValencias!YVarRet","v":0},{"$f":"+OrangesValencias!YTVarRet","v":0},{"$f":"+OrangesValencias!YLVarRet","v":0},null,{"$f":"+OrangesValencias!YVarExp","v":0},{"$f":"+OrangesValencias!YTVarExp","v":0},{"$f":"+OrangesValencias!YLVarExp","v":0},null,{"$f":"+OrangesValencias!YPrice","v":0},{"$f":"+OrangesValencias!Unit","v":"Ton"},0,0,0]
[]
["LIVESTOCK"]
[]
[{"$f":"+#REF!","v":{"$error":"#REF!"}},{"$f":"+#REF!","v":{"$error":"#REF!"}},{"$f":"+[0]!YTotRet","v":{"$error":"#NAME?"}},null,null,null,{"$f":"+[0]!YTotExp","v":{"$error":"#NAME?"}},null,null,null,{"$f":"+[0]!YPrice","v":{"$error":"#NAME?"}},{"$f":"+[0]!Unit","v":{"$error":"#NAME?"}},{"$f":"+IF($K44=0,0,G44/$K44)","v":{"$error":"#NAME?"}},null,null,null,{"$f":"+[0]!YVarRet","v":{"$error":"#NAME?"}},null,null,null,{"$f":"+[0]!YVarExp","v":{"$error":"#NAME?"}},null,null,null,{"$f":"+[0]!YPrice","v":{"$error":"#NAME?"}},{"$f":"+[0]!Unit","v":{"$error":"#NAME?"}},{"$f":"+IF($K44=0,0,U44/$K44)","v":{"$error":"#NAME?"}}]
[{"$f":"+#REF!","v":{"$error":"#REF!"}},{"$f":"+#REF!","v":{"$error":"#REF!"}},{"$f":"+[0]!YTotRet","v":{"$error":"#NAME?"}},null,null,null,{"$f":"+[0]!YTotExp","v":{"$error":"#NAME?"}},null,null,null,{"$f":"+[0]!YPrice","v":{"$error":"#NAME?"}},{"$f":"+[0]!Unit","v":{"$error":"#NAME?"}},{"$f":"+IF($K45=0,0,G45/$K45)","v":{"$error":"#NAME?"}},null,null,null,{"$f":"+[0]!YVarRet","v":{"$error":"#NAME?"}},null,null,null,{"$f":"+[0]!YVarExp","v":{"$error":"#NAME?"}},null,null,null,{"$f":"+[0]!YPrice","v":{"$error":"#NAME?"}},{"$f":"+[0]!Unit","v":{"$error":"#NAME?"}},{"$error":"#NAME?"}]
[{"$f":"+#REF!","v":{"$error":"#REF!"}},{"$f":"+#REF!","v":{"$error":"#REF!"}},{"$f":"+[0]!YTotRet","v":{"$error":"#NAME?"}},null,null,null,{"$f":"+[0]!YTotExp","v":{"$error":"#NAME?"}},null,null,null,{"$f":"+[0]!YPrice","v":{"$error":"#NAME?"}},{"$f":"+[0]!Unit","v":{"$error":"#NAME?"}},{"$f":"+IF($K46=0,0,G46/$K46)","v":{"$error":"#NAME?"}},null,null,null,{"$f":"+[0]!YVarRet","v":{"$error":"#NAME?"}},null,null,null,{"$f":"+[0]!YVarExp","v":{"$error":"#NAME?"}},null,null,null,{"$f":"+[0]!YPrice","v":{"$error":"#NAME?"}},{"$f":"+[0]!Unit","v":{"$error":"#NAME?"}},{"$error":"#NAME?"}]
[]
[]
[]
[]
[]
[]
[]
[]
[]
[]
[null,null,null,null,null,null,null,null,null,null,null,null,null,null,{"$f":"+IF($K9=0,0,I9/$K9)","v":0}]
[]
[]
[]
[null,null,null,null,null,null,null,null,null,null,null,null,null,null,{"$f":"+IF($K44=0,0,I44/$K44)","v":{"$error":"#NAME?"}}]
[null,null,null,null,null,null,null,null,null,null,null,null,null,null,{"$f":"+IF($K45=0,0,I45/$K45)","v":{"$error":"#NAME?"}}]
[null,null,null,null,null,null,null,null,null,null,null,null,null,null,{"$f":"+IF($K46=0,0,I46/$K46)","v":{"$error":"#NAME?"}}]