{"text_format":"1","workbook":"xlsx","n_sheets":32,"sheets":["Menu","Links","CottonLCB","SorghumLCB","WheatLCB","CanolaLCB","WheatNW","Cotton","Sesame","IrrigatedCotton","IrrigatedSorghumLCB","IrrigatedSesame","IrrigatedWheatLCB","CottonUCB","SorghumUCB","WheatUCB","Corn","Soybeans","CoastalHay","CoastalPasture","SorghumHay","RiceFirstCrop","RiceSecondCrop","CowCalf","StockersSummer","StockerWinter","Livestock Budget","Crop Budget","Comparative Returns - Cash Rent","Comparative Returns-Share Rent","Your Returns - Cash Rent","Your Returns-Share Rent"],"not_rendered":{"charts":0,"images":8,"macros":1,"external_links":0,"defined_names":708,"comments":26,"pivot_tables":0},"unopened":[],"bounds":{"document_bytes":16777216,"sheet_cells":100000,"rows_first":2000,"rows_last":500,"rows_between":2000,"halvings":0,"cell_chars":16384,"cell_head_chars":4096},"cells_cut":0,"cells_raw":0,"read":"whole","date_system":"1900"}

{"sheet":"Menu","index":0,"n_rows":73,"n_cols":26,"rows_kept":73,"cut":false,"hidden":false,"merged":[[5,0,5,5]]}
[null,null,null,null,null,null,null,null,null,null,null,null,null,null,null,null,null,null,null,null,null,null,null,null,null,2]
[]
[]
[null,null,null,null,null,null,null,null,null,null,null,null,null,null,null,null,null,null,null,null,null,null,null,null,null,2]
[]
["  Coastal Bend Extension District - 11  "]
[]
[null,null,null,"Budgets"]
[]
[]
[null,null,null,"Forage Crops"]
[]
[null,null,null,{"$f":"CoastalHay!A3","v":"Coastal Bermudagrass Hay and Grazing (3 Cuttings)"}]
[null,null,null,{"$f":"CoastalPasture!A3","v":"Coastal Bermudagrass Pasture"}]
[null,null,null,{"$f":"SorghumHay!A3","v":"Sorghum Hay (2 Cuttings)"}]
[]
[null,null,null,"Field Crops - Irrigated"]
[null,"Comparative Returns"]
[null,null,null,{"$f":"IrrigatedCotton!A3","v":"Cotton - Genetically Modified Seed, Conv. Till-24 Row, Irrigated, 1250 lb. Yield Goal"}]
[null,"Links",null,{"$f":"IrrigatedSorghumLCB!A3","v":"Sorghum - Conventional Till-24 Row, Irrigated, 100 bu. Yield Goal"}]
[null,null,null,{"$f":"IrrigatedSesame!A3","v":"Sesame - Conventional Till-12 Row, Irrigated, 1100 lb. Yield Goal"}]
[null,null,null,{"$f":"IrrigatedWheatLCB!A3","v":"Hard Red Spring Wheat, Irrigated, 60 bu. Yield Goal"}]
[]
[null,null,null,"Field Crops  -  Lower Coast Dryland"]
[]
[null,null,null,{"$f":"CanolaLCB!A3","v":"Canola, Dryland, 1500 lb. Yield Goal - Lower Coast"}]
[null,null,null,{"$f":"+CottonLCB!A3","v":"Cotton - Conventional Seed, Till-24 Row, Dryland, 800 lb. Yield Goal - Lower Coast"}]
[null,null,null,{"$f":"Cotton!A3","v":"Cotton - Genetically Modified Seed, Conv. Till-24 Row, Dryland, 800 lb. Yield Goal - Lower Coast"}]
[null,null,null,{"$f":"Sesame!A3","v":"Sesame - Conventional Till-12 Row, Dryland, 800 lb. Yield Goal - Lower Coast"}]
[null,null,null,{"$f":"SorghumLCB!A3","v":"Sorghum - Conventional Till-24 Row, Dryland, 72 bu. Yield Goal - Lower Coast"}]
[null,null,null,{"$f":"WheatLCB!A3","v":"Hard Red Spring Wheat, Dryland, 35 bu. Yield Goal - Lower Coast"}]
[null,null,null,{"$f":"WheatNW!A3","v":"Hard Red Spring Wheat, Dryland, 35 bu. Yield Goal, Northwest - Lower Coast"}]
[]
[null,null,null,"Field Crops  -  Upper Coast Dryland"]
[]
[null,null,null,{"$f":"Corn!A3","v":"Corn - GMO Seed, Conventional Till-12 Row, Dryland, 100 bu. Yield Goal - Upper Coast"}]
[null,null,null,{"$f":"CottonUCB!A3","v":"Cotton - GMO Seed, Conv. Till-12 Row, Dryland, 900 lb. Yield Goal - Upper Coast"}]
[null,null,null,{"$f":"SorghumUCB!A3","v":"Sorghum - Conventional Till-12 Row, Dryland, 90 bu. Yield Goal - Upper Coast"}]
[null,null,null,{"$f":"Soybeans!A3","v":"Soybeans - GMO Seed, Conventional Till-12 Row, Dryland, 30 bu. Yield Goal - Upper Coast"}]
[null,null,null,{"$f":"WheatUCB!A3","v":"Soft Red Winter Wheat, 45 bu. Yield Goal - Upper Coast"}]
[]
[null,null,null,"Rice"]
[]
[null,null,null,{"$f":"RiceFirstCrop!A3","v":"Rice West of Houston, 1st Crop, Surface Water"}]
[null,null,null,{"$f":"RiceSecondCrop!A3","v":"Rice West of Houston, 2nd Crop, Surface Water"}]
[]
[null,null,null,"Livestock"]
[]
[null,null,null,{"$f":"+CowCalf!A3","v":"Cow-Calf Improved Pasture"}]
[null,null,null,{"$f":"+StockersSummer!A3","v":"Summer Stocker Calf Budget (160 Days Grazing)"}]
[null,null,null,{"$f":"StockerWinter!A3","v":"Winter Stocker Calf Budget (110 Says Grazing)"}]
[]
[null,null,null,"Other Budgets"]
[]
[null,null,null,{"$f":"'Livestock Budget'!A3","v":"Livestock Budget"}]
[null,null,null,{"$f":"'Crop Budget'!A3","v":"Crop Enterprise"}]
[]
[]
[]
[]
[]
[]
[]
[]
[]
[]
[]
[]
[]
[]
[]
[]
["  Developed by Extension Economists, Texas A&M AgriLife Extension Service, budgets@tamu.edu.  "]

{"sheet":"Links","index":1,"n_rows":26,"n_cols":7,"rows_kept":26,"cut":false,"hidden":false,"merged":[[21,1,21,2],[1,1,1,8],[2,1,2,8],[3,1,3,8],[5,1,5,8],[11,1,11,2],[7,1,7,2],[13,1,13,2],[9,1,9,2],[19,1,19,2],[17,1,17,2],[15,1,15,2]]}
[]
[null,"Texas Crop and Livestock Budgets"]
[null,"A Program of the Texas A&M AgriLife Extension Service"]
[null,"Agricultural Economics Department, The Texas A&M University System"]
[]
[null,"Developed by Texas A&M AgriLife Extension Service Economists and Other Specialists"]
[]
[null,"Contact Us",null,null,null,null,"Clickable Logos"]
[]
[null,"Resources"]
[]
[null,"Decision Aids (includes Machinery Cost Estimator)"]
[]
[null,"Custom Rate Survey"]
[]
[null,"Basis Data"]
[]
[null,"Master Marketer"]
[]
[null,"Extension Ag Economics"]
[]
[null,"Department of Agricultural Economics"]
[]
[null,"Menu Page"]
[]
[null,"Links last checked 4/17/2020"]

{"sheet":"CottonLCB","index":2,"n_rows":109,"n_cols":18,"rows_kept":109,"cut":false,"hidden":false,"merged":[[96,3,96,8],[108,0,108,11],[0,0,0,11],[1,0,1,11],[2,0,2,11],[3,0,3,11]]}
["Projections for Planning Purposes Only -- Not to be Used without Updating"]
["2023 Estimated Costs and Returns per Acre"]
["Cotton - Conventional Seed, Till-24 Row, Dryland, 800 lb. Yield Goal - Lower Coast"]
["Enter your name for this budget in the cell above."]
["Enter  Your Values in the cells highlighed in MAROON."]
[null,null,null,null,"Your Acres",null,null,null,null,null,null,null,null,null,null,null,null,"Your"]
[null,null,"Crop Acres",500,null,null,null,null,null,null,null,"Your",null,null,null,null,"Enterprise","Enterprise"]
[null,null,null,null,"Your",null,null,"Your","Cash","Your","Landlord","Landlord",null,"Your",null,"Your","Total","Total"]
["REVENUE",null,null,"Quantity","Quantity","Units","$/Unit","$/Unit","Total","Total","Share","Share","Landlord","Landlord","Tenant","Tenant","(500 acres)",{"$f":"\"(\" & E7 & \" acres)\"","v":"( acres)"}]
[null,"Cotton Lint",null,800,null,"Pound",0.9,null,720,{"$f":"E10*H10","v":0},0,null,0,{"$f":"J10*L10","v":0},720,{"$f":"+J10-N10","v":0},360000,{"$f":"+J10*E$7","v":0}]
[null,"Cottonseed",null,0.57999999999999996,null,"Ton",360,null,208.79999999999998,0,0,null,0,0,208.79999999999998,0,104399.99999999999,0]
[null,null,null,0,null,null,0,null,0,0,0,null,0,0,0,0,0,0]
[null,null,null,0,null,null,0,null,0,0,0,null,0,0,0,0,0,0]
["Total Revenue",null,null,null,null,null,null,null,928.8,{"$f":"SUM(J10:J13)","v":0},null,null,0,{"$f":"SUM(N10:N13)","v":0},928.8,{"$f":"SUM(P10:P13)","v":0},464400,{"$f":"SUM(R10:R13)","v":0}]
[null,null,null,null,null,null,null,null,null,null,null,null,null,null,null,null,"Enterprise","Enterprise"]
["VARIABLE COSTS",null,null,"Quantity","Quantity","Units","$/Unit","$/Unit","Total","Total","Share","Share","Landlord","Landlord","Tenant","Tenant","Total","Total"]
["Production Costs"]
[null,"Custom",null,null,null,null,null,null,"$216.4"]
[null,"","Fertilizer Application",1,null,"Ounce",0.159,null,0.159,{"$f":"E19*H19","v":0},0,null,0,{"$f":"J19*L19","v":0},0.159,{"$f":"+J19-N19","v":0},79.5,{"$f":"+J19*E$7","v":0}]
[null,"","Pick and Module",800,null,"Pound",0.13780000000000001,null,110.24000000000001,0,0,null,0,0,110.24000000000001,0,55120.000000000007,0]
[null,"","Ginning - Picker",800,null,"Pound",0.13250000000000001,null,106,0,0,null,0,0,106,0,53000,0]
[null,"Fertilizer",null,null,null,null,null,null,"$95.9"]
[null,"","24-8-0",0.16650000000000001,null,"Ton",576,null,95.904000000000011,0,0,null,0,0,95.904000000000011,0,47952.000000000007,0]
[null,"Herbicide",null,null,null,null,null,null,"$91.56"]
[null,"","Trifluralin",32,null,"Ounce",0.20140000000000002,null,6.4448000000000008,0,0,null,0,0,6.4448000000000008,0,3222.4000000000005,0]
[null,"","2, 4D Amine",2,null,"Pint",3.875,null,7.75,0,0,null,0,0,7.75,0,3875,0]
[null,"","Cotton PreEmerge Herbicide",1,null,"Quart",18.5,null,18.5,0,0,null,0,0,18.5,0,9250,0]
[null,"","Cotton Early Season Herbicide",0.1,null,"Quart",17.214399999999998,null,1.7214399999999999,0,0,null,0,0,1.7214399999999999,0,860.71999999999991,0]
[null,"","Cotton Mid Season Herbicide",3,null,"Ounce",15.55,null,46.650000000000006,0,0,null,0,0,46.650000000000006,0,23325.000000000004,0]
[null,"","Select",1,null,"Pint",10.494000000000002,null,10.494000000000002,0,0,null,0,0,10.494000000000002,0,5247.0000000000009,0]
[null,"Seed",null,null,null,null,null,null,"$50.93"]
[null,"","Cotton Seed",52.8,null,"Thousand",0.78439999999999999,null,41.416319999999999,0,0,null,0,0,41.416319999999999,0,20708.16,0]
[null,"","Cotton Seed - Insect Treatment",52.8,null,"Thousand",0.18020000000000003,null,9.5145600000000012,0,0,null,0,0,9.5145600000000012,0,4757.2800000000007,0]
[null,"Miscellaneous",null,null,null,null,null,null,"$24.05"]
[null,"","Crop Insurance -Cotton LC",1,null,"Acre",14,null,14,0,0,null,0,0,14,0,7000,0]
[null,"","Pickup Milage Charge",1,null,"Acre",4.1128,null,4.1128,0,0,null,0,0,4.1128,0,2056.4,0]
[null,"","Boll Weevil Program LC",1.6,null,"Bale",3.71,null,5.9359999999999999,0,0,null,0,0,5.9359999999999999,0,2968,0]
[null,"Other Chemicals",null,null,null,null,null,null,"$29.83"]
[null,"","2, 4D Amine",2,null,"Pint",3.875,null,7.75,0,0,null,0,0,7.75,0,3875,0]
[null,"","Glyphosate",1,null,"Quart",12.25,null,12.25,0,0,null,0,0,12.25,0,6125,0]
[null,"","Generic PIX",32,null,"Ounce",6.3600000000000004E-2,null,2.0352000000000001,0,0,null,0,0,2.0352000000000001,0,1017.6,0]
[null,"","Defoliants - Picker",4,null,"Ounce",1.1130000000000002,null,4.4520000000000008,0,0,null,0,0,4.4520000000000008,0,2226.0000000000005,0]
[null,"","Ethephon",21,null,"Ounce",0.159,null,3.339,0,0,null,0,0,3.339,0,1669.5,0]
[null,"Other Labor",null,null,null,null,null,null,"$1.36"]
[null,"","Hand Labor",0.08,null,"Hour",16.96,null,1.3568,0,0,null,0,0,1.3568,0,678.4,0]
[null,"Insecticide",null,null,null,null,null,null,"$2.24"]
[null,"","Fleahopper Control LC",1.6,null,"Ounce",1.4,null,2.2399999999999998,0,0,null,0,0,2.2399999999999998,0,1119.9999999999998,0]
[null,null,null,0,null,null,0,null,0,0,0,null,0,0,0,0,0,0]
[null,null,null,0,null,null,0,null,0,0,0,null,0,0,0,0,0,0]
[null,null,null,0,null,null,0,null,0,{"$f":"E50*H50","v":0},0,null,0,{"$f":"J50*L50","v":0},0,{"$f":"+J50-N50","v":0},0,{"$f":"+J50*E$7","v":0}]
[null,"Machinery Labor",null,null,null,null,null,null,"$4.82"]
[null,null,"Tractors/Self-Propelled",0.28000000000000003,null,"Hour",17.21,null,4.8188000000000004,{"$f":"E52*H52","v":0},0,null,0,{"$f":"J52*L52","v":0},4.8188000000000004,{"$f":"+J52-N52","v":0},2409.4,{"$f":"+J52*E$7","v":0}]
[null,null,"Other Labor",0,null,"Hour",17.21,null,0,{"$f":"E53*H53","v":0},0,null,0,{"$f":"J53*L53","v":0},0,{"$f":"+J53-N53","v":0},0,{"$f":"+J53*E$7","v":0}]
[]
[null,"Diesel Fuel",null,null,null,null,null,null,"$7.91"]
[null,null,"Pickup/General Use Equipment",1,null,"Acre",0,null,0,{"$f":"E56*H56","v":0},0,null,0,{"$f":"J56*L56","v":0},0,{"$f":"+J56-N56","v":0},0,{"$f":"+J56*E$7","v":0}]
[null,null,"Tractors/Self-Propelled",3.53,null,"Gallon",2.2400000000000002,null,7.9072000000000005,{"$f":"E57*H57","v":0},0,null,0,{"$f":"J57*L57","v":0},7.9072000000000005,{"$f":"+J57-N57","v":0},3953.6000000000004,{"$f":"+J57*E$7","v":0}]
[]
[null,"Gasoline",null,null,null,null,null,null,"$0"]
[null,null,"Pickup/General Use Equipment",1,null,"Acre",0,null,0,{"$f":"E60*H60","v":0},0,null,0,{"$f":"J60*L60","v":0},0,{"$f":"+J60-N60","v":0},0,{"$f":"+J60*E$7","v":0}]
[null,null,"Tractors/Self-Propelled",0,null,"Gallon",2.09,null,0,{"$f":"E61*H61","v":0},0,null,0,{"$f":"J61*L61","v":0},0,{"$f":"+J61-N61","v":0},0,{"$f":"+J61*E$7","v":0}]
[]
[null,"Repairs & Maintenance",null,null,null,null,null,null,"$16.63"]
[null,null,"Pickup/General Use Equipment",1,null,"Acre",0,null,0,{"$f":"E64*H64","v":0},0,null,0,{"$f":"J64*L64","v":0},0,{"$f":"+J64-N64","v":0},0,{"$f":"+J64*E$7","v":0}]
[null,null,"Irrigation Equipment",1,null,"Acre",0,null,0,0,0,null,0,0,0,0,0,0]
[null,null,"Tractors/Self-Propelled",1,null,"Acre",10.755934773059378,null,10.755934773059378,0,0,null,0,0,10.755934773059378,0,5377.9673865296891,0]
[null,null,"Implements",1,null,"Acre",5.874472995971205,null,5.874472995971205,0,0,null,0,0,5.874472995971205,0,2937.2364979856025,0]
[null,null,null,null,null,null,null,null,0,0,0,null,0,0,0,0,0,{"$f":"+J68*E$7","v":0}]
[null,null,null,null,null,null,null,null,0,0,0,null,0,0,0,0,0,0]
[null,"Interest on Credit Line",null,null,null,null,0.08,null,16.739452436104838,{"$f":"+SUM(J18:J69)/2*H70","v":0},null,null,0,{"$f":"+SUM(N18:N69)/2*L70","v":0},16.739452436104838,{"$f":"+SUM(P18:P69)/2*L70","v":0},8369.7262180524194,{"$f":"+J70*E$7","v":0}]
["Total Variable Costs",null,null,null,null,null,null,null,558.36178020513535,{"$f":"SUM(J19:J70)","v":0},null,null,0,{"$f":"SUM(N19:N70)","v":0},558.36178020513535,{"$f":"SUM(P19:P70)","v":0},279180.89010256768,{"$f":"SUM(R19:R70)","v":0}]
["Planned Returns Above Variable Costs:",null,null,null,null,null,null,null,370.43821979486461,{"$f":"+J14-J71","v":0},null,null,0,{"$f":"+N14-N71","v":0},370.43821979486461,{"$f":"+P14-P71","v":0},185219.10989743232,{"$f":"+R14-R71","v":0}]
[null,"Breakeven Price to Cover Variable Costs",null,null,null,null,0.43695222525641925,{"$f":"IF(E10=0,\"n/a\",(YVarExp-(YTotExp+YTotRet-J10))/E10)","v":"n/a"},"Pound"]
[null,null,null,null,null,null,null,null,null,null,null,null,null,null,null,null,"Enterprise","Enterprise"]
["FIXED COSTS",null,null,"Quantity","Quantity","Units","$/Unit","$/Unit",null,"Total","Share","Share","Landlord","Landlord","Tenant","Tenant","Total","Total"]
[null,"Machinery Depreciation",null,null,null,null,null,null,"$22.55"]
[null,null,"Tractors/Self-Propelled",1,null,"Acre",14.333630281730082,null,14.333630281730082,{"$f":"E77*H77","v":0},0,null,0,{"$f":"J77*L77","v":0},14.333630281730082,{"$f":"+J77-N77","v":0},7166.815140865041,{"$f":"+J77*E$7","v":0}]
[null,null,"Implements",1,null,"Acre",8.2206787815762947,null,8.2206787815762947,0,0,null,0,{"$f":"J78*L78","v":0},8.2206787815762947,0,4110.3393907881473,0]
[null,"Equipment Investment",null,null,null,null,null,null,"$11.7"]
[null,null,"Tractors/Self-Propelled",110.16786880506032,null,"Dollars",0.08,null,8.8134295044048265,{"$f":"E80*H80","v":0},0,null,0,{"$f":"J80*L80","v":0},8.8134295044048265,{"$f":"+J80-N80","v":0},4406.7147522024134,{"$f":"+J80*E$7","v":0}]
[null,null,"Implements",36.088261585028476,null,"Dollars",0.08,null,2.887060926802278,0,0,null,0,{"$f":"J81*L81","v":0},2.887060926802278,0,1443.5304634011391,0]
[null,"Salaried Labor",null,1,null,"Acre",0,null,0,0,0,null,0,{"$f":"J82*L82","v":0},0,{"$f":"+J82-N82","v":0},0,{"$f":"+J82*E$7","v":0}]
[null,"Management Fee, Owner/Operator Labor",null,1,null,"Acre",46.44,null,46.44,0,0,null,0,0,46.44,0,23220,0]
[null,"Allocated Establishment Cost",null,1,null,"Acre",0,null,0,0,0,null,0,0,0,0,0,0]
[null,"LCB - Land Charge",null,1,null,"Acre",70,null,70,0,0,null,0,0,70,0,35000,0]
[null,"Property Taxes",null,1,null,"Acre",0,null,0,{"$f":"E86*H86","v":0},0,null,0,0,0,0,0,{"$f":"+J86*E$7","v":0}]
[null,"Whole Farm Insurance",null,1,null,"Acre",0,null,0,0,0,null,0,0,0,0,0,0]
[null,null,null,1,null,null,0,null,0,0,0,null,0,0,0,0,0,0]
[null,null,null,1,null,null,0,null,0,0,0,null,0,0,0,0,0,0]
["Total Fixed Costs",null,null,null,null,null,null,null,150.69479949451349,{"$f":"+SUM(J77:J89)","v":0},null,null,0,{"$f":"+SUM(N77:N89)","v":0},150.69479949451349,{"$f":"+SUM(P77:P89)","v":0},75347.399747256743,{"$f":"+SUM(R77:R89)","v":0}]
["Total Specified Costs",null,null,null,null,null,null,null,709.05657969964886,{"$f":"+J71+J90","v":0},null,null,0,{"$f":"+N71+N90","v":0},709.05657969964886,{"$f":"+P71+P90","v":0},354528.28984982439,{"$f":"+R71+R90","v":0}]
[]
["Returns Above Specified Costs",null,null,null,null,null,null,null,219.74342030035109,{"$f":"+J14-J91","v":0},null,null,0,{"$f":"+N14-N91","v":0},219.74342030035109,{"$f":"+P14-P91","v":0},109871.71015017561,{"$f":"+R14-R91","v":0}]
[]
["    Breakeven Price to Cover Total Costs",null,null,null,null,null,0.62532072462456112,{"$f":"IF(E10=0,\"n/a\",(YTotExp-(YTotExp+YTotRet-J10))/E10)","v":"n/a"},"Pound"]
[]
[null,null,null,"Example Breakeven Prices"]
[null,"Example","Example","To Cover",null,null,"To Cover"]
[null,"Yield","Yield","Variable",null,null,"Total"]
[null,"Percent","Pound","Costs",null,null,"Costs"]
[null,0.75,600,0.58260296700855896,null,null,0.83376096616608153]
[null,0.9,720,0.48550247250713247,null,null,0.69480080513840126]
[null,1,800,0.43695222525641925,null,null,0.62532072462456112]
[null,1.1000000000000001,880.00000000000011,0.39722929568765381,null,null,0.56847338602232822]
[null,1.25,1000,0.3495617802051354,null,null,0.50025657969964887]
[]
["  Developed by Extension Economists, Texas A&M AgriLife Extension Service, budgets@tamu.edu.  "]
[]
["Information presented is prepared solely as a general guide and not intended to recognize or predict the costs and returns from any one operation.  Brand names are mentioned only as examples and imply no endorsement."]

{"sheet":"SorghumLCB","index":3,"n_rows":97,"n_cols":18,"rows_kept":97,"cut":false,"hidden":false,"merged":[[84,3,84,8],[96,0,96,11],[0,0,0,11],[1,0,1,11],[2,0,2,11],[3,0,3,11]]}
["Projections for Planning Purposes Only -- Not to be Used without Updating"]
["2023 Estimated Costs and Returns per Acre"]
["Sorghum - Conventional Till-24 Row, Dryland, 72 bu. Yield Goal - Lower Coast"]
["Enter your name for this budget in the cell above."]
["Enter  Your Values in the cells highlighed in MAROON."]
[null,null,null,null,"Your Acres",null,null,null,null,null,null,null,null,null,null,null,null,"Your"]
[null,null,"Crop Acres",500,null,null,null,null,null,null,null,"Your",null,null,null,null,"Enterprise","Enterprise"]
[null,null,null,null,"Your",null,null,"Your","Cash","Your","Landlord","Landlord",null,"Your",null,"Your","Total","Total"]
["REVENUE",null,null,"Quantity","Quantity","Units","$/Unit","$/Unit","Total","Total","Share","Share","Landlord","Landlord","Tenant","Tenant","(500 acres)",{"$f":"\"(\" & E7 & \" acres)\"","v":"( acres)"}]
[null,"Grain Sorghum, Lower Coast",null,72,null,"Bushel",5.0999999999999996,null,367.2,{"$f":"E10*H10","v":0},0,null,0,{"$f":"J10*L10","v":0},367.2,{"$f":"+J10-N10","v":0},183600,{"$f":"+J10*E$7","v":0}]
[null,null,null,0,null,null,0,null,0,0,0,null,0,0,0,{"$f":"+J11-N11","v":0},0,0]
[null,null,null,0,null,null,0,null,0,0,0,null,0,0,0,0,0,0]
["Total Revenue",null,null,null,null,null,null,null,367.2,{"$f":"SUM(J10:J12)","v":0},null,null,0,{"$f":"SUM(N10:N12)","v":0},367.2,{"$f":"SUM(P10:P12)","v":0},183600,{"$f":"SUM(R10:R12)","v":0}]
[null,null,null,null,null,null,null,null,null,null,null,null,null,null,null,null,"Enterprise","Enterprise"]
["VARIABLE COSTS",null,null,"Quantity","Quantity","Units","$/Unit","$/Unit","Total","Total","Share","Share","Landlord","Landlord","Tenant","Tenant","Total","Total"]
["Production Costs"]
[null,"Custom",null,null,null,null,null,null,"$24.64"]
[null,"","Fertilizer Application",1,null,"Ounce",0.159,null,0.159,{"$f":"E18*H18","v":0},0,null,0,{"$f":"J18*L18","v":0},0.159,{"$f":"+J18-N18","v":0},79.5,{"$f":"+J18*E$7","v":0}]
[null,"","Custom Haul - Sorghum",42,null,"CWT",0.58300000000000007,null,24.486000000000004,0,0,null,0,0,24.486000000000004,0,12243.000000000002,0]
[null,"Fertilizer",null,null,null,null,null,null,"$95.04"]
[null,"","24-8-0",0.16500000000000001,null,"Ton",576,null,95.04,0,0,null,0,0,95.04,0,47520,0]
[null,"Herbicide",null,null,null,null,null,null,"$25.92"]
[null,"","Atrazine 4L",2,null,"Quart",5.75,null,11.5,0,0,null,0,0,11.5,0,5750,0]
[null,"","Sorghum PreEmerge Herbicide",14,null,"Ounce",1.03,null,14.42,0,0,null,0,0,14.42,0,7210,0]
[null,"Insecticide",null,null,null,null,null,null,"$13.51"]
[null,"","Headworn Control",2.6,null,"Ounce",1.7,null,4.42,0,0,null,0,0,4.42,0,2210,0]
[null,"","Transform",1,null,"Ounce",8.1938000000000013,null,8.1938000000000013,0,0,null,0,0,8.1938000000000013,0,4096.9000000000005,0]
[null,"","Stinkbug Control",2,null,"Ounce",0.45,null,0.9,0,0,null,0,0,0.9,0,450,0]
[null,"Miscellaneous",null,null,null,null,null,null,"$10.11"]
[null,"","Crop Insurance -Sorghum LC",1,null,"Acre",6,null,6,0,0,null,0,0,6,0,3000,0]
[null,"","Pickup Milage Charge",1,null,"Acre",4.1128,null,4.1128,0,0,null,0,0,4.1128,0,2056.4,0]
[null,"Other Labor",null,null,null,null,null,null,"$0.68"]
[null,"","Hand Labor",0.04,null,"Hour",16.96,null,0.6784,0,0,null,0,0,0.6784,0,339.2,0]
[null,"Seed",null,null,null,null,null,null,"$15.26"]
[null,"","Treated Sorghum Seed",4.5,null,"Pound",3.3920000000000003,null,15.264000000000001,0,0,null,0,0,15.264000000000001,0,7632.0000000000009,0]
[null,null,null,0,null,null,0,null,0,0,0,null,0,0,0,0,0,0]
[null,null,null,0,null,null,0,null,0,0,0,null,0,0,0,0,0,0]
[null,null,null,0,null,null,0,null,0,{"$f":"E38*H38","v":0},0,null,0,{"$f":"J38*L38","v":0},0,{"$f":"+J38-N38","v":0},0,{"$f":"+J38*E$7","v":0}]
[null,"Machinery Labor",null,null,null,null,null,null,"$8.78"]
[null,null,"Tractors/Self-Propelled",0.51,null,"Hour",17.21,null,8.7771000000000008,{"$f":"E40*H40","v":0},0,null,0,{"$f":"J40*L40","v":0},8.7771000000000008,{"$f":"+J40-N40","v":0},4388.55,{"$f":"+J40*E$7","v":0}]
[null,null,"Other Labor",0,null,"Hour",17.21,null,0,{"$f":"E41*H41","v":0},0,null,0,{"$f":"J41*L41","v":0},0,{"$f":"+J41-N41","v":0},0,{"$f":"+J41*E$7","v":0}]
[]
[null,"Diesel Fuel",null,null,null,null,null,null,"$12.97"]
[null,null,"Pickup/General Use Equipment",1,null,"Acre",0,null,0,{"$f":"E44*H44","v":0},0,null,0,{"$f":"J44*L44","v":0},0,{"$f":"+J44-N44","v":0},0,{"$f":"+J44*E$7","v":0}]
[null,null,"Tractors/Self-Propelled",5.79,null,"Gallon",2.2400000000000002,null,12.969600000000002,{"$f":"E45*H45","v":0},0,null,0,{"$f":"J45*L45","v":0},12.969600000000002,{"$f":"+J45-N45","v":0},6484.8000000000011,{"$f":"+J45*E$7","v":0}]
[]
[null,"Gasoline",null,null,null,null,null,null,"$0"]
[null,null,"Pickup/General Use Equipment",1,null,"Acre",0,null,0,{"$f":"E48*H48","v":0},0,null,0,{"$f":"J48*L48","v":0},0,{"$f":"+J48-N48","v":0},0,{"$f":"+J48*E$7","v":0}]
[null,null,"Tractors/Self-Propelled",0,null,"Gallon",2.09,null,0,{"$f":"E49*H49","v":0},0,null,0,{"$f":"J49*L49","v":0},0,{"$f":"+J49-N49","v":0},0,{"$f":"+J49*E$7","v":0}]
[]
[null,"Repairs & Maintenance",null,null,null,null,null,null,"$29.75"]
[null,null,"Pickup/General Use Equipment",1,null,"Acre",0,null,0,{"$f":"E52*H52","v":0},0,null,0,{"$f":"J52*L52","v":0},0,{"$f":"+J52-N52","v":0},0,{"$f":"+J52*E$7","v":0}]
[null,null,"Irrigation Equipment",1,null,"Acre",0,null,0,0,0,null,0,0,0,0,0,0]
[null,null,"Tractors/Self-Propelled",1,null,"Acre",21.461178667408422,null,21.461178667408422,0,0,null,0,0,21.461178667408422,0,10730.589333704211,0]
[null,null,"Implements",1,null,"Acre",8.2902781032053188,null,8.2902781032053188,0,0,null,0,0,8.2902781032053188,0,4145.1390516026595,0]
[null,null,null,null,null,null,null,null,0,0,0,null,0,0,0,0,0,0]
[null,null,null,null,null,null,null,null,0,0,0,null,0,0,0,0,0,0]
[null,"Interest on Credit Line",null,null,null,null,0.08,null,10.040950895269804,{"$f":"+SUM(J17:J57)/2*H58","v":0},null,null,0,{"$f":"+SUM(N17:N57)/2*L58","v":0},10.040950895269804,{"$f":"+SUM(P17:P57)/2*L58","v":0},5020.4754476349017,{"$f":"+J58*E$7","v":0}]
["Total Variable Costs",null,null,null,null,null,null,null,246.71310766588357,{"$f":"SUM(J18:J58)","v":0},null,null,0,{"$f":"SUM(N18:N58)","v":0},246.71310766588357,{"$f":"SUM(P18:P58)","v":0},123356.55383294176,{"$f":"SUM(R18:R58)","v":0}]
["Planned Returns Above Variable Costs:",null,null,null,null,null,null,null,120.48689233411642,{"$f":"+J13-J59","v":0},null,null,0,{"$f":"+N13-N59","v":0},120.48689233411642,{"$f":"+P13-P59","v":0},60243.446167058239,{"$f":"+R13-R59","v":0}]
[null,"Breakeven Price to Cover Variable Costs",null,null,null,null,3.4265709398039386,{"$f":"IF(E10=0,\"n/a\",(YVarExp-(YTotExp+YTotRet-J10))/E10)","v":"n/a"},"Bushel"]
[null,null,null,null,null,null,null,null,null,null,null,null,null,null,null,null,"Enterprise","Enterprise"]
["FIXED COSTS",null,null,"Quantity","Quantity","Units","$/Unit","$/Unit","Total","Total","Share","Share","Landlord","Landlord","Tenant","Tenant","Total","Total"]
[null,"Machinery Depreciation",null,null,null,null,null,null,"$34.44"]
[null,null,"Tractors/Self-Propelled",1,null,"Acre",23.475213291166103,null,23.475213291166103,{"$f":"E65*H65","v":0},0,null,0,{"$f":"J65*L65","v":0},23.475213291166103,{"$f":"+J65-N65","v":0},11737.606645583051,{"$f":"+J65*E$7","v":0}]
[null,null,"Implements",1,null,"Acre",10.960632879222608,null,10.960632879222608,0,0,null,0,{"$f":"J66*L66","v":0},10.960632879222608,0,5480.3164396113043,0]
[null,"Equipment Investment",null,null,null,null,null,null,"$20.08"]
[null,null,"Tractors/Self-Propelled",179.81046947302599,null,"Dollars",0.08,null,14.384837557842079,{"$f":"E68*H68","v":0},0,null,0,{"$f":"J68*L68","v":0},14.384837557842079,{"$f":"+J68-N68","v":0},7192.41877892104,{"$f":"+J68*E$7","v":0}]
[null,null,"Implements",71.205990409562091,null,"Dollars",0.08,null,5.6964792327649674,0,0,null,0,{"$f":"J69*L69","v":0},5.6964792327649674,0,2848.2396163824837,0]
[null,"Salaried Labor",null,1,null,"Acre",0,null,0,0,0,null,0,{"$f":"J70*L70","v":0},0,{"$f":"+J70-N70","v":0},0,{"$f":"+J70*E$7","v":0}]
[null,"Management Fee, Owner/Operator Labor",null,1,null,"Acre",18.36,null,18.36,0,0,null,0,0,18.36,0,9180,0]
[null,"Allocated Establishment Cost",null,1,null,"Acre",0,null,0,0,0,null,0,0,0,0,0,0]
[null,"LCB - Land Charge",null,1,null,"Acre",70,null,70,0,0,null,0,0,70,0,35000,0]
[null,"Property Taxes",null,1,null,"Acre",0,null,0,0,0,null,0,0,0,0,0,0]
[null,"Whole Farm Insurance",null,1,null,"Acre",0,null,0,0,0,null,0,0,0,0,0,0]
[null,null,null,1,null,null,0,null,0,0,0,null,0,0,0,0,0,0]
[null,null,null,1,null,null,0,null,0,{"$f":"E77*H77","v":0},0,null,0,0,0,0,0,0]
["Total Fixed Costs",null,null,null,null,null,null,null,142.87716296099575,{"$f":"+SUM(J65:J77)","v":0},null,null,0,{"$f":"+SUM(N65:N77)","v":0},142.87716296099575,{"$f":"+SUM(P65:P77)","v":0},71438.581480497887,{"$f":"+SUM(R65:R77)","v":0}]
["Total Specified Costs",null,null,null,null,null,null,null,389.59027062687932,{"$f":"+J59+J78","v":0},null,null,0,{"$f":"+N59+N78","v":0},389.59027062687932,{"$f":"+P59+P78","v":0},194795.13531343965,{"$f":"+R59+R78","v":0}]
[]
["Returns Above Specified Costs",null,null,null,null,null,null,null,-22.390270626879328,{"$f":"+J13-J79","v":0},null,null,0,{"$f":"+N13-N79","v":0},-22.390270626879328,{"$f":"+P13-P79","v":0},-11195.135313439649,{"$f":"+R13-R79","v":0}]
[]
["    Breakeven Price to Cover Total Costs",null,null,null,null,null,5.4109759809288791,{"$f":"IF(E10=0,\"n/a\",(YTotExp-(YTotExp+YTotRet-J10))/E10)","v":"n/a"},"Bushel"]
[]
[null,null,null,"Example Breakeven Prices"]
[null,"Example","Example","To Cover",null,null,"To Cover"]
[null,"Yield","Yield","Variable",null,null,"Total"]
[null,"Percent","Bushel","Costs",null,null,"Costs"]
[null,0.75,54,4.5687612530719184,null,null,7.2146346412385061]
[null,0.9,64.8,3.8073010442265987,null,null,6.0121955343654214]
[null,1,72,3.4265709398039386,null,null,5.4109759809288791]
[null,1.1000000000000001,79.2,3.1150644907308531,null,null,4.9190690735717082]
[null,1.25,90,2.7412567518431508,null,null,4.3287807847431035]
[]
["  Developed by Extension Economists, Texas A&M AgriLife Extension Service, budgets@tamu.edu.  "]
[]
["Information presented is prepared solely as a general guide and not intended to recognize or predict the costs and returns from any one operation.  Brand names are mentioned only as examples and imply no endorsement."]

{"sheet":"WheatLCB","index":4,"n_rows":94,"n_cols":18,"rows_kept":94,"cut":false,"hidden":false,"merged":[[81,3,81,8],[93,0,93,11],[0,0,0,11],[1,0,1,11],[2,0,2,11],[3,0,3,11]]}
["Projections for Planning Purposes Only -- Not to be Used without Updating"]
["2023 Estimated Costs and Returns per Acre"]
["Hard Red Spring Wheat, Dryland, 35 bu. Yield Goal - Lower Coast"]
["Enter your name for this budget in the cell above."]
["Enter  Your Values in the cells highlighed in MAROON."]
[null,null,null,null,"Your Acres",null,null,null,null,null,null,null,null,null,null,null,null,"Your"]
[null,null,"Crop Acres",500,null,null,null,null,null,null,null,"Your",null,null,null,null,"Enterprise","Enterprise"]
[null,null,null,null,"Your",null,null,"Your","Cash","Your","Landlord","Landlord",null,"Your",null,"Your","Total","Total"]
["REVENUE",null,null,"Quantity","Quantity","Units","$/Unit","$/Unit","Total","Total","Share","Share","Landlord","Landlord","Tenant","Tenant","(500 acres)",{"$f":"\"(\" & E7 & \" acres)\"","v":"( acres)"}]
[null,"Hard Red Spring Wheat",null,35,null,"Bushel",8.25,null,288.75,{"$f":"E10*H10","v":0},0,null,0,{"$f":"J10*L10","v":0},288.75,{"$f":"+J10-N10","v":0},144375,{"$f":"+J10*E$7","v":0}]
[null,null,null,0,null,null,0,null,0,0,0,null,0,0,0,{"$f":"+J11-N11","v":0},0,0]
[null,null,null,0,null,null,0,null,0,0,0,null,0,0,0,0,0,0]
["Total Revenue",null,null,null,null,null,null,null,288.75,{"$f":"SUM(J10:J12)","v":0},null,null,0,{"$f":"SUM(N10:N12)","v":0},288.75,{"$f":"SUM(P10:P12)","v":0},144375,{"$f":"SUM(R10:R12)","v":0}]
[null,null,null,null,null,null,null,null,null,null,null,null,null,null,null,null,"Enterprise","Enterprise"]
["VARIABLE COSTS",null,null,"Quantity","Quantity","Units","$/Unit","$/Unit","Total","Total","Share","Share","Landlord","Landlord","Tenant","Tenant","Total","Total"]
["Production Costs"]
[null,"Custom",null,null,null,null,null,null,"$18.82"]
[null,"","Custom Haul - Wheat",35,null,"Bushel",0.26500000000000001,null,9.2750000000000004,{"$f":"E18*H18","v":0},0,null,0,{"$f":"J18*L18","v":0},9.2750000000000004,{"$f":"+J18-N18","v":0},4637.5,{"$f":"+J18*E$7","v":0}]
[null,"","Fertilizer Application LC",1,null,"Acre",9.5400000000000009,null,9.5400000000000009,0,0,null,0,0,9.5400000000000009,0,4770.0000000000009,0]
[null,"Fertilizer",null,null,null,null,null,null,"$57.6"]
[null,"","24-8-0",0.1,null,"Ton",576,null,57.6,0,0,null,0,0,57.6,0,28800,0]
[null,"Herbicide",null,null,null,null,null,null,"$7.75"]
[null,"","Glyphosate (Generic)",1,null,"Quart",7.75,null,7.75,0,0,null,0,0,7.75,0,3875,0]
[null,"Insecticide",null,null,null,null,null,null,"$11.88"]
[null,"","Wheat Insect Control",1.5,null,"Pint",7.9182000000000006,null,11.877300000000002,0,0,null,0,0,11.877300000000002,0,5938.6500000000005,0]
[null,"Miscellaneous",null,null,null,null,null,null,"$8.11"]
[null,"","Pickup Milage Charge",1,null,"Acre",4.1128,null,4.1128,0,0,null,0,0,4.1128,0,2056.4,0]
[null,"","Crop Insurance -Wheat LC",1,null,"Acre",4,null,4,0,0,null,0,0,4,0,2000,0]
[null,"Seed",null,null,null,null,null,null,"$37.21"]
[null,"","HRS Wheat Seed",90,null,"Pound",0.41340000000000005,null,37.206000000000003,0,0,null,0,0,37.206000000000003,0,18603,0]
[null,"Other Labor",null,null,null,null,null,null,"$0.31"]
[null,"","Hand Labor",1.7999999999999999E-2,null,"Hour",16.96,null,0.30528,0,0,null,0,0,0.30528,0,152.63999999999999,0]
[null,null,null,0,null,null,0,null,0,0,0,null,0,0,0,0,0,0]
[null,null,null,0,null,null,0,null,0,0,0,null,0,0,0,0,0,0]
[null,null,null,0,null,null,0,null,0,{"$f":"E35*H35","v":0},0,null,0,{"$f":"J35*L35","v":0},0,{"$f":"+J35-N35","v":0},0,{"$f":"+J35*E$7","v":0}]
[null,"Machinery Labor",null,null,null,null,null,null,"$5.34"]
[null,null,"Tractors/Self-Propelled",0.31,null,"Hour",17.21,null,5.3351000000000006,{"$f":"E37*H37","v":0},0,null,0,{"$f":"J37*L37","v":0},5.3351000000000006,{"$f":"+J37-N37","v":0},2667.55,{"$f":"+J37*E$7","v":0}]
[null,null,"Other Labor",0,null,"Hour",17.21,null,0,{"$f":"E38*H38","v":0},0,null,0,{"$f":"J38*L38","v":0},0,{"$f":"+J38-N38","v":0},0,{"$f":"+J38*E$7","v":0}]
[]
[null,"Diesel Fuel",null,null,null,null,null,null,"$7.59"]
[null,null,"Pickup/General Use Equipment",1,null,"Acre",0,null,0,{"$f":"E41*H41","v":0},0,null,0,{"$f":"J41*L41","v":0},0,{"$f":"+J41-N41","v":0},0,{"$f":"+J41*E$7","v":0}]
[null,null,"Tractors/Self-Propelled",3.39,null,"Gallon",2.2400000000000002,null,7.5936000000000012,{"$f":"E42*H42","v":0},0,null,0,{"$f":"J42*L42","v":0},7.5936000000000012,{"$f":"+J42-N42","v":0},3796.8000000000006,{"$f":"+J42*E$7","v":0}]
[]
[null,"Gasoline",null,null,null,null,null,null,"$0"]
[null,null,"Pickup/General Use Equipment",1,null,"Acre",0,null,0,{"$f":"E45*H45","v":0},0,null,0,{"$f":"J45*L45","v":0},0,{"$f":"+J45-N45","v":0},0,{"$f":"+J45*E$7","v":0}]
[null,null,"Tractors/Self-Propelled",0,null,"Gallon",2.09,null,0,{"$f":"E46*H46","v":0},0,null,0,{"$f":"J46*L46","v":0},0,{"$f":"+J46-N46","v":0},0,{"$f":"+J46*E$7","v":0}]
[]
[null,"Repairs & Maintenance",null,null,null,null,null,null,"$19.66"]
[null,null,"Pickup/General Use Equipment",1,null,"Acre",0,null,0,{"$f":"E49*H49","v":0},0,null,0,{"$f":"J49*L49","v":0},0,{"$f":"+J49-N49","v":0},0,{"$f":"+J49*E$7","v":0}]
[null,null,"Irrigation Equipment",1,null,"Acre",0,null,0,0,0,null,0,0,0,0,0,0]
[null,null,"Tractors/Self-Propelled",1,null,"Acre",14.146206941399033,null,14.146206941399033,0,0,null,0,0,14.146206941399033,0,7073.103470699516,0]
[null,null,"Implements",1,null,"Acre",5.5135569288516493,null,5.5135569288516493,0,0,null,0,0,5.5135569288516493,0,2756.7784644258245,0]
[null,null,null,null,null,null,null,null,0,0,0,null,0,0,0,0,0,0]
[null,null,null,null,null,null,null,null,0,0,0,null,0,0,0,0,0,0]
[null,"Interest on Credit Line",null,null,null,null,0.08,null,7.664653461079272,{"$f":"+SUM(J17:J54)/2*H55","v":0},null,null,0,{"$f":"+SUM(N17:N54)/2*L55","v":0},7.664653461079272,{"$f":"+SUM(P17:P54)/2*L55","v":0},3832.3267305396362,{"$f":"+J55*E$7","v":0}]
["Total Variable Costs",null,null,null,null,null,null,null,181.91949733133001,{"$f":"SUM(J18:J55)","v":0},null,null,0,{"$f":"SUM(N18:N55)","v":0},181.91949733133001,{"$f":"SUM(P18:P55)","v":0},90959.748665664971,{"$f":"SUM(R18:R55)","v":0}]
["Planned Returns Above Variable Costs:",null,null,null,null,null,null,null,106.83050266866999,{"$f":"+J13-J56","v":0},null,null,0,{"$f":"+N13-N56","v":0},106.83050266866999,{"$f":"+P13-P56","v":0},53415.251334335029,{"$f":"+R13-R56","v":0}]
[null,"Breakeven Price to Cover Variable Costs",null,null,null,null,5.1976999237522863,{"$f":"IF(E10=0,\"n/a\",(YVarExp-(YTotExp+YTotRet-J10))/E10)","v":"n/a"},"Bushel"]
[null,null,null,null,null,null,null,null,null,null,null,null,null,null,null,null,"Enterprise","Enterprise"]
["FIXED COSTS",null,null,"Quantity","Quantity","Units","$/Unit","$/Unit","Total","Total","Share","Share","Landlord","Landlord","Tenant","Tenant","Total","Total"]
[null,"Machinery Depreciation",null,null,null,null,null,null,"$21.24"]
[null,null,"Tractors/Self-Propelled",1,null,"Acre",14.536767310188846,null,14.536767310188846,{"$f":"E62*H62","v":0},0,null,0,{"$f":"J62*L62","v":0},14.536767310188846,{"$f":"+J62-N62","v":0},7268.3836550944234,{"$f":"+J62*E$7","v":0}]
[null,null,"Implements",1,null,"Acre",6.707258313440053,null,6.707258313440053,0,0,null,0,{"$f":"J63*L63","v":0},6.707258313440053,0,3353.6291567200265,0]
[null,"Equipment Investment",null,null,null,null,null,null,"$13.03"]
[null,null,"Tractors/Self-Propelled",110.81812112925081,null,"Dollars",0.08,null,8.8654496903400659,{"$f":"E65*H65","v":0},0,null,0,{"$f":"J65*L65","v":0},8.8654496903400659,{"$f":"+J65-N65","v":0},4432.7248451700334,{"$f":"+J65*E$7","v":0}]
[null,null,"Implements",52.088974636540151,null,"Dollars",0.08,null,4.1671179709232122,0,0,null,0,{"$f":"J66*L66","v":0},4.1671179709232122,0,2083.558985461606,0]
[null,"Salaried Labor",null,1,null,"Acre",0,null,0,0,0,null,0,{"$f":"J67*L67","v":0},0,{"$f":"+J67-N67","v":0},0,{"$f":"+J67*E$7","v":0}]
[null,"Management Fee, Owner/Operator Labor",null,1,null,"Acre",14.4375,null,14.4375,0,0,null,0,0,14.4375,0,7218.75,0]
[null,"Allocated Establishment Cost",null,1,null,"Acre",0,null,0,0,0,null,0,0,0,0,0,0]
[null,"LCB - Land Charge",null,1,null,"Acre",70,null,70,0,0,null,0,0,70,0,35000,0]
[null,"Property Taxes",null,1,null,"Acre",0,null,0,0,0,null,0,0,0,0,0,0]
[null,"Whole Farm Insurance",null,1,null,"Acre",0,null,0,0,0,null,0,0,0,0,0,0]
[null,null,null,1,null,null,0,null,0,0,0,null,0,0,0,0,0,0]
[null,null,null,1,null,null,0,null,0,{"$f":"E74*H74","v":0},0,null,0,0,0,0,0,0]
["Total Fixed Costs",null,null,null,null,null,null,null,118.71409328489219,{"$f":"+SUM(J62:J74)","v":0},null,null,0,{"$f":"+SUM(N62:N74)","v":0},118.71409328489219,{"$f":"+SUM(P62:P74)","v":0},59357.04664244609,{"$f":"+SUM(R62:R74)","v":0}]
["Total Specified Costs",null,null,null,null,null,null,null,300.63359061622219,{"$f":"+J56+J75","v":0},null,null,0,{"$f":"+N56+N75","v":0},300.63359061622219,{"$f":"+P56+P75","v":0},150316.79530811106,{"$f":"+R56+R75","v":0}]
[]
["Returns Above Specified Costs",null,null,null,null,null,null,null,-11.883590616222193,{"$f":"+J13-J76","v":0},null,null,0,{"$f":"+N13-N76","v":0},-11.883590616222193,{"$f":"+P13-P76","v":0},-5941.7953081110609,{"$f":"+R13-R76","v":0}]
[]
["    Breakeven Price to Cover Total Costs",null,null,null,null,null,8.5895311604634905,{"$f":"IF(E10=0,\"n/a\",(YTotExp-(YTotExp+YTotRet-J10))/E10)","v":"n/a"},"Bushel"]
[]
[null,null,null,"Example Breakeven Prices"]
[null,"Example","Example","To Cover",null,null,"To Cover"]
[null,"Yield","Yield","Variable",null,null,"Total"]
[null,"Percent","Bushel","Costs",null,null,"Costs"]
[null,0.75,26.25,6.9302665650030475,null,null,11.452708213951322]
[null,0.9,31.5,5.7752221375025403,null,null,9.543923511626101]
[null,1,35,5.1976999237522863,null,null,8.5895311604634905]
[null,1.1000000000000001,38.5,4.7251817488657144,null,null,7.8086646913304465]
[null,1.25,43.75,4.1581599390018287,null,null,6.8716249283707933]
[]
["  Developed by Extension Economists, Texas A&M AgriLife Extension Service, budgets@tamu.edu.  "]
[]
["Information presented is prepared solely as a general guide and not intended to recognize or predict the costs and returns from any one operation.  Brand names are mentioned only as examples and imply no endorsement."]

{"sheet":"CanolaLCB","index":5,"n_rows":94,"n_cols":18,"rows_kept":94,"cut":false,"hidden":false,"merged":[[81,3,81,8],[93,0,93,11],[0,0,0,11],[1,0,1,11],[2,0,2,11],[3,0,3,11]]}
["Projections for Planning Purposes Only -- Not to be Used without Updating"]
["2023 Estimated Costs and Returns per Acre"]
["Canola, Dryland, 1500 lb. Yield Goal - Lower Coast"]
["Enter your name for this budget in the cell above."]
["Enter  Your Values in the cells highlighed in MAROON."]
[null,null,null,null,"Your Acres",null,null,null,null,null,null,null,null,null,null,null,null,"Your"]
[null,null,"Crop Acres",500,null,null,null,null,null,null,null,"Your",null,null,null,null,"Enterprise","Enterprise"]
[null,null,null,null,"Your",null,null,"Your","Cash","Your","Landlord","Landlord",null,"Your",null,"Your","Total","Total"]
["REVENUE",null,null,"Quantity","Quantity","Units","$/Unit","$/Unit","Total","Total","Share","Share","Landlord","Landlord","Tenant","Tenant","(500 acres)",{"$f":"\"(\" & E7 & \" acres)\"","v":"( acres)"}]
[null,"Canola",null,1500,null,"Pound",0.18,null,270,{"$f":"E10*H10","v":0},0,null,0,{"$f":"J10*L10","v":0},270,{"$f":"+J10-N10","v":0},135000,{"$f":"+J10*E$7","v":0}]
[null,null,null,0,null,null,0,null,0,0,0,null,0,0,0,{"$f":"+J11-N11","v":0},0,0]
[null,null,null,0,null,null,0,null,0,0,0,null,0,0,0,0,0,0]
["Total Revenue",null,null,null,null,null,null,null,270,{"$f":"SUM(J10:J12)","v":0},null,null,0,{"$f":"SUM(N10:N12)","v":0},270,{"$f":"SUM(P10:P12)","v":0},135000,{"$f":"SUM(R10:R12)","v":0}]
[null,null,null,null,null,null,null,null,null,null,null,null,null,null,null,null,"Enterprise","Enterprise"]
["VARIABLE COSTS",null,null,"Quantity","Quantity","Units","$/Unit","$/Unit","Total","Total","Share","Share","Landlord","Landlord","Tenant","Tenant","Total","Total"]
["Production Costs"]
[null,"Custom",null,null,null,null,null,null,"$25.44"]
[null,"","Fertilizer Application LC",1,null,"Acre",9.5400000000000009,null,9.5400000000000009,{"$f":"E18*H18","v":0},0,null,0,{"$f":"J18*L18","v":0},9.5400000000000009,{"$f":"+J18-N18","v":0},4770.0000000000009,{"$f":"+J18*E$7","v":0}]
[null,"","Custom Haul - Canola",15,null,"CWT",1.06,null,15.9,0,0,null,0,0,15.9,0,7950,0]
[null,"Fertilizer",null,null,null,null,null,null,"$73.14"]
[null,"","32-11-3 6S",0.12,null,"Ton",609.5,null,73.14,0,0,null,0,0,73.14,0,36570,0]
[null,"Herbicide",null,null,null,null,null,null,"$15.5"]
[null,"","Glyphosate (Generic)",2,null,"Quart",7.75,null,15.5,0,0,null,0,0,15.5,0,7750,0]
[null,"Insecticide",null,null,null,null,null,null,"$23.15"]
[null,"","Aphid Control",10,null,"Ounce",2.3149999999999999,null,23.15,0,0,null,0,0,23.15,0,11575,0]
[null,"Miscellaneous",null,null,null,null,null,null,"$21.5"]
[null,"","Pickup Milage Charge",1,null,"Acre",4.1128,null,4.1128,0,0,null,0,0,4.1128,0,2056.4,0]
[null,"","Crop Insurance -Canola",1,null,"Acre",17.384,null,17.384,0,0,null,0,0,17.384,0,8692,0]
[null,"Seed",null,null,null,null,null,null,"$24.59"]
[null,"","Roundup Ready Canola Seed",4,null,"Pound",6.1479999999999997,null,24.591999999999999,0,0,null,0,0,24.591999999999999,0,12296,0]
[null,"Other Labor",null,null,null,null,null,null,"$0.31"]
[null,"","Hand Labor",1.7999999999999999E-2,null,"Hour",16.96,null,0.30528,0,0,null,0,0,0.30528,0,152.63999999999999,0]
[null,null,null,0,null,null,0,null,0,0,0,null,0,0,0,0,0,0]
[null,null,null,0,null,null,0,null,0,0,0,null,0,0,0,0,0,0]
[null,null,null,0,null,null,0,null,0,{"$f":"E35*H35","v":0},0,null,0,{"$f":"J35*L35","v":0},0,{"$f":"+J35-N35","v":0},0,{"$f":"+J35*E$7","v":0}]
[null,"Machinery Labor",null,null,null,null,null,null,"$5.34"]
[null,null,"Tractors/Self-Propelled",0.31,null,"Hour",17.21,null,5.3351000000000006,{"$f":"E37*H37","v":0},0,null,0,{"$f":"J37*L37","v":0},5.3351000000000006,{"$f":"+J37-N37","v":0},2667.55,{"$f":"+J37*E$7","v":0}]
[null,null,"Other Labor",0,null,"Hour",17.21,null,0,{"$f":"E38*H38","v":0},0,null,0,{"$f":"J38*L38","v":0},0,{"$f":"+J38-N38","v":0},0,{"$f":"+J38*E$7","v":0}]
[]
[null,"Diesel Fuel",null,null,null,null,null,null,"$7.77"]
[null,null,"Pickup/General Use Equipment",1,null,"Acre",0,null,0,{"$f":"E41*H41","v":0},0,null,0,{"$f":"J41*L41","v":0},0,{"$f":"+J41-N41","v":0},0,{"$f":"+J41*E$7","v":0}]
[null,null,"Tractors/Self-Propelled",3.47,null,"Gallon",2.2400000000000002,null,7.772800000000001,{"$f":"E42*H42","v":0},0,null,0,{"$f":"J42*L42","v":0},7.772800000000001,{"$f":"+J42-N42","v":0},3886.4000000000005,{"$f":"+J42*E$7","v":0}]
[]
[null,"Gasoline",null,null,null,null,null,null,"$0"]
[null,null,"Pickup/General Use Equipment",1,null,"Acre",0,null,0,{"$f":"E45*H45","v":0},0,null,0,{"$f":"J45*L45","v":0},0,{"$f":"+J45-N45","v":0},0,{"$f":"+J45*E$7","v":0}]
[null,null,"Tractors/Self-Propelled",0,null,"Gallon",2.09,null,0,{"$f":"E46*H46","v":0},0,null,0,{"$f":"J46*L46","v":0},0,{"$f":"+J46-N46","v":0},0,{"$f":"+J46*E$7","v":0}]
[]
[null,"Repairs & Maintenance",null,null,null,null,null,null,"$19.79"]
[null,null,"Pickup/General Use Equipment",1,null,"Acre",0,null,0,{"$f":"E49*H49","v":0},0,null,0,{"$f":"J49*L49","v":0},0,{"$f":"+J49-N49","v":0},0,{"$f":"+J49*E$7","v":0}]
[null,null,"Irrigation Equipment",1,null,"Acre",0,null,0,0,0,null,0,0,0,0,0,0]
[null,null,"Tractors/Self-Propelled",1,null,"Acre",14.272779589481681,null,14.272779589481681,0,0,null,0,0,14.272779589481681,0,7136.3897947408404,0]
[null,null,"Implements",1,null,"Acre",5.5135569288516493,null,5.5135569288516493,0,0,null,0,0,5.5135569288516493,0,2756.7784644258245,0]
[null,null,null,null,null,null,null,null,0,0,0,null,0,0,0,0,0,0]
[null,null,null,null,null,null,null,null,0,0,0,null,0,0,0,0,0,0]
[null,"Interest on Credit Line",null,null,null,null,0.08,null,9.5454366785993727,{"$f":"+SUM(J17:J54)/2*H55","v":0},null,null,0,{"$f":"+SUM(N17:N54)/2*L55","v":0},9.5454366785993727,{"$f":"+SUM(P17:P54)/2*L55","v":0},4772.7183392996867,{"$f":"+J55*E$7","v":0}]
["Total Variable Costs",null,null,null,null,null,null,null,226.06375319693265,{"$f":"SUM(J18:J55)","v":0},null,null,0,{"$f":"SUM(N18:N55)","v":0},226.06375319693265,{"$f":"SUM(P18:P55)","v":0},113031.87659846633,{"$f":"SUM(R18:R55)","v":0}]
["Planned Returns Above Variable Costs:",null,null,null,null,null,null,null,43.936246803067348,{"$f":"+J13-J56","v":0},null,null,0,{"$f":"+N13-N56","v":0},43.936246803067348,{"$f":"+P13-P56","v":0},21968.123401533667,{"$f":"+R13-R56","v":0}]
[null,"Breakeven Price to Cover Variable Costs",null,null,null,null,0.1507091687979551,{"$f":"IF(E10=0,\"n/a\",(YVarExp-(YTotExp+YTotRet-J10))/E10)","v":"n/a"},"Pound"]
[null,null,null,null,null,null,null,null,null,null,null,null,null,null,null,null,"Enterprise","Enterprise"]
["FIXED COSTS",null,null,"Quantity","Quantity","Units","$/Unit","$/Unit","Total","Total","Share","Share","Landlord","Landlord","Tenant","Tenant","Total","Total"]
[null,"Machinery Depreciation",null,null,null,null,null,null,"$21.83"]
[null,null,"Tractors/Self-Propelled",1,null,"Acre",15.127439667907877,null,15.127439667907877,{"$f":"E62*H62","v":0},0,null,0,{"$f":"J62*L62","v":0},15.127439667907877,{"$f":"+J62-N62","v":0},7563.7198339539391,{"$f":"+J62*E$7","v":0}]
[null,null,"Implements",1,null,"Acre",6.707258313440053,null,6.707258313440053,0,0,null,0,{"$f":"J63*L63","v":0},6.707258313440053,0,3353.6291567200265,0]
[null,"Equipment Investment",null,null,null,null,null,null,"$13.38"]
[null,null,"Tractors/Self-Propelled",115.20597292944933,null,"Dollars",0.08,null,9.2164778343559473,{"$f":"E65*H65","v":0},0,null,0,{"$f":"J65*L65","v":0},9.2164778343559473,{"$f":"+J65-N65","v":0},4608.2389171779732,{"$f":"+J65*E$7","v":0}]
[null,null,"Implements",52.088974636540151,null,"Dollars",0.08,null,4.1671179709232122,0,0,null,0,{"$f":"J66*L66","v":0},4.1671179709232122,0,2083.558985461606,0]
[null,"Salaried Labor",null,1,null,"Acre",0,null,0,0,0,null,0,{"$f":"J67*L67","v":0},0,{"$f":"+J67-N67","v":0},0,{"$f":"+J67*E$7","v":0}]
[null,"Management Fee, Owner/Operator Labor",null,1,null,"Acre",13.5,null,13.5,0,0,null,0,0,13.5,0,6750,0]
[null,"Allocated Establishment Cost",null,1,null,"Acre",0,null,0,0,0,null,0,0,0,0,0,0]
[null,"LCB - Land Charge",null,1,null,"Acre",70,null,70,0,0,null,0,0,70,0,35000,0]
[null,"Property Taxes",null,1,null,"Acre",0,null,0,0,0,null,0,0,0,0,0,0]
[null,"Whole Farm Insurance",null,1,null,"Acre",0,null,0,0,0,null,0,0,0,0,0,0]
[null,null,null,1,null,null,0,null,0,0,0,null,0,0,0,0,0,0]
[null,null,null,1,null,null,0,null,0,{"$f":"E74*H74","v":0},0,null,0,0,0,0,0,0]
["Total Fixed Costs",null,null,null,null,null,null,null,118.7182937866271,{"$f":"+SUM(J62:J74)","v":0},null,null,0,{"$f":"+SUM(N62:N74)","v":0},118.7182937866271,{"$f":"+SUM(P62:P74)","v":0},59359.146893313547,{"$f":"+SUM(R62:R74)","v":0}]
["Total Specified Costs",null,null,null,null,null,null,null,344.78204698355978,{"$f":"+J56+J75","v":0},null,null,0,{"$f":"+N56+N75","v":0},344.78204698355978,{"$f":"+P56+P75","v":0},172391.02349177987,{"$f":"+R56+R75","v":0}]
[]
["Returns Above Specified Costs",null,null,null,null,null,null,null,-74.782046983559781,{"$f":"+J13-J76","v":0},null,null,0,{"$f":"+N13-N76","v":0},-74.782046983559781,{"$f":"+P13-P76","v":0},-37391.023491779866,{"$f":"+R13-R76","v":0}]
[]
["    Breakeven Price to Cover Total Costs",null,null,null,null,null,0.22985469798903985,{"$f":"IF(E10=0,\"n/a\",(YTotExp-(YTotExp+YTotRet-J10))/E10)","v":"n/a"},"Pound"]
[]
[null,null,null,"Example Breakeven Prices"]
[null,"Example","Example","To Cover",null,null,"To Cover"]
[null,"Yield","Yield","Variable",null,null,"Total"]
[null,"Percent","Pound","Costs",null,null,"Costs"]
[null,0.75,1125,0.20094555839727346,null,null,0.30647293065205317]
[null,0.9,1350,0.16745463199772789,null,null,0.25539410887671093]
[null,1,1500,0.1507091687979551,null,null,0.22985469798903985]
[null,1.1000000000000001,1650.0000000000002,0.13700833527086825,null,null,0.20895881635367256]
[null,1.25,1875,0.12056733503836409,null,null,0.18388375839123189]
[]
["  Developed by Extension Economists, Texas A&M AgriLife Extension Service, budgets@tamu.edu.  "]
[]
["Information presented is prepared solely as a general guide and not intended to recognize or predict the costs and returns from any one operation.  Brand names are mentioned only as examples and imply no endorsement."]

{"sheet":"WheatNW","index":6,"n_rows":94,"n_cols":18,"rows_kept":94,"cut":false,"hidden":false,"merged":[[81,3,81,8],[93,0,93,11],[0,0,0,11],[1,0,1,11],[2,0,2,11],[3,0,3,11]]}
["Projections for Planning Purposes Only -- Not to be Used without Updating"]
["2023 Estimated Costs and Returns per Acre"]
["Hard Red Spring Wheat, Dryland, 35 bu. Yield Goal, Northwest - Lower Coast"]
["Enter your name for this budget in the cell above."]
["Enter  Your Values in the cells highlighed in MAROON."]
[null,null,null,null,"Your Acres",null,null,null,null,null,null,null,null,null,null,null,null,"Your"]
[null,null,"Crop Acres",500,null,null,null,null,null,null,null,"Your",null,null,null,null,"Enterprise","Enterprise"]
[null,null,null,null,"Your",null,null,"Your","Cash","Your","Landlord","Landlord",null,"Your",null,"Your","Total","Total"]
["REVENUE",null,null,"Quantity","Quantity","Units","$/Unit","$/Unit","Total","Total","Share","Share","Landlord","Landlord","Tenant","Tenant","(500 acres)",{"$f":"\"(\" & E7 & \" acres)\"","v":"( acres)"}]
[null,"Hard Red Spring Wheat",null,35,null,"Bushel",8.25,null,288.75,{"$f":"E10*H10","v":0},0,null,0,{"$f":"J10*L10","v":0},288.75,{"$f":"+J10-N10","v":0},144375,{"$f":"+J10*E$7","v":0}]
[null,null,null,0,null,null,0,null,0,0,0,null,0,0,0,{"$f":"+J11-N11","v":0},0,0]
[null,null,null,0,null,null,0,null,0,0,0,null,0,0,0,0,0,0]
["Total Revenue",null,null,null,null,null,null,null,288.75,{"$f":"SUM(J10:J12)","v":0},null,null,0,{"$f":"SUM(N10:N12)","v":0},288.75,{"$f":"SUM(P10:P12)","v":0},144375,{"$f":"SUM(R10:R12)","v":0}]
[null,null,null,null,null,null,null,null,null,null,null,null,null,null,null,null,"Enterprise","Enterprise"]
["VARIABLE COSTS",null,null,"Quantity","Quantity","Units","$/Unit","$/Unit","Total","Total","Share","Share","Landlord","Landlord","Tenant","Tenant","Total","Total"]
["Production Costs"]
[null,"Custom",null,null,null,null,null,null,"$9.43"]
[null,"","Fertilizer Application",1,null,"Ounce",0.159,null,0.159,{"$f":"E18*H18","v":0},0,null,0,{"$f":"J18*L18","v":0},0.159,{"$f":"+J18-N18","v":0},79.5,{"$f":"+J18*E$7","v":0}]
[null,"","Custom Haul - Wheat",35,null,"Bushel",0.26500000000000001,null,9.2750000000000004,0,0,null,0,0,9.2750000000000004,0,4637.5,0]
[null,"Fertilizer",null,null,null,null,null,null,"$57.6"]
[null,"","24-8-0",0.1,null,"Ton",576,null,57.6,0,0,null,0,0,57.6,0,28800,0]
[null,"Herbicide",null,null,null,null,null,null,"$7.75"]
[null,"","Glyphosate (Generic)",1,null,"Quart",7.75,null,7.75,0,0,null,0,0,7.75,0,3875,0]
[null,"Insecticide",null,null,null,null,null,null,"$11.88"]
[null,"","Wheat Insect Control",1.5,null,"Pint",7.9182000000000006,null,11.877300000000002,0,0,null,0,0,11.877300000000002,0,5938.6500000000005,0]
[null,"Miscellaneous",null,null,null,null,null,null,"$8.11"]
[null,"","Pickup Milage Charge",1,null,"Acre",4.1128,null,4.1128,0,0,null,0,0,4.1128,0,2056.4,0]
[null,"","Crop Insurance -Wheat LC",1,null,"Acre",4,null,4,0,0,null,0,0,4,0,2000,0]
[null,"Seed",null,null,null,null,null,null,"$51.68"]
[null,"","HRS Wheat Seed",125,null,"Pound",0.41340000000000005,null,51.675000000000004,0,0,null,0,0,51.675000000000004,0,25837.500000000004,0]
[null,"Other Labor",null,null,null,null,null,null,"$0.31"]
[null,"","Hand Labor",1.7999999999999999E-2,null,"Hour",16.96,null,0.30528,0,0,null,0,0,0.30528,0,152.63999999999999,0]
[null,null,null,0,null,null,0,null,0,0,0,null,0,0,0,0,0,0]
[null,null,null,0,null,null,0,null,0,0,0,null,0,0,0,0,0,0]
[null,null,null,0,null,null,0,null,0,{"$f":"E35*H35","v":0},0,null,0,{"$f":"J35*L35","v":0},0,{"$f":"+J35-N35","v":0},0,{"$f":"+J35*E$7","v":0}]
[null,"Machinery Labor",null,null,null,null,null,null,"$5.34"]
[null,null,"Tractors/Self-Propelled",0.31,null,"Hour",17.21,null,5.3351000000000006,{"$f":"E37*H37","v":0},0,null,0,{"$f":"J37*L37","v":0},5.3351000000000006,{"$f":"+J37-N37","v":0},2667.55,{"$f":"+J37*E$7","v":0}]
[null,null,"Other Labor",0,null,"Hour",17.21,null,0,{"$f":"E38*H38","v":0},0,null,0,{"$f":"J38*L38","v":0},0,{"$f":"+J38-N38","v":0},0,{"$f":"+J38*E$7","v":0}]
[]
[null,"Diesel Fuel",null,null,null,null,null,null,"$7.59"]
[null,null,"Pickup/General Use Equipment",1,null,"Acre",0,null,0,{"$f":"E41*H41","v":0},0,null,0,{"$f":"J41*L41","v":0},0,{"$f":"+J41-N41","v":0},0,{"$f":"+J41*E$7","v":0}]
[null,null,"Tractors/Self-Propelled",3.39,null,"Gallon",2.2400000000000002,null,7.5936000000000012,{"$f":"E42*H42","v":0},0,null,0,{"$f":"J42*L42","v":0},7.5936000000000012,{"$f":"+J42-N42","v":0},3796.8000000000006,{"$f":"+J42*E$7","v":0}]
[]
[null,"Gasoline",null,null,null,null,null,null,"$0"]
[null,null,"Pickup/General Use Equipment",1,null,"Acre",0,null,0,{"$f":"E45*H45","v":0},0,null,0,{"$f":"J45*L45","v":0},0,{"$f":"+J45-N45","v":0},0,{"$f":"+J45*E$7","v":0}]
[null,null,"Tractors/Self-Propelled",0,null,"Gallon",2.09,null,0,{"$f":"E46*H46","v":0},0,null,0,{"$f":"J46*L46","v":0},0,{"$f":"+J46-N46","v":0},0,{"$f":"+J46*E$7","v":0}]
[]
[null,"Repairs & Maintenance",null,null,null,null,null,null,"$19.66"]
[null,null,"Pickup/General Use Equipment",1,null,"Acre",0,null,0,{"$f":"E49*H49","v":0},0,null,0,{"$f":"J49*L49","v":0},0,{"$f":"+J49-N49","v":0},0,{"$f":"+J49*E$7","v":0}]
[null,null,"Irrigation Equipment",1,null,"Acre",0,null,0,0,0,null,0,0,0,0,0,0]
[null,null,"Tractors/Self-Propelled",1,null,"Acre",14.146206941399033,null,14.146206941399033,0,0,null,0,0,14.146206941399033,0,7073.103470699516,0]
[null,null,"Implements",1,null,"Acre",5.5135569288516493,null,5.5135569288516493,0,0,null,0,0,5.5135569288516493,0,2756.7784644258245,0]
[null,null,null,null,null,null,null,null,0,0,0,null,0,0,0,0,0,0]
[null,null,null,null,null,null,null,null,0,0,0,null,0,0,0,0,0,0]
[null,"Interest on Credit Line",null,null,null,null,0.08,null,7.6696887480834253,{"$f":"+SUM(J17:J54)/2*H55","v":0},null,null,0,{"$f":"+SUM(N17:N54)/2*L55","v":0},7.6696887480834253,{"$f":"+SUM(P17:P54)/2*L55","v":0},3834.8443740417129,{"$f":"+J55*E$7","v":0}]
["Total Variable Costs",null,null,null,null,null,null,null,187.01253261833415,{"$f":"SUM(J18:J55)","v":0},null,null,0,{"$f":"SUM(N18:N55)","v":0},187.01253261833415,{"$f":"SUM(P18:P55)","v":0},93506.266309167055,{"$f":"SUM(R18:R55)","v":0}]
["Planned Returns Above Variable Costs:",null,null,null,null,null,null,null,101.73746738166585,{"$f":"+J13-J56","v":0},null,null,0,{"$f":"+N13-N56","v":0},101.73746738166585,{"$f":"+P13-P56","v":0},50868.733690832945,{"$f":"+R13-R56","v":0}]
[null,"Breakeven Price to Cover Variable Costs",null,null,null,null,5.3432152176666898,{"$f":"IF(E10=0,\"n/a\",(YVarExp-(YTotExp+YTotRet-J10))/E10)","v":"n/a"},"Bushel"]
[null,null,null,null,null,null,null,null,null,null,null,null,null,null,null,null,"Enterprise","Enterprise"]
["FIXED COSTS",null,null,"Quantity","Quantity","Units","$/Unit","$/Unit","Total","Total","Share","Share","Landlord","Landlord","Tenant","Tenant","Total","Total"]
[null,"Machinery Depreciation",null,null,null,null,null,null,"$21.24"]
[null,null,"Tractors/Self-Propelled",1,null,"Acre",14.536767310188846,null,14.536767310188846,{"$f":"E62*H62","v":0},0,null,0,{"$f":"J62*L62","v":0},14.536767310188846,{"$f":"+J62-N62","v":0},7268.3836550944234,{"$f":"+J62*E$7","v":0}]
[null,null,"Implements",1,null,"Acre",6.707258313440053,null,6.707258313440053,0,0,null,0,{"$f":"J63*L63","v":0},6.707258313440053,0,3353.6291567200265,0]
[null,"Equipment Investment",null,null,null,null,null,null,"$13.03"]
[null,null,"Tractors/Self-Propelled",110.81812112925081,null,"Dollars",0.08,null,8.8654496903400659,{"$f":"E65*H65","v":0},0,null,0,{"$f":"J65*L65","v":0},8.8654496903400659,{"$f":"+J65-N65","v":0},4432.7248451700334,{"$f":"+J65*E$7","v":0}]
[null,null,"Implements",52.088974636540151,null,"Dollars",0.08,null,4.1671179709232122,0,0,null,0,{"$f":"J66*L66","v":0},4.1671179709232122,0,2083.558985461606,0]
[null,"Salaried Labor",null,1,null,"Acre",0,null,0,0,0,null,0,{"$f":"J67*L67","v":0},0,{"$f":"+J67-N67","v":0},0,{"$f":"+J67*E$7","v":0}]
[null,"Management Fee, Owner/Operator Labor",null,1,null,"Acre",14.4375,null,14.4375,0,0,null,0,0,14.4375,0,7218.75,0]
[null,"Allocated Establishment Cost",null,1,null,"Acre",0,null,0,0,0,null,0,0,0,0,0,0]
[null,"LCB - Land Charge",null,1,null,"Acre",70,null,70,0,0,null,0,0,70,0,35000,0]
[null,"Property Taxes",null,1,null,"Acre",0,null,0,0,0,null,0,0,0,0,0,0]
[null,"Whole Farm Insurance",null,1,null,"Acre",0,null,0,0,0,null,0,0,0,0,0,0]
[null,null,null,1,null,null,0,null,0,0,0,null,0,0,0,0,0,0]
[null,null,null,1,null,null,0,null,0,{"$f":"E74*H74","v":0},0,null,0,0,0,0,0,0]
["Total Fixed Costs",null,null,null,null,null,null,null,118.71409328489219,{"$f":"+SUM(J62:J74)","v":0},null,null,0,{"$f":"+SUM(N62:N74)","v":0},118.71409328489219,{"$f":"+SUM(P62:P74)","v":0},59357.04664244609,{"$f":"+SUM(R62:R74)","v":0}]
["Total Specified Costs",null,null,null,null,null,null,null,305.72662590322636,{"$f":"+J56+J75","v":0},null,null,0,{"$f":"+N56+N75","v":0},305.72662590322636,{"$f":"+P56+P75","v":0},152863.31295161316,{"$f":"+R56+R75","v":0}]
[]
["Returns Above Specified Costs",null,null,null,null,null,null,null,-16.976625903226363,{"$f":"+J13-J76","v":0},null,null,0,{"$f":"+N13-N76","v":0},-16.976625903226363,{"$f":"+P13-P76","v":0},-8488.3129516131594,{"$f":"+R13-R76","v":0}]
[]
["    Breakeven Price to Cover Total Costs",null,null,null,null,null,8.7350464543778958,{"$f":"IF(E10=0,\"n/a\",(YTotExp-(YTotExp+YTotRet-J10))/E10)","v":"n/a"},"Bushel"]
[]
[null,null,null,"Example Breakeven Prices"]
[null,"Example","Example","To Cover",null,null,"To Cover"]
[null,"Yield","Yield","Variable",null,null,"Total"]
[null,"Percent","Bushel","Costs",null,null,"Costs"]
[null,0.75,26.25,7.1242869568889198,null,null,11.646728605837195]
[null,0.9,31.5,5.9369057974074328,null,null,9.7056071715309962]
[null,1,35,5.3432152176666898,null,null,8.7350464543778958]
[null,1.1000000000000001,38.5,4.8574683796969911,null,null,7.9409513221617241]
[null,1.25,43.75,4.2745721741333522,null,null,6.9880371635023169]
[]
["  Developed by Extension Economists, Texas A&M AgriLife Extension Service, budgets@tamu.edu.  "]
[]
["Information presented is prepared solely as a general guide and not intended to recognize or predict the costs and returns from any one operation.  Brand names are mentioned only as examples and imply no endorsement."]

{"sheet":"Cotton","index":7,"n_rows":106,"n_cols":18,"rows_kept":106,"cut":false,"hidden":false,"merged":[[93,3,93,8],[105,0,105,11],[0,0,0,11],[1,0,1,11],[2,0,2,11],[3,0,3,11]]}
["Projections for Planning Purposes Only -- Not to be Used without Updating"]
["2023 Estimated Costs and Returns per Acre"]
["Cotton - Genetically Modified Seed, Conv. Till-24 Row, Dryland, 800 lb. Yield Goal - Lower Coast"]
["Enter your name for this budget in the cell above."]
["Enter  Your Values in the cells highlighed in MAROON."]
[null,null,null,null,"Your Acres",null,null,null,null,null,null,null,null,null,null,null,null,"Your"]
[null,null,"Crop Acres",500,null,null,null,null,null,null,null,"Your",null,null,null,null,"Enterprise","Enterprise"]
[null,null,null,null,"Your",null,null,"Your","Cash","Your","Landlord","Landlord",null,"Your",null,"Your","Total","Total"]
["REVENUE",null,null,"Quantity","Quantity","Units","$/Unit","$/Unit","Total","Total","Share","Share","Landlord","Landlord","Tenant","Tenant","(500 acres)",{"$f":"\"(\" & E7 & \" acres)\"","v":"( acres)"}]
[null,"Cotton Lint",null,800,null,"Pound",0.9,null,720,{"$f":"E10*H10","v":0},0,null,0,{"$f":"J10*L10","v":0},720,{"$f":"+J10-N10","v":0},360000,{"$f":"+J10*E$7","v":0}]
[null,"Cottonseed",null,0.57999999999999996,null,"Ton",360,null,208.79999999999998,0,0,null,0,0,208.79999999999998,{"$f":"+J11-N11","v":0},104399.99999999999,0]
[null,null,null,0,null,null,0,null,0,0,0,null,0,0,0,0,0,0]
[null,null,null,0,null,null,0,null,0,0,0,null,0,0,0,0,0,0]
["Total Revenue",null,null,null,null,null,null,null,928.8,{"$f":"SUM(J10:J13)","v":0},null,null,0,{"$f":"SUM(N10:N13)","v":0},928.8,{"$f":"SUM(P10:P13)","v":0},464400,{"$f":"SUM(R10:R13)","v":0}]
[null,null,null,null,null,null,null,null,null,null,null,null,null,null,null,null,"Enterprise","Enterprise"]
["VARIABLE COSTS",null,null,"Quantity","Quantity","Units","$/Unit","$/Unit","Total","Total","Share","Share","Landlord","Landlord","Tenant","Tenant","Total","Total"]
["Production Costs"]
[null,"Custom",null,null,null,null,null,null,"$216.4"]
[null,"","Fertilizer Application",1,null,"Ounce",0.159,null,0.159,{"$f":"E19*H19","v":0},0,null,0,{"$f":"J19*L19","v":0},0.159,{"$f":"+J19-N19","v":0},79.5,{"$f":"+J19*E$7","v":0}]
[null,"","Pick and Module",800,null,"Pound",0.13780000000000001,null,110.24000000000001,0,0,null,0,0,110.24000000000001,0,55120.000000000007,0]
[null,"","Ginning - Picker",800,null,"Pound",0.13250000000000001,null,106,0,0,null,0,0,106,0,53000,0]
[null,"Fertilizer",null,null,null,null,null,null,"$95.9"]
[null,"","24-8-0",0.16650000000000001,null,"Ton",576,null,95.904000000000011,0,0,null,0,0,95.904000000000011,0,47952.000000000007,0]
[null,"Herbicide",null,null,null,null,null,null,"$60.87"]
[null,"","Glyphosate",1,null,"Quart",12.25,null,12.25,0,0,null,0,0,12.25,0,6125,0]
[null,"","Trifluralin",32,null,"Ounce",0.20140000000000002,null,6.4448000000000008,0,0,null,0,0,6.4448000000000008,0,3222.4000000000005,0]
[null,"","Cotton Early Season Herbicide",2,null,"Quart",17.214399999999998,null,34.428799999999995,0,0,null,0,0,34.428799999999995,0,17214.399999999998,0]
[null,"","2, 4D Amine",2,null,"Pint",3.875,null,7.75,0,0,null,0,0,7.75,0,3875,0]
[null,"Insecticide",null,null,null,null,null,null,"$2.24"]
[null,"","Fleahopper Control LC",1.6,null,"Ounce",1.4,null,2.2399999999999998,0,0,null,0,0,2.2399999999999998,0,1119.9999999999998,0]
[null,"Miscellaneous",null,null,null,null,null,null,"$24.05"]
[null,"","Crop Insurance -Cotton LC",1,null,"Acre",14,null,14,0,0,null,0,0,14,0,7000,0]
[null,"","Pickup Milage Charge",1,null,"Acre",4.1128,null,4.1128,0,0,null,0,0,4.1128,0,2056.4,0]
[null,"","Boll Weevil Program LC",1.6,null,"Bale",3.71,null,5.9359999999999999,0,0,null,0,0,5.9359999999999999,0,2968,0]
[null,"Seed",null,null,null,null,null,null,"$85.61"]
[null,"","Cotton Seed - B2RF",40,null,"Thousand",1.96,null,78.400000000000006,0,0,null,0,0,78.400000000000006,0,39200,0]
[null,"","Cotton Seed - Insect Treatment",40,null,"Thousand",0.18020000000000003,null,7.2080000000000011,0,0,null,0,0,7.2080000000000011,0,3604.0000000000005,0]
[null,"","Tech Fee - B2RF",1,null,"Acre",0,null,0,0,0,null,0,0,0,0,0,0]
[null,"Other Chemicals",null,null,null,null,null,null,"$6.74"]
[null,"","Generic PIX",32,null,"Ounce",6.3600000000000004E-2,null,2.0352000000000001,0,0,null,0,0,2.0352000000000001,0,1017.6,0]
[null,"","Defoliants - Picker",4,null,"Ounce",1.1130000000000002,null,4.4520000000000008,0,0,null,0,0,4.4520000000000008,0,2226.0000000000005,0]
[null,"","Ethephon",1.6,null,"Ounce",0.159,null,0.25440000000000002,0,0,null,0,0,0.25440000000000002,0,127.2,0]
[null,"Other Labor",null,null,null,null,null,null,"$1.36"]
[null,"","Hand Labor",0.08,null,"Hour",16.96,null,1.3568,0,0,null,0,0,1.3568,0,678.4,0]
[null,null,null,0,null,null,0,null,0,0,0,null,0,0,0,0,0,0]
[null,null,null,0,null,null,0,null,0,0,0,null,0,0,0,0,0,0]
[null,null,null,0,null,null,0,null,0,{"$f":"E47*H47","v":0},0,null,0,{"$f":"J47*L47","v":0},0,{"$f":"+J47-N47","v":0},0,{"$f":"+J47*E$7","v":0}]
[null,"Machinery Labor",null,null,null,null,null,null,"$4.82"]
[null,null,"Tractors/Self-Propelled",0.28000000000000003,null,"Hour",17.21,null,4.8188000000000004,{"$f":"E49*H49","v":0},0,null,0,{"$f":"J49*L49","v":0},4.8188000000000004,{"$f":"+J49-N49","v":0},2409.4,{"$f":"+J49*E$7","v":0}]
[null,null,"Other Labor",0,null,"Hour",17.21,null,0,{"$f":"E50*H50","v":0},0,null,0,{"$f":"J50*L50","v":0},0,{"$f":"+J50-N50","v":0},0,{"$f":"+J50*E$7","v":0}]
[]
[null,"Diesel Fuel",null,null,null,null,null,null,"$7.73"]
[null,null,"Pickup/General Use Equipment",1,null,"Acre",0,null,0,{"$f":"E53*H53","v":0},0,null,0,{"$f":"J53*L53","v":0},0,{"$f":"+J53-N53","v":0},0,{"$f":"+J53*E$7","v":0}]
[null,null,"Tractors/Self-Propelled",3.45,null,"Gallon",2.2400000000000002,null,7.7280000000000015,{"$f":"E54*H54","v":0},0,null,0,{"$f":"J54*L54","v":0},7.7280000000000015,{"$f":"+J54-N54","v":0},3864.0000000000009,{"$f":"+J54*E$7","v":0}]
[]
[null,"Gasoline",null,null,null,null,null,null,"$0"]
[null,null,"Pickup/General Use Equipment",1,null,"Acre",0,null,0,{"$f":"E57*H57","v":0},0,null,0,{"$f":"J57*L57","v":0},0,{"$f":"+J57-N57","v":0},0,{"$f":"+J57*E$7","v":0}]
[null,null,"Tractors/Self-Propelled",0,null,"Gallon",2.09,null,0,{"$f":"E58*H58","v":0},0,null,0,{"$f":"J58*L58","v":0},0,{"$f":"+J58-N58","v":0},0,{"$f":"+J58*E$7","v":0}]
[]
[null,"Repairs & Maintenance",null,null,null,null,null,null,"$16.5"]
[null,null,"Pickup/General Use Equipment",1,null,"Acre",0,null,0,{"$f":"E61*H61","v":0},0,null,0,{"$f":"J61*L61","v":0},0,{"$f":"+J61-N61","v":0},0,{"$f":"+J61*E$7","v":0}]
[null,null,"Irrigation Equipment",1,null,"Acre",0,null,0,0,0,null,0,0,0,0,0,0]
[null,null,"Tractors/Self-Propelled",1,null,"Acre",10.62936212497673,null,10.62936212497673,0,0,null,0,0,10.62936212497673,0,5314.6810624883647,0]
[null,null,"Implements",1,null,"Acre",5.874472995971205,null,5.874472995971205,0,0,null,0,0,5.874472995971205,0,2937.2364979856025,0]
[null,null,null,null,null,null,null,null,0,0,0,null,0,0,0,0,0,0]
[null,null,null,null,null,null,null,null,0,0,0,null,0,0,0,0,0,0]
[null,"Interest on Credit Line",null,null,null,null,0.08,null,16.778019920297968,{"$f":"+SUM(J18:J66)/2*H67","v":0},null,null,0,{"$f":"+SUM(N18:N66)/2*L67","v":0},16.778019920297968,{"$f":"+SUM(P18:P66)/2*L67","v":0},8389.0099601489837,{"$f":"+J67*E$7","v":0}]
["Total Variable Costs",null,null,null,null,null,null,null,539.00045504124603,{"$f":"SUM(J19:J67)","v":0},null,null,0,{"$f":"SUM(N19:N67)","v":0},539.00045504124603,{"$f":"SUM(P19:P67)","v":0},269500.22752062295,{"$f":"SUM(R19:R67)","v":0}]
["Planned Returns Above Variable Costs:",null,null,null,null,null,null,null,389.79954495875393,{"$f":"+J14-J68","v":0},null,null,0,{"$f":"+N14-N68","v":0},389.79954495875393,{"$f":"+P14-P68","v":0},194899.77247937705,{"$f":"+R14-R68","v":0}]
[null,"Breakeven Price to Cover Variable Costs",null,null,null,null,0.41275056880155758,{"$f":"IF(E10=0,\"n/a\",(YVarExp-(YTotExp+YTotRet-J10))/E10)","v":"n/a"},"Pound"]
[null,null,null,null,null,null,null,null,null,null,null,null,null,null,null,null,"Enterprise","Enterprise"]
["FIXED COSTS",null,null,"Quantity","Quantity","Units","$/Unit","$/Unit","Total","Total","Share","Share","Landlord","Landlord","Tenant","Tenant","Total","Total"]
[null,"Machinery Depreciation",null,null,null,null,null,null,"$21.96"]
[null,null,"Tractors/Self-Propelled",1,null,"Acre",13.742957924011051,null,13.742957924011051,{"$f":"E74*H74","v":0},0,null,0,{"$f":"J74*L74","v":0},13.742957924011051,{"$f":"+J74-N74","v":0},6871.4789620055253,{"$f":"+J74*E$7","v":0}]
[null,null,"Implements",1,null,"Acre",8.2206787815762947,null,8.2206787815762947,0,0,null,0,{"$f":"J75*L75","v":0},8.2206787815762947,0,4110.3393907881473,0]
[null,"Equipment Investment",null,null,null,null,null,null,"$11.35"]
[null,null,"Tractors/Self-Propelled",105.78001700486182,null,"Dollars",0.08,null,8.4624013603889452,{"$f":"E77*H77","v":0},0,null,0,{"$f":"J77*L77","v":0},8.4624013603889452,{"$f":"+J77-N77","v":0},4231.2006801944726,{"$f":"+J77*E$7","v":0}]
[null,null,"Implements",36.088261585028476,null,"Dollars",0.08,null,2.887060926802278,0,0,null,0,{"$f":"J78*L78","v":0},2.887060926802278,0,1443.5304634011391,0]
[null,"Salaried Labor",null,1,null,"Acre",0,null,0,0,0,null,0,{"$f":"J79*L79","v":0},0,{"$f":"+J79-N79","v":0},0,{"$f":"+J79*E$7","v":0}]
[null,"Management Fee, Owner/Operator Labor",null,1,null,"Acre",46.44,null,46.44,0,0,null,0,0,46.44,0,23220,0]
[null,"Allocated Establishment Cost",null,1,null,"Acre",0,null,0,0,0,null,0,0,0,0,0,0]
[null,"LCB - Land Charge",null,1,null,"Acre",70,null,70,0,0,null,0,0,70,0,35000,0]
[null,"Property Taxes",null,1,null,"Acre",0,null,0,0,0,null,0,0,0,0,0,0]
[null,"Whole Farm Insurance",null,1,null,"Acre",0,null,0,0,0,null,0,0,0,0,0,0]
[null,null,null,1,null,null,0,null,0,0,0,null,0,0,0,0,0,0]
[null,null,null,1,null,null,0,null,0,{"$f":"E86*H86","v":0},0,null,0,0,0,0,0,0]
["Total Fixed Costs",null,null,null,null,null,null,null,149.75309899277858,{"$f":"+SUM(J74:J86)","v":0},null,null,0,{"$f":"+SUM(N74:N86)","v":0},149.75309899277858,{"$f":"+SUM(P74:P86)","v":0},74876.549496389285,{"$f":"+SUM(R74:R86)","v":0}]
["Total Specified Costs",null,null,null,null,null,null,null,688.75355403402455,{"$f":"+J68+J87","v":0},null,null,0,{"$f":"+N68+N87","v":0},688.75355403402455,{"$f":"+P68+P87","v":0},344376.77701701224,{"$f":"+R68+R87","v":0}]
[]
["Returns Above Specified Costs",null,null,null,null,null,null,null,240.04644596597541,{"$f":"+J14-J88","v":0},null,null,0,{"$f":"+N14-N88","v":0},240.04644596597541,{"$f":"+P14-P88","v":0},120023.22298298776,{"$f":"+R14-R88","v":0}]
[]
["    Breakeven Price to Cover Total Costs",null,null,null,null,null,0.59994194254253075,{"$f":"IF(E10=0,\"n/a\",(YTotExp-(YTotExp+YTotRet-J10))/E10)","v":"n/a"},"Pound"]
[]
[null,null,null,"Example Breakeven Prices"]
[null,"Example","Example","To Cover",null,null,"To Cover"]
[null,"Yield","Yield","Variable",null,null,"Total"]
[null,"Percent","Pound","Costs",null,null,"Costs"]
[null,0.75,600,0.55033409173541015,null,null,0.79992259005670763]
[null,0.9,720,0.45861174311284175,null,null,0.66660215838058967]
[null,1,800,0.41275056880155758,null,null,0.59994194254253075]
[null,1.1000000000000001,880.00000000000011,0.37522778981959776,null,null,0.54540176594775513]
[null,1.25,1000,0.33020045504124607,null,null,0.47995355403402457]
[]
["  Developed by Extension Economists, Texas A&M AgriLife Extension Service, budgets@tamu.edu.  "]
[]
["Information presented is prepared solely as a general guide and not intended to recognize or predict the costs and returns from any one operation.  Brand names are mentioned only as examples and imply no endorsement."]

{"sheet":"Sesame","index":8,"n_rows":90,"n_cols":18,"rows_kept":90,"cut":false,"hidden":false,"merged":[[77,3,77,8],[89,0,89,11],[0,0,0,11],[1,0,1,11],[2,0,2,11],[3,0,3,11]]}
["Projections for Planning Purposes Only -- Not to be Used without Updating"]
["2023 Estimated Costs and Returns per Acre"]
["Sesame - Conventional Till-12 Row, Dryland, 800 lb. Yield Goal - Lower Coast"]
["Enter your name for this budget in the cell above."]
["Enter  Your Values in the cells highlighed in MAROON."]
[null,null,null,null,"Your Acres",null,null,null,null,null,null,null,null,null,null,null,null,"Your"]
[null,null,"Crop Acres",500,null,null,null,null,null,null,null,"Your",null,null,null,null,"Enterprise","Enterprise"]
[null,null,null,null,"Your",null,null,"Your","Cash","Your","Landlord","Landlord",null,"Your",null,"Your","Total","Total"]
["REVENUE",null,null,"Quantity","Quantity","Units","$/Unit","$/Unit","Total","Total","Share","Share","Landlord","Landlord","Tenant","Tenant","(500 acres)",{"$f":"\"(\" & E7 & \" acres)\"","v":"( acres)"}]
[null,"Sesame",null,800,null,"Pound",0.32,null,256,{"$f":"E10*H10","v":0},0,null,0,{"$f":"J10*L10","v":0},256,{"$f":"+J10-N10","v":0},128000,{"$f":"+J10*E$7","v":0}]
[null,null,null,0,null,null,0,null,0,0,0,null,0,0,0,{"$f":"+J11-N11","v":0},0,0]
[null,null,null,0,null,null,0,null,0,0,0,null,0,0,0,0,0,0]
["Total Revenue",null,null,null,null,null,null,null,256,{"$f":"SUM(J10:J12)","v":0},null,null,0,{"$f":"SUM(N10:N12)","v":0},256,{"$f":"SUM(P10:P12)","v":0},128000,{"$f":"SUM(R10:R12)","v":0}]
[null,null,null,null,null,null,null,null,null,null,null,null,null,null,null,null,"Enterprise","Enterprise"]
["VARIABLE COSTS",null,null,"Quantity","Quantity","Units","$/Unit","$/Unit","Total","Total","Share","Share","Landlord","Landlord","Tenant","Tenant","Total","Total"]
["Production Costs"]
[null,"Fertilizer",null,null,null,null,null,null,"$47.98"]
[null,"","24-8-0",8.3299999999999999E-2,null,"Ton",576,null,47.980800000000002,{"$f":"E18*H18","v":0},0,null,0,{"$f":"J18*L18","v":0},47.980800000000002,{"$f":"+J18-N18","v":0},23990.400000000001,{"$f":"+J18*E$7","v":0}]
[null,"Herbicide",null,null,null,null,null,null,"$22.45"]
[null,"","Glyphosate (Generic)",2,null,"Quart",7.75,null,15.5,0,0,null,0,0,15.5,0,7750,0]
[null,"","Sesame PostEmerge Herbicide",8,null,"Ounce",0.86919999999999997,null,6.9535999999999998,0,0,null,0,0,6.9535999999999998,0,3476.7999999999997,0]
[null,"Miscellaneous",null,null,null,null,null,null,"$30.11"]
[null,"","Pickup Milage Charge",1,null,"Acre",4.1128,null,4.1128,0,0,null,0,0,4.1128,0,2056.4,0]
[null,"","Crop Insurance -Sesame",1,null,"Acre",26,null,26,0,0,null,0,0,26,0,13000,0]
[null,"Seed",null,null,null,null,null,null,"$12.72"]
[null,"","Sesame",3,null,"Pound",4.24,null,12.72,0,0,null,0,0,12.72,0,6360,0]
[null,"Other Labor",null,null,null,null,null,null,"$1.36"]
[null,"","Hand Labor",0.08,null,"Hour",16.96,null,1.3568,0,0,null,0,0,1.3568,0,678.4,0]
[null,null,null,0,null,null,0,null,0,0,0,null,0,0,0,0,0,0]
[null,null,null,0,null,null,0,null,0,0,0,null,0,0,0,0,0,0]
[null,null,null,0,null,null,0,null,0,{"$f":"E31*H31","v":0},0,null,0,{"$f":"J31*L31","v":0},0,{"$f":"+J31-N31","v":0},0,{"$f":"+J31*E$7","v":0}]
[null,"Machinery Labor",null,null,null,null,null,null,"$7.4"]
[null,null,"Tractors/Self-Propelled",0.43,null,"Hour",17.21,null,7.4003000000000005,{"$f":"E33*H33","v":0},0,null,0,{"$f":"J33*L33","v":0},7.4003000000000005,{"$f":"+J33-N33","v":0},3700.15,{"$f":"+J33*E$7","v":0}]
[null,null,"Other Labor",0,null,"Hour",17.21,null,0,{"$f":"E34*H34","v":0},0,null,0,{"$f":"J34*L34","v":0},0,{"$f":"+J34-N34","v":0},0,{"$f":"+J34*E$7","v":0}]
[]
[null,"Diesel Fuel",null,null,null,null,null,null,"$11.27"]
[null,null,"Pickup/General Use Equipment",1,null,"Acre",0,null,0,{"$f":"E37*H37","v":0},0,null,0,{"$f":"J37*L37","v":0},0,{"$f":"+J37-N37","v":0},0,{"$f":"+J37*E$7","v":0}]
[null,null,"Tractors/Self-Propelled",5.03,null,"Gallon",2.2400000000000002,null,11.267200000000001,{"$f":"E38*H38","v":0},0,null,0,{"$f":"J38*L38","v":0},11.267200000000001,{"$f":"+J38-N38","v":0},5633.6,{"$f":"+J38*E$7","v":0}]
[]
[null,"Gasoline",null,null,null,null,null,null,"$0"]
[null,null,"Pickup/General Use Equipment",1,null,"Acre",0,null,0,{"$f":"E41*H41","v":0},0,null,0,{"$f":"J41*L41","v":0},0,{"$f":"+J41-N41","v":0},0,{"$f":"+J41*E$7","v":0}]
[null,null,"Tractors/Self-Propelled",0,null,"Gallon",2.09,null,0,{"$f":"E42*H42","v":0},0,null,0,{"$f":"J42*L42","v":0},0,{"$f":"+J42-N42","v":0},0,{"$f":"+J42*E$7","v":0}]
[]
[null,"Repairs & Maintenance",null,null,null,null,null,null,"$27.75"]
[null,null,"Pickup/General Use Equipment",1,null,"Acre",0,null,0,{"$f":"E45*H45","v":0},0,null,0,{"$f":"J45*L45","v":0},0,{"$f":"+J45-N45","v":0},0,{"$f":"+J45*E$7","v":0}]
[null,null,"Irrigation Equipment",1,null,"Acre",0,null,0,0,0,null,0,0,0,0,0,0]
[null,null,"Tractors/Self-Propelled",1,null,"Acre",19.448711379324035,null,19.448711379324035,0,0,null,0,0,19.448711379324035,0,9724.3556896620175,0]
[null,null,"Implements",1,null,"Acre",8.3047317138940464,null,8.3047317138940464,0,0,null,0,0,8.3047317138940464,0,4152.3658569470235,0]
[null,null,null,null,null,null,null,null,0,0,0,null,0,0,0,0,0,0]
[null,null,null,null,null,null,null,null,0,0,0,null,0,0,0,0,0,0]
[null,"Interest on Credit Line",null,null,null,null,0.08,null,3.8603058804888728,{"$f":"+SUM(J17:J50)/2*H51","v":0},null,null,0,{"$f":"+SUM(N17:N50)/2*L51","v":0},3.8603058804888728,{"$f":"+SUM(P17:P50)/2*L51","v":0},1930.1529402444364,{"$f":"+J51*E$7","v":0}]
["Total Variable Costs",null,null,null,null,null,null,null,164.90524897370699,{"$f":"SUM(J18:J51)","v":0},null,null,0,{"$f":"SUM(N18:N51)","v":0},164.90524897370699,{"$f":"SUM(P18:P51)","v":0},82452.6244868535,{"$f":"SUM(R18:R51)","v":0}]
["Planned Returns Above Variable Costs:",null,null,null,null,null,null,null,91.094751026293011,{"$f":"+J13-J52","v":0},null,null,0,{"$f":"+N13-N52","v":0},91.094751026293011,{"$f":"+P13-P52","v":0},45547.3755131465,{"$f":"+R13-R52","v":0}]
[null,"Breakeven Price to Cover Variable Costs",null,null,null,null,0.20613156121713375,{"$f":"IF(E10=0,\"n/a\",(YVarExp-(YTotExp+YTotRet-J10))/E10)","v":"n/a"},"Pound"]
[null,null,null,null,null,null,null,null,null,null,null,null,null,null,null,null,"Enterprise","Enterprise"]
["FIXED COSTS",null,null,"Quantity","Quantity","Units","$/Unit","$/Unit","Total","Total","Share","Share","Landlord","Landlord","Tenant","Tenant","Total","Total"]
[null,"Machinery Depreciation",null,null,null,null,null,null,"$30.25"]
[null,null,"Tractors/Self-Propelled",1,null,"Acre",20.475902517411647,null,20.475902517411647,{"$f":"E58*H58","v":0},0,null,0,{"$f":"J58*L58","v":0},20.475902517411647,{"$f":"+J58-N58","v":0},10237.951258705823,{"$f":"+J58*E$7","v":0}]
[null,null,"Implements",1,null,"Acre",9.7770469281277652,null,9.7770469281277652,0,0,null,0,{"$f":"J59*L59","v":0},9.7770469281277652,0,4888.5234640638828,0]
[null,"Equipment Investment",null,null,null,null,null,null,"$18.41"]
[null,null,"Tractors/Self-Propelled",156.87222383768031,null,"Dollars",0.08,null,12.549777907014425,{"$f":"E61*H61","v":0},0,null,0,{"$f":"J61*L61","v":0},12.549777907014425,{"$f":"+J61-N61","v":0},6274.8889535072121,{"$f":"+J61*E$7","v":0}]
[null,null,"Implements",73.264552256627567,null,"Dollars",0.08,null,5.8611641805302055,0,0,null,0,{"$f":"J62*L62","v":0},5.8611641805302055,0,2930.5820902651026,0]
[null,"Salaried Labor",null,1,null,"Acre",0,null,0,0,0,null,0,{"$f":"J63*L63","v":0},0,{"$f":"+J63-N63","v":0},0,{"$f":"+J63*E$7","v":0}]
[null,"Management Fee, Owner/Operator Labor",null,1,null,"Acre",12.8,null,12.8,0,0,null,0,0,12.8,0,6400,0]
[null,"Allocated Establishment Cost",null,1,null,"Acre",0,null,0,0,0,null,0,0,0,0,0,0]
[null,"LCB - Land Charge",null,1,null,"Acre",70,null,70,0,0,null,0,0,70,0,35000,0]
[null,"Property Taxes",null,1,null,"Acre",0,null,0,0,0,null,0,0,0,0,0,0]
[null,"Whole Farm Insurance",null,1,null,"Acre",0,null,0,0,0,null,0,0,0,0,0,0]
[null,null,null,1,null,null,0,null,0,0,0,null,0,0,0,0,0,0]
[null,null,null,1,null,null,0,null,0,{"$f":"E70*H70","v":0},0,null,0,0,0,0,0,0]
["Total Fixed Costs",null,null,null,null,null,null,null,131.46389153308405,{"$f":"+SUM(J58:J70)","v":0},null,null,0,{"$f":"+SUM(N58:N70)","v":0},131.46389153308405,{"$f":"+SUM(P58:P70)","v":0},65731.94576654202,{"$f":"+SUM(R58:R70)","v":0}]
["Total Specified Costs",null,null,null,null,null,null,null,296.36914050679104,{"$f":"+J52+J71","v":0},null,null,0,{"$f":"+N52+N71","v":0},296.36914050679104,{"$f":"+P52+P71","v":0},148184.57025339553,{"$f":"+R52+R71","v":0}]
[]
["Returns Above Specified Costs",null,null,null,null,null,null,null,-40.369140506791041,{"$f":"+J13-J72","v":0},null,null,0,{"$f":"+N13-N72","v":0},-40.369140506791041,{"$f":"+P13-P72","v":0},-20184.570253395534,{"$f":"+R13-R72","v":0}]
[]
["    Breakeven Price to Cover Total Costs",null,null,null,null,null,0.37046142563348883,{"$f":"IF(E10=0,\"n/a\",(YTotExp-(YTotExp+YTotRet-J10))/E10)","v":"n/a"},"Pound"]
[]
[null,null,null,"Example Breakeven Prices"]
[null,"Example","Example","To Cover",null,null,"To Cover"]
[null,"Yield","Yield","Variable",null,null,"Total"]
[null,"Percent","Pound","Costs",null,null,"Costs"]
[null,0.75,600,0.27484208162284496,null,null,0.49394856751131838]
[null,0.9,720,0.22903506801903747,null,null,0.41162380625943201]
[null,1,800,0.20613156121713375,null,null,0.37046142563348883]
[null,1.1000000000000001,880.00000000000011,0.18739232837921246,null,null,0.33678311421226248]
[null,1.25,1000,0.16490524897370698,null,null,0.29636914050679103]
[]
["  Developed by Extension Economists, Texas A&M AgriLife Extension Service, budgets@tamu.edu.  "]
[]
["Information presented is prepared solely as a general guide and not intended to recognize or predict the costs and returns from any one operation.  Brand names are mentioned only as examples and imply no endorsement."]

{"sheet":"IrrigatedCotton","index":9,"n_rows":112,"n_cols":18,"rows_kept":112,"cut":false,"hidden":false,"merged":[[99,3,99,8],[111,0,111,11],[0,0,0,11],[1,0,1,11],[2,0,2,11],[3,0,3,11]]}
["Projections for Planning Purposes Only -- Not to be Used without Updating"]
["2023 Estimated Costs and Returns per Acre"]
["Cotton - Genetically Modified Seed, Conv. Till-24 Row, Irrigated, 1250 lb. Yield Goal"]
["Enter your name for this budget in the cell above."]
["Enter  Your Values in the cells highlighed in MAROON."]
[null,null,null,null,"Your Acres",null,null,null,null,null,null,null,null,null,null,null,null,"Your"]
[null,null,"Crop Acres",505,null,null,null,null,null,null,null,"Your",null,null,null,null,"Enterprise","Enterprise"]
[null,null,null,null,"Your",null,null,"Your","Cash","Your","Landlord","Landlord",null,"Your",null,"Your","Total","Total"]
["REVENUE",null,null,"Quantity","Quantity","Units","$/Unit","$/Unit","Total","Total","Share","Share","Landlord","Landlord","Tenant","Tenant","(505 acres)",{"$f":"\"(\" & E7 & \" acres)\"","v":"( acres)"}]
[null,"Cotton Lint",null,1250,null,"Pound",0.9,null,1125,{"$f":"E10*H10","v":0},0,null,0,{"$f":"J10*L10","v":0},1125,{"$f":"+J10-N10","v":0},568125,{"$f":"+J10*E$7","v":0}]
[null,"Cottonseed",null,0.86,null,"Ton",360,null,309.60000000000002,0,0,null,0,0,309.60000000000002,{"$f":"+J11-N11","v":0},156348,0]
[null,null,null,0,null,null,0,null,0,0,0,null,0,0,0,0,0,0]
[null,null,null,0,null,null,0,null,0,0,0,null,0,0,0,0,0,0]
["Total Revenue",null,null,null,null,null,null,null,1434.6,{"$f":"SUM(J10:J13)","v":0},null,null,0,{"$f":"SUM(N10:N13)","v":0},1434.6,{"$f":"SUM(P10:P13)","v":0},724473,{"$f":"SUM(R10:R13)","v":0}]
[null,null,null,null,null,null,null,null,null,null,null,null,null,null,null,null,"Enterprise","Enterprise"]
["VARIABLE COSTS",null,null,"Quantity","Quantity","Units","$/Unit","$/Unit","Total","Total","Share","Share","Landlord","Landlord","Tenant","Tenant","Total","Total"]
["Production Costs"]
[null,"Custom",null,null,null,null,null,null,"$0"]
[null,"","Fertilizer Application",0,null,"Ounce",0.159,null,0,{"$f":"E19*H19","v":0},0,null,0,{"$f":"J19*L19","v":0},0,{"$f":"+J19-N19","v":0},0,{"$f":"+J19*E$7","v":0}]
[null,"","Pick and Module",1250,null,"Pound",0.13780000000000001,null,172.25,0,0,null,0,0,172.25,0,86986.25,0]
[null,"","Ginning - Picker",1250,null,"Pound",0.13250000000000001,null,165.625,0,0,null,0,0,165.625,0,83640.625,0]
[null,"Fertilizer",null,null,null,null,null,null,"$95.04"]
[null,"","24-8-0",0.16500000000000001,null,"Ton",576,null,95.04,0,0,null,0,0,95.04,0,47995.200000000004,0]
[null,"Herbicide",null,null,null,null,null,null,"$60.87"]
[null,"","Glyphosate",1,null,"Quart",12.25,null,12.25,0,0,null,0,0,12.25,0,6186.25,0]
[null,"","Trifluralin",32,null,"Ounce",0.20140000000000002,null,6.4448000000000008,0,0,null,0,0,6.4448000000000008,0,3254.6240000000003,0]
[null,"","Cotton Early Season Herbicide",2,null,"Quart",17.214399999999998,null,34.428799999999995,0,0,null,0,0,34.428799999999995,0,17386.543999999998,0]
[null,"","2, 4D Amine",2,null,"Pint",3.875,null,7.75,0,0,null,0,0,7.75,0,3913.75,0]
[null,"Insecticide",null,null,null,null,null,null,"$2.24"]
[null,"","Fleahopper Control",1.6,null,"Ounce",1.4,null,2.2399999999999998,0,0,null,0,0,2.2399999999999998,0,1131.1999999999998,0]
[null,"Miscellaneous",null,null,null,null,null,null,"$13.57"]
[null,"","Crop Insurance - Irr Cotton",1,null,"Thousand",0.18020000000000003,null,0.18020000000000003,0,0,null,0,0,0.18020000000000003,0,91.001000000000019,0]
[null,"","Pickup Milage Charge",1,null,"Acre",4.1128,null,4.1128,0,0,null,0,0,4.1128,0,2076.9639999999999,0]
[null,"","Boll Weevil Program LC",2.5,null,"Bale",3.71,null,9.2750000000000004,0,0,null,0,0,9.2750000000000004,0,4683.875,0]
[null,"Seed",null,null,null,null,null,null,"$96.31"]
[null,"","Cotton Seed - B2RF",45,null,"Thousand",1.96,null,88.2,0,0,null,0,0,88.2,0,44541,0]
[null,"","Cotton Seed - Insect Treatment",45,null,"Thousand",0.18020000000000003,null,8.1090000000000018,0,0,null,0,0,8.1090000000000018,0,4095.045000000001,0]
[null,"","Tech Fee - B2RF",1,null,"Acre",0,null,0,0,0,null,0,0,0,0,0,0]
[null,"Other Labor",null,null,null,null,null,null,"$1.36"]
[null,"","Hand Labor",0.08,null,"Hour",16.96,null,1.3568,0,0,null,0,0,1.3568,0,685.18399999999997,0]
[null,"Other Chemicals",null,null,null,null,null,null,"$13.74"]
[null,"","Dual",1,null,"Pint",6.9959999999999996,null,6.9959999999999996,0,0,null,0,0,6.9959999999999996,0,3532.9799999999996,0]
[null,"","Generic PIX",32,null,"Ounce",6.3600000000000004E-2,null,2.0352000000000001,0,0,null,0,0,2.0352000000000001,0,1027.7760000000001,0]
[null,"","Defoliants - Picker",4,null,"Ounce",1.1130000000000002,null,4.4520000000000008,0,0,null,0,0,4.4520000000000008,0,2248.2600000000002,0]
[null,"","Ethephon",1.6,null,"Ounce",0.159,null,0.25440000000000002,0,0,null,0,0,0.25440000000000002,0,128.47200000000001,0]
[null,null,null,0,null,null,0,null,0,0,0,null,0,0,0,0,0,0]
[null,null,null,0,null,null,0,null,0,0,0,null,0,0,0,0,0,0]
[null,null,null,0,null,null,0,null,0,{"$f":"E48*H48","v":0},0,null,0,{"$f":"J48*L48","v":0},0,{"$f":"+J48-N48","v":0},0,{"$f":"+J48*E$7","v":0}]
[null,"Irrigation",null,null,null,null,null,null,"$47.25"]
[null,null,"Energy Cost",10,null,"AcreInch",2.1,null,21,{"$f":"E50*H50","v":0},0,null,0,{"$f":"J50*L50","v":0},21,{"$f":"+J50-N50","v":0},10605,{"$f":"+J50*E$7","v":0}]
[null,null,"Irrigation Labor",1.5,null,"Hour",17.5,null,26.25,0,0,null,0,0,26.25,0,13256.25,0]
[null,"Machinery Labor",null,null,null,null,null,null,"$4.82"]
[null,null,"Tractors/Self-Propelled",0.28000000000000003,null,"Hour",17.21,null,4.8188000000000004,{"$f":"E53*H53","v":0},0,null,0,{"$f":"J53*L53","v":0},4.8188000000000004,{"$f":"+J53-N53","v":0},2433.4940000000001,{"$f":"+J53*E$7","v":0}]
[null,null,"Other Labor",0,null,"Hour",17.21,null,0,{"$f":"E54*H54","v":0},0,null,0,{"$f":"J54*L54","v":0},0,{"$f":"+J54-N54","v":0},0,{"$f":"+J54*E$7","v":0}]
[]
[null,"Diesel Fuel",null,null,null,null,null,null,"$7.73"]
[null,null,"Pickup/General Use Equipment",1,null,"Acre",0,null,0,{"$f":"E57*H57","v":0},0,null,0,{"$f":"J57*L57","v":0},0,{"$f":"+J57-N57","v":0},0,{"$f":"+J57*E$7","v":0}]
[null,null,"Tractors/Self-Propelled",3.45,null,"Gallon",2.2400000000000002,null,7.7280000000000015,{"$f":"E58*H58","v":0},0,null,0,{"$f":"J58*L58","v":0},7.7280000000000015,{"$f":"+J58-N58","v":0},3902.6400000000008,{"$f":"+J58*E$7","v":0}]
[]
[null,"Gasoline",null,null,null,null,null,null,"$0"]
[null,null,"Pickup/General Use Equipment",1,null,"Acre",0,null,0,{"$f":"E61*H61","v":0},0,null,0,{"$f":"J61*L61","v":0},0,{"$f":"+J61-N61","v":0},0,{"$f":"+J61*E$7","v":0}]
[null,null,"Tractors/Self-Propelled",0,null,"Gallon",2.09,null,0,{"$f":"E62*H62","v":0},0,null,0,{"$f":"J62*L62","v":0},0,{"$f":"+J62-N62","v":0},0,{"$f":"+J62*E$7","v":0}]
[]
[null,"Repairs & Maintenance",null,null,null,null,null,null,"$41.59"]
[null,null,"Pickup/General Use Equipment",1,null,"Acre",0,null,0,{"$f":"E65*H65","v":0},0,null,0,{"$f":"J65*L65","v":0},0,{"$f":"+J65-N65","v":0},0,{"$f":"+J65*E$7","v":0}]
[null,null,"Irrigation Equipment",1,null,"Acre",25.082508250825082,null,25.082508250825082,0,0,null,0,0,25.082508250825082,0,12666.666666666666,0]
[null,null,"Tractors/Self-Propelled",1,null,"Acre",10.629362124976728,null,10.629362124976728,0,0,null,0,0,10.629362124976728,0,5367.8278731132477,0]
[null,null,"Implements",1,null,"Acre",5.8744729959712059,null,5.8744729959712059,0,0,null,0,0,5.8744729959712059,0,2966.6088629654591,0]
[null,null,null,null,null,null,null,null,0,0,0,null,0,0,0,0,0,0]
[null,null,null,null,null,null,null,null,0,0,0,null,0,0,0,0,0,0]
[null,"Interest on Credit Line",null,null,null,null,0.08,null,20.57297342293371,{"$f":"+SUM(J18:J70)/2*H71","v":0},null,null,0,{"$f":"+SUM(N18:N70)/2*L71","v":0},20.57297342293371,{"$f":"+SUM(P18:P70)/2*L71","v":0},10389.351578581523,{"$f":"+J71*E$7","v":0}]
["Total Variable Costs",null,null,null,null,null,null,null,742.95611679470687,{"$f":"SUM(J19:J71)","v":0},null,null,0,{"$f":"SUM(N19:N71)","v":0},742.95611679470687,{"$f":"SUM(P19:P71)","v":0},375192.83898132702,{"$f":"SUM(R19:R71)","v":0}]
["Planned Returns Above Variable Costs:",null,null,null,null,null,null,null,691.64388320529304,{"$f":"+J14-J72","v":0},null,null,0,{"$f":"+N14-N72","v":0},691.64388320529304,{"$f":"+P14-P72","v":0},349280.16101867298,{"$f":"+R14-R72","v":0}]
[null,"Breakeven Price to Cover Variable Costs",null,null,null,null,0.34668489343576547,{"$f":"IF(E10=0,\"n/a\",(YVarExp-(YTotExp+YTotRet-J10))/E10)","v":"n/a"},"Pound"]
[null,null,null,null,null,null,null,null,null,null,null,null,null,null,null,null,"Enterprise","Enterprise"]
["FIXED COSTS",null,null,"Quantity","Quantity","Units","$/Unit","$/Unit","Total","Total","Share","Share","Landlord","Landlord","Tenant","Tenant","Total","Total"]
[null,"Machinery Depreciation",null,null,null,null,null,null,"$50.15"]
[null,null,"Irrigation Equipment",1,null,"Acre",28.184818481848186,null,28.184818481848186,{"$f":"E78*H78","v":0},0,null,0,{"$f":"J78*L78","v":0},28.184818481848186,{"$f":"+J78-N78","v":0},14233.333333333334,{"$f":"+J78*E$7","v":0}]
[null,null,"Tractors/Self-Propelled",1,null,"Acre",13.742957924011048,null,13.742957924011048,0,0,null,0,{"$f":"J79*L79","v":0},13.742957924011048,0,6940.1937516255794,0]
[null,null,"Implements",1,null,"Acre",8.2206787815762965,null,8.2206787815762965,0,0,null,0,{"$f":"J80*L80","v":0},8.2206787815762965,0,4151.4427846960298,0]
[null,"Equipment Investment",null,null,null,null,null,null,"$34.83"]
[null,null,"Irrigation Equipment",293.56435643564356,null,"Dollars",0.08,null,23.485148514851485,{"$f":"E82*H82","v":0},0,null,0,{"$f":"J82*L82","v":0},23.485148514851485,{"$f":"+J82-N82","v":0},11860,{"$f":"+J82*E$7","v":0}]
[null,null,"Tractors/Self-Propelled",105.78001700486179,null,"Dollars",0.08,null,8.4624013603889434,0,0,null,0,{"$f":"J83*L83","v":0},8.4624013603889434,0,4273.5126869964161,0]
[null,null,"Implements",36.088261585028484,null,"Dollars",0.08,null,2.8870609268022789,0,0,null,0,{"$f":"J84*L84","v":0},2.8870609268022789,0,1457.9657680351509,0]
[null,"Salaried Labor",null,1,null,"Acre",0,null,0,0,0,null,0,{"$f":"J85*L85","v":0},0,{"$f":"+J85-N85","v":0},0,{"$f":"+J85*E$7","v":0}]
[null,"Management Fee, Owner/Operator Labor",null,1,null,"Acre",71.73,null,71.73,0,0,null,0,0,71.73,0,36223.65,0]
[null,"Allocated Establishment Cost",null,1,null,"Acre",0,null,0,0,0,null,0,0,0,0,0,0]
[null,"LCB - Land Charge",null,1,null,"Acre",70,null,70,0,0,null,0,0,70,0,35350,0]
[null,"Property Taxes",null,1,null,"Acre",0,null,0,0,0,null,0,0,0,0,0,0]
[null,"Whole Farm Insurance",null,1,null,"Acre",0,null,0,0,0,null,0,0,0,0,0,0]
[null,null,null,1,null,null,0,null,0,0,0,null,0,0,0,0,0,0]
[null,null,null,1,null,null,0,null,0,{"$f":"E92*H92","v":0},0,null,0,0,0,0,0,0]
["Total Fixed Costs",null,null,null,null,null,null,null,226.71306598947825,{"$f":"+SUM(J78:J92)","v":0},null,null,0,{"$f":"+SUM(N78:N92)","v":0},226.71306598947825,{"$f":"+SUM(P78:P92)","v":0},114490.09832468652,{"$f":"+SUM(R78:R92)","v":0}]
["Total Specified Costs",null,null,null,null,null,null,null,969.66918278418507,{"$f":"+J72+J93","v":0},null,null,0,{"$f":"+N72+N93","v":0},969.66918278418507,{"$f":"+P72+P93","v":0},489682.93730601354,{"$f":"+R72+R93","v":0}]
[]
["Returns Above Specified Costs",null,null,null,null,null,null,null,464.93081721581484,{"$f":"+J14-J94","v":0},null,null,0,{"$f":"+N14-N94","v":0},464.93081721581484,{"$f":"+P14-P94","v":0},234790.06269398646,{"$f":"+R14-R94","v":0}]
[]
["    Breakeven Price to Cover Total Costs",null,null,null,null,null,0.52805534622734807,{"$f":"IF(E10=0,\"n/a\",(YTotExp-(YTotExp+YTotRet-J10))/E10)","v":"n/a"},"Pound"]
[]
[null,null,null,"Example Breakeven Prices"]
[null,"Example","Example","To Cover",null,null,"To Cover"]
[null,"Yield","Yield","Variable",null,null,"Total"]
[null,"Percent","Pound","Costs",null,null,"Costs"]
[null,0.75,937.5,0.46224652458102061,null,null,0.70407379496979738]
[null,0.9,1125,0.38520543715085054,null,null,0.58672816247483117]
[null,1,1250,0.34668489343576547,null,null,0.52805534622734807]
[null,1.1000000000000001,1375,0.31516808494160498,null,null,0.48005031475213455]
[null,1.25,1562.5,0.27734791474861237,null,null,0.42244427698187842]
[]
["  Developed by Extension Economists, Texas A&M AgriLife Extension Service, budgets@tamu.edu.  "]
[]
["Information presented is prepared solely as a general guide and not intended to recognize or predict the costs and returns from any one operation.  Brand names are mentioned only as examples and imply no endorsement."]

{"sheet":"IrrigatedSorghumLCB","index":10,"n_rows":102,"n_cols":18,"rows_kept":102,"cut":false,"hidden":false,"merged":[[89,3,89,8],[101,0,101,11],[0,0,0,11],[1,0,1,11],[2,0,2,11],[3,0,3,11]]}
["Projections for Planning Purposes Only -- Not to be Used without Updating"]
["2023 Estimated Costs and Returns per Acre"]
["Sorghum - Conventional Till-24 Row, Irrigated, 100 bu. Yield Goal"]
["Enter your name for this budget in the cell above."]
["Enter  Your Values in the cells highlighed in MAROON."]
[null,null,null,null,"Your Acres",null,null,null,null,null,null,null,null,null,null,null,null,"Your"]
[null,null,"Crop Acres",505,null,null,null,null,null,null,null,"Your",null,null,null,null,"Enterprise","Enterprise"]
[null,null,null,null,"Your",null,null,"Your","Cash","Your","Landlord","Landlord",null,"Your",null,"Your","Total","Total"]
["REVENUE",null,null,"Quantity","Quantity","Units","$/Unit","$/Unit","Total","Total","Share","Share","Landlord","Landlord","Tenant","Tenant","(505 acres)",{"$f":"\"(\" & E7 & \" acres)\"","v":"( acres)"}]
[null,"Grain Sorghum, Lower Coast",null,100,null,"Bushel",5.0999999999999996,null,509.99999999999994,{"$f":"E10*H10","v":0},0,null,0,{"$f":"J10*L10","v":0},509.99999999999994,{"$f":"+J10-N10","v":0},257549.99999999997,{"$f":"+J10*E$7","v":0}]
[null,null,null,0,null,null,0,null,0,0,0,null,0,0,0,{"$f":"+J11-N11","v":0},0,0]
[null,null,null,0,null,null,0,null,0,0,0,null,0,0,0,0,0,0]
["Total Revenue",null,null,null,null,null,null,null,509.99999999999994,{"$f":"SUM(J10:J12)","v":0},null,null,0,{"$f":"SUM(N10:N12)","v":0},509.99999999999994,{"$f":"SUM(P10:P12)","v":0},257549.99999999997,{"$f":"SUM(R10:R12)","v":0}]
[null,null,null,null,null,null,null,null,null,null,null,null,null,null,null,null,"Enterprise","Enterprise"]
["VARIABLE COSTS",null,null,"Quantity","Quantity","Units","$/Unit","$/Unit","Total","Total","Share","Share","Landlord","Landlord","Tenant","Tenant","Total","Total"]
["Production Costs"]
[null,"Custom",null,null,null,null,null,null,"$33.39"]
[null,"","Fertilizer Application",1,null,"Ounce",0.159,null,0.159,{"$f":"E18*H18","v":0},0,null,0,{"$f":"J18*L18","v":0},0.159,{"$f":"+J18-N18","v":0},80.295000000000002,{"$f":"+J18*E$7","v":0}]
[null,"","Custom Haul - Sorghum",57,null,"CWT",0.58300000000000007,null,33.231000000000002,0,0,null,0,0,33.231000000000002,0,16781.655000000002,0]
[null,"Fertilizer",null,null,null,null,null,null,"$130.75"]
[null,"","24-8-0",0.22700000000000001,null,"Ton",576,null,130.75200000000001,0,0,null,0,0,130.75200000000001,0,66029.760000000009,0]
[null,"Herbicide",null,null,null,null,null,null,"$25.92"]
[null,"","Atrazine 4L",2,null,"Quart",5.75,null,11.5,0,0,null,0,0,11.5,0,5807.5,0]
[null,"","Sorghum PreEmerge Herbicide",14,null,"Ounce",1.03,null,14.42,0,0,null,0,0,14.42,0,7282.1,0]
[null,"Insecticide",null,null,null,null,null,null,"$13.51"]
[null,"","Headworn Control",2.6,null,"Ounce",1.7,null,4.42,0,0,null,0,0,4.42,0,2232.1,0]
[null,"","Transform",1,null,"Ounce",8.1938000000000013,null,8.1938000000000013,0,0,null,0,0,8.1938000000000013,0,4137.8690000000006,0]
[null,"","Stinkbug Control",2,null,"Ounce",0.45,null,0.9,0,0,null,0,0,0.9,0,454.5,0]
[null,"Miscellaneous",null,null,null,null,null,null,"$4.29"]
[null,"","Crop Insurance - Irr Sorghum",1,null,"Thousand",0.18020000000000003,null,0.18020000000000003,0,0,null,0,0,0.18020000000000003,0,91.001000000000019,0]
[null,"","Pickup Milage Charge",1,null,"Acre",4.1128,null,4.1128,0,0,null,0,0,4.1128,0,2076.9639999999999,0]
[null,"Seed",null,null,null,null,null,null,"$16.96"]
[null,"","Treated Sorghum Seed",5,null,"Pound",3.3920000000000003,null,16.96,0,0,null,0,0,16.96,0,8564.8000000000011,0]
[null,"Other Labor",null,null,null,null,null,null,"$0.68"]
[null,"","Hand Labor",0.04,null,"Hour",16.96,null,0.6784,0,0,null,0,0,0.6784,0,342.59199999999998,0]
[null,null,null,0,null,null,0,null,0,0,0,null,0,0,0,0,0,0]
[null,null,null,0,null,null,0,null,0,0,0,null,0,0,0,0,0,0]
[null,null,null,0,null,null,0,null,0,{"$f":"E38*H38","v":0},0,null,0,{"$f":"J38*L38","v":0},0,{"$f":"+J38-N38","v":0},0,{"$f":"+J38*E$7","v":0}]
[null,"Irrigation",null,null,null,null,null,null,"$47.25"]
[null,null,"Energy Cost",10,null,"AcreInch",2.1,null,21,{"$f":"E40*H40","v":0},0,null,0,{"$f":"J40*L40","v":0},21,{"$f":"+J40-N40","v":0},10605,{"$f":"+J40*E$7","v":0}]
[null,null,"Irrigation Labor",1.5,null,"Hour",17.5,null,26.25,0,0,null,0,0,26.25,0,13256.25,0]
[null,"Machinery Labor",null,null,null,null,null,null,"$8.09"]
[null,null,"Tractors/Self-Propelled",0.47,null,"Hour",17.21,null,8.0886999999999993,{"$f":"E43*H43","v":0},0,null,0,{"$f":"J43*L43","v":0},8.0886999999999993,{"$f":"+J43-N43","v":0},4084.7934999999998,{"$f":"+J43*E$7","v":0}]
[null,null,"Other Labor",0,null,"Hour",17.21,null,0,{"$f":"E44*H44","v":0},0,null,0,{"$f":"J44*L44","v":0},0,{"$f":"+J44-N44","v":0},0,{"$f":"+J44*E$7","v":0}]
[]
[null,"Diesel Fuel",null,null,null,null,null,null,"$12.01"]
[null,null,"Pickup/General Use Equipment",1,null,"Acre",0,null,0,{"$f":"E47*H47","v":0},0,null,0,{"$f":"J47*L47","v":0},0,{"$f":"+J47-N47","v":0},0,{"$f":"+J47*E$7","v":0}]
[null,null,"Tractors/Self-Propelled",5.36,null,"Gallon",2.2400000000000002,null,12.006400000000001,{"$f":"E48*H48","v":0},0,null,0,{"$f":"J48*L48","v":0},12.006400000000001,{"$f":"+J48-N48","v":0},6063.2320000000009,{"$f":"+J48*E$7","v":0}]
[]
[null,"Gasoline",null,null,null,null,null,null,"$0"]
[null,null,"Pickup/General Use Equipment",1,null,"Acre",0,null,0,{"$f":"E51*H51","v":0},0,null,0,{"$f":"J51*L51","v":0},0,{"$f":"+J51-N51","v":0},0,{"$f":"+J51*E$7","v":0}]
[null,null,"Tractors/Self-Propelled",0,null,"Gallon",2.09,null,0,{"$f":"E52*H52","v":0},0,null,0,{"$f":"J52*L52","v":0},0,{"$f":"+J52-N52","v":0},0,{"$f":"+J52*E$7","v":0}]
[]
[null,"Repairs & Maintenance",null,null,null,null,null,null,"$54.33"]
[null,null,"Pickup/General Use Equipment",1,null,"Acre",0,null,0,{"$f":"E55*H55","v":0},0,null,0,{"$f":"J55*L55","v":0},0,{"$f":"+J55-N55","v":0},0,{"$f":"+J55*E$7","v":0}]
[null,null,"Irrigation Equipment",1,null,"Acre",25.082508250825082,null,25.082508250825082,0,0,null,0,0,25.082508250825082,0,12666.666666666666,0]
[null,null,"Tractors/Self-Propelled",1,null,"Acre",20.288164121277475,null,20.288164121277475,0,0,null,0,0,20.288164121277475,0,10245.522881245124,0]
[null,null,"Implements",1,null,"Acre",8.9574347303961286,null,8.9574347303961286,0,0,null,0,0,8.9574347303961286,0,4523.5045388500448,0]
[null,null,null,null,null,null,null,null,0,0,0,null,0,0,0,0,0,0]
[null,null,null,null,null,null,null,null,0,0,0,null,0,0,0,0,0,0]
[null,"Interest on Credit Line",null,null,null,null,0.08,null,14.220078965837343,{"$f":"+SUM(J17:J60)/2*H61","v":0},null,null,0,{"$f":"+SUM(N17:N60)/2*L61","v":0},14.220078965837343,{"$f":"+SUM(P17:P60)/2*L61","v":0},7181.139877747858,{"$f":"+J61*E$7","v":0}]
["Total Variable Costs",null,null,null,null,null,null,null,361.40048606833602,{"$f":"SUM(J18:J61)","v":0},null,null,0,{"$f":"SUM(N18:N61)","v":0},361.40048606833602,{"$f":"SUM(P18:P61)","v":0},182507.24546450973,{"$f":"SUM(R18:R61)","v":0}]
["Planned Returns Above Variable Costs:",null,null,null,null,null,null,null,148.59951393166392,{"$f":"+J13-J62","v":0},null,null,0,{"$f":"+N13-N62","v":0},148.59951393166392,{"$f":"+P13-P62","v":0},75042.75453549024,{"$f":"+R13-R62","v":0}]
[null,"Breakeven Price to Cover Variable Costs",null,null,null,null,3.6140048606833601,{"$f":"IF(E10=0,\"n/a\",(YVarExp-(YTotExp+YTotRet-J10))/E10)","v":"n/a"},"Bushel"]
[null,null,null,null,null,null,null,null,null,null,null,null,null,null,null,null,"Enterprise","Enterprise"]
["FIXED COSTS",null,null,"Quantity","Quantity","Units","$/Unit","$/Unit","Total","Total","Share","Share","Landlord","Landlord","Tenant","Tenant","Total","Total"]
[null,"Machinery Depreciation",null,null,null,null,null,null,"$61.76"]
[null,null,"Irrigation Equipment",1,null,"Acre",28.184818481848186,null,28.184818481848186,{"$f":"E68*H68","v":0},0,null,0,{"$f":"J68*L68","v":0},28.184818481848186,{"$f":"+J68-N68","v":0},14233.333333333334,{"$f":"+J68*E$7","v":0}]
[null,null,"Tractors/Self-Propelled",1,null,"Acre",22.263098260164114,null,22.263098260164114,0,0,null,0,{"$f":"J69*L69","v":0},22.263098260164114,0,11242.864621382878,0]
[null,null,"Implements",1,null,"Acre",11.310589611432635,null,11.310589611432635,0,0,null,0,{"$f":"J70*L70","v":0},11.310589611432635,0,5711.8477537734807,0]
[null,"Equipment Investment",null,null,null,null,null,null,"$43.5"]
[null,null,"Irrigation Equipment",293.56435643564356,null,"Dollars",0.08,null,23.485148514851485,{"$f":"E72*H72","v":0},0,null,0,{"$f":"J72*L72","v":0},23.485148514851485,{"$f":"+J72-N72","v":0},11860,{"$f":"+J72*E$7","v":0}]
[null,null,"Tractors/Self-Propelled",170.36770237667179,null,"Dollars",0.08,null,13.629416190133743,0,0,null,0,{"$f":"J73*L73","v":0},13.629416190133743,0,6882.8551760175396,0]
[null,null,"Implements",79.824707068542835,null,"Dollars",0.08,null,6.3859765654834266,0,0,null,0,{"$f":"J74*L74","v":0},6.3859765654834266,0,3224.9181655691305,0]
[null,"Salaried Labor",null,1,null,"Acre",0,null,0,0,0,null,0,{"$f":"J75*L75","v":0},0,{"$f":"+J75-N75","v":0},0,{"$f":"+J75*E$7","v":0}]
[null,"Management Fee, Owner/Operator Labor",null,1,null,"Acre",25.5,null,25.5,0,0,null,0,0,25.5,0,12877.5,0]
[null,"Allocated Establishment Cost",null,1,null,"Acre",0,null,0,0,0,null,0,0,0,0,0,0]
[null,"LCB - Land Charge",null,1,null,"Acre",70,null,70,0,0,null,0,0,70,0,35350,0]
[null,"Property Taxes",null,1,null,"Acre",0,null,0,0,0,null,0,0,0,0,0,0]
[null,"Whole Farm Insurance",null,1,null,"Acre",0,null,0,0,0,null,0,0,0,0,0,0]
[null,null,null,1,null,null,0,null,0,0,0,null,0,0,0,0,0,0]
[null,null,null,1,null,null,0,null,0,{"$f":"E82*H82","v":0},0,null,0,0,0,0,0,0]
["Total Fixed Costs",null,null,null,null,null,null,null,200.7590476239136,{"$f":"+SUM(J68:J82)","v":0},null,null,0,{"$f":"+SUM(N68:N82)","v":0},200.7590476239136,{"$f":"+SUM(P68:P82)","v":0},101383.31905007636,{"$f":"+SUM(R68:R82)","v":0}]
["Total Specified Costs",null,null,null,null,null,null,null,562.15953369224962,{"$f":"+J62+J83","v":0},null,null,0,{"$f":"+N62+N83","v":0},562.15953369224962,{"$f":"+P62+P83","v":0},283890.56451458612,{"$f":"+R62+R83","v":0}]
[]
["Returns Above Specified Costs",null,null,null,null,null,null,null,-52.159533692249681,{"$f":"+J13-J84","v":0},null,null,0,{"$f":"+N13-N84","v":0},-52.159533692249681,{"$f":"+P13-P84","v":0},-26340.564514586149,{"$f":"+R13-R84","v":0}]
[]
["    Breakeven Price to Cover Total Costs",null,null,null,null,null,5.6215953369224962,{"$f":"IF(E10=0,\"n/a\",(YTotExp-(YTotExp+YTotRet-J10))/E10)","v":"n/a"},"Bushel"]
[]
[null,null,null,"Example Breakeven Prices"]
[null,"Example","Example","To Cover",null,null,"To Cover"]
[null,"Yield","Yield","Variable",null,null,"Total"]
[null,"Percent","Bushel","Costs",null,null,"Costs"]
[null,0.75,75,4.8186731475778135,null,null,7.495460449229995]
[null,0.9,90,4.0155609563148449,null,null,6.2462170410249955]
[null,1,100,3.6140048606833601,null,null,5.6215953369224962]
[null,1.1000000000000001,110.00000000000001,3.2854589642575998,null,null,5.110541215384087]
[null,1.25,125,2.8912038885466882,null,null,4.4972762695379966]
[]
["  Developed by Extension Economists, Texas A&M AgriLife Extension Service, budgets@tamu.edu.  "]
[]
["Information presented is prepared solely as a general guide and not intended to recognize or predict the costs and returns from any one operation.  Brand names are mentioned only as examples and imply no endorsement."]

{"sheet":"IrrigatedSesame","index":11,"n_rows":93,"n_cols":18,"rows_kept":93,"cut":false,"hidden":false,"merged":[[80,3,80,8],[92,0,92,11],[0,0,0,11],[1,0,1,11],[2,0,2,11],[3,0,3,11]]}
["Projections for Planning Purposes Only -- Not to be Used without Updating"]
["2023 Estimated Costs and Returns per Acre"]
["Sesame - Conventional Till-12 Row, Irrigated, 1100 lb. Yield Goal"]
["Enter your name for this budget in the cell above."]
["Enter  Your Values in the cells highlighed in MAROON."]
[null,null,null,null,"Your Acres",null,null,null,null,null,null,null,null,null,null,null,null,"Your"]
[null,null,"Crop Acres",505,null,null,null,null,null,null,null,"Your",null,null,null,null,"Enterprise","Enterprise"]
[null,null,null,null,"Your",null,null,"Your","Cash","Your","Landlord","Landlord",null,"Your",null,"Your","Total","Total"]
["REVENUE",null,null,"Quantity","Quantity","Units","$/Unit","$/Unit","Total","Total","Share","Share","Landlord","Landlord","Tenant","Tenant","(505 acres)",{"$f":"\"(\" & E7 & \" acres)\"","v":"( acres)"}]
[null,"Sesame",null,1100,null,"Pound",0.32,null,352,{"$f":"E10*H10","v":0},0,null,0,{"$f":"J10*L10","v":0},352,{"$f":"+J10-N10","v":0},177760,{"$f":"+J10*E$7","v":0}]
[null,null,null,0,null,null,0,null,0,0,0,null,0,0,0,{"$f":"+J11-N11","v":0},0,0]
[null,null,null,0,null,null,0,null,0,0,0,null,0,0,0,0,0,0]
["Total Revenue",null,null,null,null,null,null,null,352,{"$f":"SUM(J10:J12)","v":0},null,null,0,{"$f":"SUM(N10:N12)","v":0},352,{"$f":"SUM(P10:P12)","v":0},177760,{"$f":"SUM(R10:R12)","v":0}]
[null,null,null,null,null,null,null,null,null,null,null,null,null,null,null,null,"Enterprise","Enterprise"]
["VARIABLE COSTS",null,null,"Quantity","Quantity","Units","$/Unit","$/Unit","Total","Total","Share","Share","Landlord","Landlord","Tenant","Tenant","Total","Total"]
["Production Costs"]
[null,"Herbicide",null,null,null,null,null,null,"$22.45"]
[null,"","Glyphosate (Generic)",2,null,"Quart",7.75,null,15.5,{"$f":"E18*H18","v":0},0,null,0,{"$f":"J18*L18","v":0},15.5,{"$f":"+J18-N18","v":0},7827.5,{"$f":"+J18*E$7","v":0}]
[null,"","Sesame PostEmerge Herbicide",8,null,"Ounce",0.86919999999999997,null,6.9535999999999998,0,0,null,0,0,6.9535999999999998,0,3511.5679999999998,0]
[null,"Miscellaneous",null,null,null,null,null,null,"$30.11"]
[null,"","Pickup Milage Charge",1,null,"Acre",4.1128,null,4.1128,0,0,null,0,0,4.1128,0,2076.9639999999999,0]
[null,"","Crop Insurance -Sesame",1,null,"Acre",26,null,26,0,0,null,0,0,26,0,13130,0]
[null,"Other Labor",null,null,null,null,null,null,"$1.36"]
[null,"","Hand Labor",0.08,null,"Hour",16.96,null,1.3568,0,0,null,0,0,1.3568,0,685.18399999999997,0]
[null,"Seed",null,null,null,null,null,null,"$12.72"]
[null,"","Sesame",3,null,"Pound",4.24,null,12.72,0,0,null,0,0,12.72,0,6423.6,0]
[null,null,null,0,null,null,0,null,0,0,0,null,0,0,0,0,0,0]
[null,null,null,0,null,null,0,null,0,0,0,null,0,0,0,0,0,0]
[null,null,null,0,null,null,0,null,0,{"$f":"E29*H29","v":0},0,null,0,{"$f":"J29*L29","v":0},0,{"$f":"+J29-N29","v":0},0,{"$f":"+J29*E$7","v":0}]
[null,"Irrigation",null,null,null,null,null,null,"$32.72"]
[null,null,"Energy Cost",6,null,"AcreInch",2.1,null,12.600000000000001,{"$f":"E31*H31","v":0},0,null,0,{"$f":"J31*L31","v":0},12.600000000000001,{"$f":"+J31-N31","v":0},6363.0000000000009,{"$f":"+J31*E$7","v":0}]
[null,null,"Irrigation Labor",1.1499999999999999,null,"Hour",17.5,null,20.125,0,0,null,0,0,20.125,0,10163.125,0]
[null,"Machinery Labor",null,null,null,null,null,null,"$7.4"]
[null,null,"Tractors/Self-Propelled",0.43,null,"Hour",17.21,null,7.4003000000000005,{"$f":"E34*H34","v":0},0,null,0,{"$f":"J34*L34","v":0},7.4003000000000005,{"$f":"+J34-N34","v":0},3737.1515000000004,{"$f":"+J34*E$7","v":0}]
[null,null,"Other Labor",0,null,"Hour",17.21,null,0,{"$f":"E35*H35","v":0},0,null,0,{"$f":"J35*L35","v":0},0,{"$f":"+J35-N35","v":0},0,{"$f":"+J35*E$7","v":0}]
[]
[null,"Diesel Fuel",null,null,null,null,null,null,"$11.27"]
[null,null,"Pickup/General Use Equipment",1,null,"Acre",0,null,0,{"$f":"E38*H38","v":0},0,null,0,{"$f":"J38*L38","v":0},0,{"$f":"+J38-N38","v":0},0,{"$f":"+J38*E$7","v":0}]
[null,null,"Tractors/Self-Propelled",5.03,null,"Gallon",2.2400000000000002,null,11.267200000000001,{"$f":"E39*H39","v":0},0,null,0,{"$f":"J39*L39","v":0},11.267200000000001,{"$f":"+J39-N39","v":0},5689.9360000000006,{"$f":"+J39*E$7","v":0}]
[]
[null,"Gasoline",null,null,null,null,null,null,"$0"]
[null,null,"Pickup/General Use Equipment",1,null,"Acre",0,null,0,{"$f":"E42*H42","v":0},0,null,0,{"$f":"J42*L42","v":0},0,{"$f":"+J42-N42","v":0},0,{"$f":"+J42*E$7","v":0}]
[null,null,"Tractors/Self-Propelled",0,null,"Gallon",2.09,null,0,{"$f":"E43*H43","v":0},0,null,0,{"$f":"J43*L43","v":0},0,{"$f":"+J43-N43","v":0},0,{"$f":"+J43*E$7","v":0}]
[]
[null,"Repairs & Maintenance",null,null,null,null,null,null,"$52.84"]
[null,null,"Pickup/General Use Equipment",1,null,"Acre",0,null,0,{"$f":"E46*H46","v":0},0,null,0,{"$f":"J46*L46","v":0},0,{"$f":"+J46-N46","v":0},0,{"$f":"+J46*E$7","v":0}]
[null,null,"Irrigation Equipment",1,null,"Acre",25.082508250825082,null,25.082508250825082,0,0,null,0,0,25.082508250825082,0,12666.666666666666,0]
[null,null,"Tractors/Self-Propelled",1,null,"Acre",19.448711379324042,null,19.448711379324042,0,0,null,0,0,19.448711379324042,0,9821.5992465586405,0]
[null,null,"Implements",1,null,"Acre",8.3047317138940482,null,8.3047317138940482,0,0,null,0,0,8.3047317138940482,0,4193.8895155164946,0]
[null,null,null,null,null,null,null,null,0,0,0,null,0,0,0,0,0,0]
[null,null,null,null,null,null,null,null,0,0,0,null,0,0,0,0,0,0]
[null,"Interest on Credit Line",null,null,null,null,0.08,null,7.003729890477385,{"$f":"+SUM(J17:J51)/2*H52","v":0},null,null,0,{"$f":"+SUM(N17:N51)/2*L52","v":0},7.003729890477385,{"$f":"+SUM(P17:P51)/2*L52","v":0},3536.8835946910795,{"$f":"+J52*E$7","v":0}]
["Total Variable Costs",null,null,null,null,null,null,null,177.87538123452057,{"$f":"SUM(J18:J52)","v":0},null,null,0,{"$f":"SUM(N18:N52)","v":0},177.87538123452057,{"$f":"SUM(P18:P52)","v":0},89827.067523432896,{"$f":"SUM(R18:R52)","v":0}]
["Planned Returns Above Variable Costs:",null,null,null,null,null,null,null,174.12461876547943,{"$f":"+J13-J53","v":0},null,null,0,{"$f":"+N13-N53","v":0},174.12461876547943,{"$f":"+P13-P53","v":0},87932.932476567104,{"$f":"+R13-R53","v":0}]
[null,"Breakeven Price to Cover Variable Costs",null,null,null,null,0.16170489203138233,{"$f":"IF(E10=0,\"n/a\",(YVarExp-(YTotExp+YTotRet-J10))/E10)","v":"n/a"},"Pound"]
[null,null,null,null,null,null,null,null,null,null,null,null,null,null,null,null,"Enterprise","Enterprise"]
["FIXED COSTS",null,null,"Quantity","Quantity","Units","$/Unit","$/Unit","Total","Total","Share","Share","Landlord","Landlord","Tenant","Tenant","Total","Total"]
[null,"Machinery Depreciation",null,null,null,null,null,null,"$58.44"]
[null,null,"Irrigation Equipment",1,null,"Acre",28.184818481848186,null,28.184818481848186,{"$f":"E59*H59","v":0},0,null,0,{"$f":"J59*L59","v":0},28.184818481848186,{"$f":"+J59-N59","v":0},14233.333333333334,{"$f":"+J59*E$7","v":0}]
[null,null,"Tractors/Self-Propelled",1,null,"Acre",20.475902517411647,null,20.475902517411647,0,0,null,0,{"$f":"J60*L60","v":0},20.475902517411647,0,10340.330771292882,0]
[null,null,"Implements",1,null,"Acre",9.777046928127767,null,9.777046928127767,0,0,null,0,{"$f":"J61*L61","v":0},9.777046928127767,0,4937.4086987045221,0]
[null,"Equipment Investment",null,null,null,null,null,null,"$41.9"]
[null,null,"Irrigation Equipment",293.56435643564356,null,"Dollars",0.08,null,23.485148514851485,{"$f":"E63*H63","v":0},0,null,0,{"$f":"J63*L63","v":0},23.485148514851485,{"$f":"+J63-N63","v":0},11860,{"$f":"+J63*E$7","v":0}]
[null,null,"Tractors/Self-Propelled",156.87222383768028,null,"Dollars",0.08,null,12.549777907014423,0,0,null,0,{"$f":"J64*L64","v":0},12.549777907014423,0,6337.6378430422837,0]
[null,null,"Implements",73.264552256627567,null,"Dollars",0.08,null,5.8611641805302055,0,0,null,0,{"$f":"J65*L65","v":0},5.8611641805302055,0,2959.8879111677538,0]
[null,"Salaried Labor",null,1,null,"Acre",0,null,0,0,0,null,0,{"$f":"J66*L66","v":0},0,{"$f":"+J66-N66","v":0},0,{"$f":"+J66*E$7","v":0}]
[null,"Management Fee, Owner/Operator Labor",null,1,null,"Acre",17.600000000000001,null,17.600000000000001,0,0,null,0,0,17.600000000000001,0,8888,0]
[null,"Allocated Establishment Cost",null,1,null,"Acre",0,null,0,0,0,null,0,0,0,0,0,0]
[null,"LCB - Land Charge",null,1,null,"Acre",70,null,70,0,0,null,0,0,70,0,35350,0]
[null,"Property Taxes",null,1,null,"Acre",0,null,0,0,0,null,0,0,0,0,0,0]
[null,"Whole Farm Insurance",null,1,null,"Acre",0,null,0,0,0,null,0,0,0,0,0,0]
[null,null,null,1,null,null,0,null,0,0,0,null,0,0,0,0,0,0]
[null,null,null,1,null,null,0,null,0,{"$f":"E73*H73","v":0},0,null,0,0,0,0,0,0]
["Total Fixed Costs",null,null,null,null,null,null,null,187.93385852978372,{"$f":"+SUM(J59:J73)","v":0},null,null,0,{"$f":"+SUM(N59:N73)","v":0},187.93385852978372,{"$f":"+SUM(P59:P73)","v":0},94906.598557540769,{"$f":"+SUM(R59:R73)","v":0}]
["Total Specified Costs",null,null,null,null,null,null,null,365.80923976430427,{"$f":"+J53+J74","v":0},null,null,0,{"$f":"+N53+N74","v":0},365.80923976430427,{"$f":"+P53+P74","v":0},184733.66608097366,{"$f":"+R53+R74","v":0}]
[]
["Returns Above Specified Costs",null,null,null,null,null,null,null,-13.809239764304266,{"$f":"+J13-J75","v":0},null,null,0,{"$f":"+N13-N75","v":0},-13.809239764304266,{"$f":"+P13-P75","v":0},-6973.6660809736641,{"$f":"+R13-R75","v":0}]
[]
["    Breakeven Price to Cover Total Costs",null,null,null,null,null,0.33255385433118567,{"$f":"IF(E10=0,\"n/a\",(YTotExp-(YTotExp+YTotRet-J10))/E10)","v":"n/a"},"Pound"]
[]
[null,null,null,"Example Breakeven Prices"]
[null,"Example","Example","To Cover",null,null,"To Cover"]
[null,"Yield","Yield","Variable",null,null,"Total"]
[null,"Percent","Pound","Costs",null,null,"Costs"]
[null,0.75,825,0.21560652270850977,null,null,0.44340513910824758]
[null,0.9,990,0.17967210225709149,null,null,0.36950428259020635]
[null,1,1100,0.16170489203138233,null,null,0.33255385433118567]
[null,1.1000000000000001,1210,0.14700444730125667,null,null,0.30232168575562335]
[null,1.25,1375,0.12936391362510588,null,null,0.26604308346494854]
[]
["  Developed by Extension Economists, Texas A&M AgriLife Extension Service, budgets@tamu.edu.  "]
[]
["Information presented is prepared solely as a general guide and not intended to recognize or predict the costs and returns from any one operation.  Brand names are mentioned only as examples and imply no endorsement."]

{"sheet":"IrrigatedWheatLCB","index":12,"n_rows":100,"n_cols":18,"rows_kept":100,"cut":false,"hidden":false,"merged":[[87,3,87,8],[99,0,99,11],[0,0,0,11],[1,0,1,11],[2,0,2,11],[3,0,3,11]]}
["Projections for Planning Purposes Only -- Not to be Used without Updating"]
["2023 Estimated Costs and Returns per Acre"]
["Hard Red Spring Wheat, Irrigated, 60 bu. Yield Goal"]
["Enter your name for this budget in the cell above."]
["Enter  Your Values in the cells highlighed in MAROON."]
[null,null,null,null,"Your Acres",null,null,null,null,null,null,null,null,null,null,null,null,"Your"]
[null,null,"Crop Acres",505,null,null,null,null,null,null,null,"Your",null,null,null,null,"Enterprise","Enterprise"]
[null,null,null,null,"Your",null,null,"Your","Cash","Your","Landlord","Landlord",null,"Your",null,"Your","Total","Total"]
["REVENUE",null,null,"Quantity","Quantity","Units","$/Unit","$/Unit","Total","Total","Share","Share","Landlord","Landlord","Tenant","Tenant","(505 acres)",{"$f":"\"(\" & E7 & \" acres)\"","v":"( acres)"}]
[null,"Hard Red Spring Wheat",null,60,null,"Bushel",8.25,null,495,{"$f":"E10*H10","v":0},0,null,0,{"$f":"J10*L10","v":0},495,{"$f":"+J10-N10","v":0},249975,{"$f":"+J10*E$7","v":0}]
[null,null,null,0,null,null,0,null,0,0,0,null,0,0,0,{"$f":"+J11-N11","v":0},0,0]
[null,null,null,0,null,null,0,null,0,0,0,null,0,0,0,0,0,0]
["Total Revenue",null,null,null,null,null,null,null,495,{"$f":"SUM(J10:J12)","v":0},null,null,0,{"$f":"SUM(N10:N12)","v":0},495,{"$f":"SUM(P10:P12)","v":0},249975,{"$f":"SUM(R10:R12)","v":0}]
[null,null,null,null,null,null,null,null,null,null,null,null,null,null,null,null,"Enterprise","Enterprise"]
["VARIABLE COSTS",null,null,"Quantity","Quantity","Units","$/Unit","$/Unit","Total","Total","Share","Share","Landlord","Landlord","Tenant","Tenant","Total","Total"]
["Production Costs"]
[null,"Seed",null,null,null,null,null,null,"$37.21"]
[null,"","HRS Wheat Seed",90,null,"Pound",0.41340000000000005,null,37.206000000000003,{"$f":"E18*H18","v":0},0,null,0,{"$f":"J18*L18","v":0},37.206000000000003,{"$f":"+J18-N18","v":0},18789.030000000002,{"$f":"+J18*E$7","v":0}]
[null,"Fertilizer",null,null,null,null,null,null,"$72"]
[null,"","24-8-0",0.125,null,"Ton",576,null,72,0,0,null,0,0,72,0,36360,0]
[null,"Custom",null,null,null,null,null,null,"$16.06"]
[null,"","Fertilizer Application",1,null,"Ounce",0.159,null,0.159,0,0,null,0,0,0.159,0,80.295000000000002,0]
[null,"","Custom Haul - Wheat",60,null,"Bushel",0.26500000000000001,null,15.9,0,0,null,0,0,15.9,0,8029.5,0]
[null,"Herbicide",null,null,null,null,null,null,"$12.86"]
[null,"","Glyphosate (Generic)",1,null,"Quart",7.75,null,7.75,0,0,null,0,0,7.75,0,3913.75,0]
[null,"","Affinity",0.5,null,"Ounce",10.210000000000001,null,5.1050000000000004,0,0,null,0,0,5.1050000000000004,0,2578.0250000000001,0]
[null,"Other Labor",null,null,null,null,null,null,"$0.31"]
[null,"","Hand Labor",1.7999999999999999E-2,null,"Hour",16.96,null,0.30528,0,0,null,0,0,0.30528,0,154.16640000000001,0]
[null,"Miscellaneous",null,null,null,null,null,null,"$4.29"]
[null,"","Pickup Milage Charge",1,null,"Acre",4.1128,null,4.1128,0,0,null,0,0,4.1128,0,2076.9639999999999,0]
[null,"","Crop Insurance - Irr HRS Wheat",1,null,"Thousand",0.18020000000000003,null,0.18020000000000003,0,0,null,0,0,0.18020000000000003,0,91.001000000000019,0]
[null,"Insecticide",null,null,null,null,null,null,"$11.88"]
[null,"","Wheat Insect Control",1.5,null,"Pint",7.9182000000000006,null,11.877300000000002,0,0,null,0,0,11.877300000000002,0,5998.0365000000011,0]
[null,null,null,0,null,null,0,null,0,0,0,null,0,0,0,0,0,0]
[null,null,null,0,null,null,0,null,0,0,0,null,0,0,0,0,0,0]
[null,null,null,0,null,null,0,null,0,{"$f":"E36*H36","v":0},0,null,0,{"$f":"J36*L36","v":0},0,{"$f":"+J36-N36","v":0},0,{"$f":"+J36*E$7","v":0}]
[null,"Irrigation",null,null,null,null,null,null,"$47.25"]
[null,null,"Energy Cost",10,null,"AcreInch",2.1,null,21,{"$f":"E38*H38","v":0},0,null,0,{"$f":"J38*L38","v":0},21,{"$f":"+J38-N38","v":0},10605,{"$f":"+J38*E$7","v":0}]
[null,null,"Irrigation Labor",1.5,null,"Hour",17.5,null,26.25,0,0,null,0,0,26.25,0,13256.25,0]
[null,"Machinery Labor",null,null,null,null,null,null,"$5.34"]
[null,null,"Tractors/Self-Propelled",0.31,null,"Hour",17.21,null,5.3351000000000006,{"$f":"E41*H41","v":0},0,null,0,{"$f":"J41*L41","v":0},5.3351000000000006,{"$f":"+J41-N41","v":0},2694.2255000000005,{"$f":"+J41*E$7","v":0}]
[null,null,"Other Labor",0,null,"Hour",17.21,null,0,{"$f":"E42*H42","v":0},0,null,0,{"$f":"J42*L42","v":0},0,{"$f":"+J42-N42","v":0},0,{"$f":"+J42*E$7","v":0}]
[]
[null,"Diesel Fuel",null,null,null,null,null,null,"$9.39"]
[null,null,"Pickup/General Use Equipment",1,null,"Acre",0,null,0,{"$f":"E45*H45","v":0},0,null,0,{"$f":"J45*L45","v":0},0,{"$f":"+J45-N45","v":0},0,{"$f":"+J45*E$7","v":0}]
[null,null,"Tractors/Self-Propelled",4.1900000000000004,null,"Gallon",2.2400000000000002,null,9.3856000000000019,{"$f":"E46*H46","v":0},0,null,0,{"$f":"J46*L46","v":0},9.3856000000000019,{"$f":"+J46-N46","v":0},4739.728000000001,{"$f":"+J46*E$7","v":0}]
[]
[null,"Gasoline",null,null,null,null,null,null,"$0"]
[null,null,"Pickup/General Use Equipment",1,null,"Acre",0,null,0,{"$f":"E49*H49","v":0},0,null,0,{"$f":"J49*L49","v":0},0,{"$f":"+J49-N49","v":0},0,{"$f":"+J49*E$7","v":0}]
[null,null,"Tractors/Self-Propelled",0,null,"Gallon",2.09,null,0,{"$f":"E50*H50","v":0},0,null,0,{"$f":"J50*L50","v":0},0,{"$f":"+J50-N50","v":0},0,{"$f":"+J50*E$7","v":0}]
[]
[null,"Repairs & Maintenance",null,null,null,null,null,null,"$58.78"]
[null,null,"Pickup/General Use Equipment",1,null,"Acre",0,null,0,{"$f":"E53*H53","v":0},0,null,0,{"$f":"J53*L53","v":0},0,{"$f":"+J53-N53","v":0},0,{"$f":"+J53*E$7","v":0}]
[null,null,"Irrigation Equipment",1,null,"Acre",25.082508250825082,null,25.082508250825082,0,0,null,0,0,25.082508250825082,0,12666.666666666666,0]
[null,null,"Tractors/Self-Propelled",1,null,"Acre",28.184142820519909,null,28.184142820519909,0,0,null,0,0,28.184142820519909,0,14232.992124362554,0]
[null,null,"Implements",1,null,"Acre",5.5135569288516493,null,5.5135569288516493,0,0,null,0,0,5.5135569288516493,0,2784.3462490700831,0]
[null,null,null,null,null,null,null,null,0,0,0,null,0,0,0,0,0,0]
[null,null,null,null,null,null,null,null,0,0,0,null,0,0,0,0,0,0]
[null,"Interest on Credit Line",null,null,null,null,0.08,null,8.4829409147223238,{"$f":"+SUM(J17:J58)/2*H59","v":0},null,null,0,{"$f":"+SUM(N17:N58)/2*L59","v":0},8.4829409147223238,{"$f":"+SUM(P17:P58)/2*L59","v":0},4283.8851619347734,{"$f":"+J59*E$7","v":0}]
["Total Variable Costs",null,null,null,null,null,null,null,283.82942891491899,{"$f":"SUM(J18:J59)","v":0},null,null,0,{"$f":"SUM(N18:N59)","v":0},283.82942891491899,{"$f":"SUM(P18:P59)","v":0},143333.86160203407,{"$f":"SUM(R18:R59)","v":0}]
["Planned Returns Above Variable Costs:",null,null,null,null,null,null,null,211.17057108508101,{"$f":"+J13-J60","v":0},null,null,0,{"$f":"+N13-N60","v":0},211.17057108508101,{"$f":"+P13-P60","v":0},106641.13839796593,{"$f":"+R13-R60","v":0}]
[null,"Breakeven Price to Cover Variable Costs",null,null,null,null,4.7304904819153162,{"$f":"IF(E10=0,\"n/a\",(YVarExp-(YTotExp+YTotRet-J10))/E10)","v":"n/a"},"Bushel"]
[null,null,null,null,null,null,null,null,null,null,null,null,null,null,null,null,"Enterprise","Enterprise"]
["FIXED COSTS",null,null,"Quantity","Quantity","Units","$/Unit","$/Unit","Total","Total","Share","Share","Landlord","Landlord","Tenant","Tenant","Total","Total"]
[null,"Machinery Depreciation",null,null,null,null,null,null,"$61.16"]
[null,null,"Irrigation Equipment",1,null,"Acre",28.184818481848186,null,28.184818481848186,{"$f":"E66*H66","v":0},0,null,0,{"$f":"J66*L66","v":0},28.184818481848186,{"$f":"+J66-N66","v":0},14233.333333333334,{"$f":"+J66*E$7","v":0}]
[null,null,"Tractors/Self-Propelled",1,null,"Acre",26.271351324382984,null,26.271351324382984,0,0,null,0,{"$f":"J67*L67","v":0},26.271351324382984,0,13267.032418813407,0]
[null,null,"Implements",1,null,"Acre",6.7072583134400521,null,6.7072583134400521,0,0,null,0,{"$f":"J68*L68","v":0},6.7072583134400521,0,3387.1654482872264,0]
[null,"Equipment Investment",null,null,null,null,null,null,"$43.39"]
[null,null,"Irrigation Equipment",293.56435643564356,null,"Dollars",0.08,null,23.485148514851485,{"$f":"E70*H70","v":0},0,null,0,{"$f":"J70*L70","v":0},23.485148514851485,{"$f":"+J70-N70","v":0},11860,{"$f":"+J70*E$7","v":0}]
[null,null,"Tractors/Self-Propelled",196.69410236002003,null,"Dollars",0.08,null,15.735528188801602,0,0,null,0,{"$f":"J71*L71","v":0},15.735528188801602,0,7946.4417353448089,0]
[null,null,"Implements",52.088974636540151,null,"Dollars",0.08,null,4.1671179709232122,0,0,null,0,{"$f":"J72*L72","v":0},4.1671179709232122,0,2104.394575316222,0]
[null,"Salaried Labor",null,1,null,"Acre",0,null,0,0,0,null,0,{"$f":"J73*L73","v":0},0,{"$f":"+J73-N73","v":0},0,{"$f":"+J73*E$7","v":0}]
[null,"Management Fee, Owner/Operator Labor",null,1,null,"Acre",24.75,null,24.75,0,0,null,0,0,24.75,0,12498.75,0]
[null,"Allocated Establishment Cost",null,1,null,"Acre",0,null,0,0,0,null,0,0,0,0,0,0]
[null,"LCB - Land Charge",null,1,null,"Acre",70,null,70,0,0,null,0,0,70,0,35350,0]
[null,"Property Taxes",null,1,null,"Acre",0,null,0,0,0,null,0,0,0,0,0,0]
[null,"Whole Farm Insurance",null,1,null,"Acre",0,null,0,0,0,null,0,0,0,0,0,0]
[null,null,null,1,null,null,0,null,0,0,0,null,0,0,0,0,0,0]
[null,null,null,1,null,null,0,null,0,{"$f":"E80*H80","v":0},0,null,0,0,0,0,0,0]
["Total Fixed Costs",null,null,null,null,null,null,null,199.30122279424754,{"$f":"+SUM(J66:J80)","v":0},null,null,0,{"$f":"+SUM(N66:N80)","v":0},199.30122279424754,{"$f":"+SUM(P66:P80)","v":0},100647.11751109498,{"$f":"+SUM(R66:R80)","v":0}]
["Total Specified Costs",null,null,null,null,null,null,null,483.1306517091665,{"$f":"+J60+J81","v":0},null,null,0,{"$f":"+N60+N81","v":0},483.1306517091665,{"$f":"+P60+P81","v":0},243980.97911312905,{"$f":"+R60+R81","v":0}]
[]
["Returns Above Specified Costs",null,null,null,null,null,null,null,11.8693482908335,{"$f":"+J13-J82","v":0},null,null,0,{"$f":"+N13-N82","v":0},11.8693482908335,{"$f":"+P13-P82","v":0},5994.0208868709451,{"$f":"+R13-R82","v":0}]
[]
["    Breakeven Price to Cover Total Costs",null,null,null,null,null,8.0521775284861086,{"$f":"IF(E10=0,\"n/a\",(YTotExp-(YTotExp+YTotRet-J10))/E10)","v":"n/a"},"Bushel"]
[]
[null,null,null,"Example Breakeven Prices"]
[null,"Example","Example","To Cover",null,null,"To Cover"]
[null,"Yield","Yield","Variable",null,null,"Total"]
[null,"Percent","Bushel","Costs",null,null,"Costs"]
[null,0.75,45,6.3073206425537558,null,null,10.736236704648144]
[null,0.9,54,5.2561005354614627,null,null,8.946863920540121]
[null,1,60,4.7304904819153162,null,null,8.0521775284861086]
[null,1.1000000000000001,66,4.3004458926502878,null,null,7.3201613895328261]
[null,1.25,75,3.7843923855322532,null,null,6.4417420227888869]
[]
["  Developed by Extension Economists, Texas A&M AgriLife Extension Service, budgets@tamu.edu.  "]
[]
["Information presented is prepared solely as a general guide and not intended to recognize or predict the costs and returns from any one operation.  Brand names are mentioned only as examples and imply no endorsement."]

{"sheet":"CottonUCB","index":13,"n_rows":105,"n_cols":18,"rows_kept":105,"cut":false,"hidden":false,"merged":[[92,3,92,8],[104,0,104,11],[0,0,0,11],[1,0,1,11],[2,0,2,11],[3,0,3,11]]}
["Projections for Planning Purposes Only -- Not to be Used without Updating"]
["2023 Estimated Costs and Returns per Acre"]
["Cotton - GMO Seed, Conv. Till-12 Row, Dryland, 900 lb. Yield Goal - Upper Coast"]
["Enter your name for this budget in the cell above."]
["Enter  Your Values in the cells highlighed in MAROON."]
[null,null,null,null,"Your Acres",null,null,null,null,null,null,null,null,null,null,null,null,"Your"]
[null,null,"Crop Acres",500,null,null,null,null,null,null,null,"Your",null,null,null,null,"Enterprise","Enterprise"]
[null,null,null,null,"Your",null,null,"Your","Cash","Your","Landlord","Landlord",null,"Your",null,"Your","Total","Total"]
["REVENUE",null,null,"Quantity","Quantity","Units","$/Unit","$/Unit","Total","Total","Share","Share","Landlord","Landlord","Tenant","Tenant","(500 acres)",{"$f":"\"(\" & E7 & \" acres)\"","v":"( acres)"}]
[null,"Cotton Lint",null,900,null,"Pound",0.9,null,810,{"$f":"E10*H10","v":0},0,null,0,{"$f":"J10*L10","v":0},810,{"$f":"+J10-N10","v":0},405000,{"$f":"+J10*E$7","v":0}]
[null,"Cottonseed",null,0.621,null,"Ton",360,null,223.56,0,0,null,0,0,223.56,{"$f":"+J11-N11","v":0},111780,0]
[null,null,null,0,null,null,0,null,0,0,0,null,0,0,0,0,0,0]
[null,null,null,0,null,null,0,null,0,0,0,null,0,0,0,0,0,0]
["Total Revenue",null,null,null,null,null,null,null,1033.56,{"$f":"SUM(J10:J13)","v":0},null,null,0,{"$f":"SUM(N10:N13)","v":0},1033.56,{"$f":"SUM(P10:P13)","v":0},516780,{"$f":"SUM(R10:R13)","v":0}]
[null,null,null,null,null,null,null,null,null,null,null,null,null,null,null,null,"Enterprise","Enterprise"]
["VARIABLE COSTS",null,null,"Quantity","Quantity","Units","$/Unit","$/Unit","Total","Total","Share","Share","Landlord","Landlord","Tenant","Tenant","Total","Total"]
["Production Costs"]
[null,"Herbicide",null,null,null,null,null,null,"$57.18"]
[null,"","Glyphosate (Generic)",2,null,"Quart",7.75,null,15.5,{"$f":"E19*H19","v":0},0,null,0,{"$f":"J19*L19","v":0},15.5,{"$f":"+J19-N19","v":0},7750,{"$f":"+J19*E$7","v":0}]
[null,"","Cotton Early Season Herbicide",2,null,"Quart",17.214399999999998,null,34.428799999999995,0,0,null,0,0,34.428799999999995,0,17214.399999999998,0]
[null,"","2, 4D Amine`",2,null,"Pint",3.625,null,7.25,0,0,null,0,0,7.25,0,3625,0]
[null,"Seed",null,null,null,null,null,null,"$78.4"]
[null,"","Cotton Seed - B2RF",40,null,"Thousand",1.96,null,78.400000000000006,0,0,null,0,0,78.400000000000006,0,39200,0]
[null,"","Tech Fee - B2RF",1,null,"Acre",0,null,0,0,0,null,0,0,0,0,0,0]
[null,"Fertilizer",null,null,null,null,null,null,"$73.34"]
[null,"","24-8-0`",0.1875,null,"Ton",391.14000000000004,null,73.338750000000005,0,0,null,0,0,73.338750000000005,0,36669.375,0]
[null,"Custom",null,null,null,null,null,null,"$243.27"]
[null,"","Pick and Module",900,null,"Pound",0.13780000000000001,null,124.02000000000001,0,0,null,0,0,124.02000000000001,0,62010.000000000007,0]
[null,"","Ginning - Picker",900,null,"Pound",0.13250000000000001,null,119.25,0,0,null,0,0,119.25,0,59625,0]
[null,"Miscellaneous",null,null,null,null,null,null,"$31.79"]
[null,"","Crop Insurance -Cotton UC",1,null,"Acre",21,null,21,0,0,null,0,0,21,0,10500,0]
[null,"","Pickup Milage Charge",1,null,"Acre",4.1128,null,4.1128,0,0,null,0,0,4.1128,0,2056.4,0]
[null,"","Boll Weevil Program UC",1.8,null,"Bale",3.71,null,6.6779999999999999,0,0,null,0,0,6.6779999999999999,0,3339,0]
[null,"Insecticide",null,null,null,null,null,null,"$5.84"]
[null,"","Fleahopper Control UC",1.6,null,"Ounce",1.4,null,2.2399999999999998,0,0,null,0,0,2.2399999999999998,0,1119.9999999999998,0]
[null,"","Stinkbug Control",8,null,"Ounce",0.45,null,3.6,0,0,null,0,0,3.6,0,1800,0]
[null,"Other Chemicals",null,null,null,null,null,null,"$7.04"]
[null,"","Surfactant",0.2,null,"Pint",1.4734,null,0.29468,0,0,null,0,0,0.29468,0,147.34,0]
[null,"","Generic PIX",32,null,"Ounce",6.3600000000000004E-2,null,2.0352000000000001,0,0,null,0,0,2.0352000000000001,0,1017.6,0]
[null,"","Defoliants - Picker",4,null,"Ounce",1.1130000000000002,null,4.4520000000000008,0,0,null,0,0,4.4520000000000008,0,2226.0000000000005,0]
[null,"","Ethephon",1.6,null,"Ounce",0.159,null,0.25440000000000002,0,0,null,0,0,0.25440000000000002,0,127.2,0]
[null,"Other Labor",null,null,null,null,null,null,"$7.8"]
[null,"","Hand Labor",0.46,null,"Hour",16.96,null,7.8016000000000005,0,0,null,0,0,7.8016000000000005,0,3900.8,0]
[null,null,null,0,null,null,0,null,0,0,0,null,0,0,0,0,0,0]
[null,null,null,0,null,null,0,null,0,0,0,null,0,0,0,0,0,0]
[null,null,null,0,null,null,0,null,0,{"$f":"E46*H46","v":0},0,null,0,{"$f":"J46*L46","v":0},0,{"$f":"+J46-N46","v":0},0,{"$f":"+J46*E$7","v":0}]
[null,"Machinery Labor",null,null,null,null,null,null,"$6.2"]
[null,null,"Tractors/Self-Propelled",0.36,null,"Hour",17.21,null,6.1955999999999998,{"$f":"E48*H48","v":0},0,null,0,{"$f":"J48*L48","v":0},6.1955999999999998,{"$f":"+J48-N48","v":0},3097.7999999999997,{"$f":"+J48*E$7","v":0}]
[null,null,"Other Labor",0,null,"Hour",17.21,null,0,{"$f":"E49*H49","v":0},0,null,0,{"$f":"J49*L49","v":0},0,{"$f":"+J49-N49","v":0},0,{"$f":"+J49*E$7","v":0}]
[]
[null,"Diesel Fuel",null,null,null,null,null,null,"$8.85"]
[null,null,"Pickup/General Use Equipment",1,null,"Acre",0,null,0,{"$f":"E52*H52","v":0},0,null,0,{"$f":"J52*L52","v":0},0,{"$f":"+J52-N52","v":0},0,{"$f":"+J52*E$7","v":0}]
[null,null,"Tractors/Self-Propelled",3.95,null,"Gallon",2.2400000000000002,null,8.8480000000000008,{"$f":"E53*H53","v":0},0,null,0,{"$f":"J53*L53","v":0},8.8480000000000008,{"$f":"+J53-N53","v":0},4424,{"$f":"+J53*E$7","v":0}]
[]
[null,"Gasoline",null,null,null,null,null,null,"$0"]
[null,null,"Pickup/General Use Equipment",1,null,"Acre",0,null,0,{"$f":"E56*H56","v":0},0,null,0,{"$f":"J56*L56","v":0},0,{"$f":"+J56-N56","v":0},0,{"$f":"+J56*E$7","v":0}]
[null,null,"Tractors/Self-Propelled",0,null,"Gallon",2.09,null,0,{"$f":"E57*H57","v":0},0,null,0,{"$f":"J57*L57","v":0},0,{"$f":"+J57-N57","v":0},0,{"$f":"+J57*E$7","v":0}]
[]
[null,"Repairs & Maintenance",null,null,null,null,null,null,"$17.51"]
[null,null,"Pickup/General Use Equipment",1,null,"Acre",0,null,0,{"$f":"E60*H60","v":0},0,null,0,{"$f":"J60*L60","v":0},0,{"$f":"+J60-N60","v":0},0,{"$f":"+J60*E$7","v":0}]
[null,null,"Irrigation Equipment",1,null,"Acre",0,null,0,0,0,null,0,0,0,0,0,0]
[null,null,"Tractors/Self-Propelled",1,null,"Acre",10.926679380939394,null,10.926679380939394,0,0,null,0,0,10.926679380939394,0,5463.3396904696965,0]
[null,null,"Implements",1,null,"Acre",6.5845664000830428,null,6.5845664000830428,0,0,null,0,0,6.5845664000830428,0,3292.2832000415215,0]
[null,null,null,null,null,null,null,null,0,0,0,null,0,0,0,0,0,0]
[null,null,null,null,null,null,null,null,0,0,0,null,0,0,0,0,0,0]
[null,"Interest on Credit Line",null,null,null,null,0.08,null,18.846440780528102,{"$f":"+SUM(J18:J65)/2*H66","v":0},null,null,0,{"$f":"+SUM(N18:N65)/2*L66","v":0},18.846440780528102,{"$f":"+SUM(P18:P65)/2*L66","v":0},9423.2203902640504,{"$f":"+J66*E$7","v":0}]
["Total Variable Costs",null,null,null,null,null,null,null,556.05751656155064,{"$f":"SUM(J19:J66)","v":0},null,null,0,{"$f":"SUM(N19:N66)","v":0},556.05751656155064,{"$f":"SUM(P19:P66)","v":0},278028.75828077522,{"$f":"SUM(R19:R66)","v":0}]
["Planned Returns Above Variable Costs:",null,null,null,null,null,null,null,477.5024834384493,{"$f":"+J14-J67","v":0},null,null,0,{"$f":"+N14-N67","v":0},477.5024834384493,{"$f":"+P14-P67","v":0},238751.24171922478,{"$f":"+R14-R67","v":0}]
[null,"Breakeven Price to Cover Variable Costs",null,null,null,null,0.36944168506838959,{"$f":"IF(E10=0,\"n/a\",(YVarExp-(YTotExp+YTotRet-J10))/E10)","v":"n/a"},"Pound"]
[null,null,null,null,null,null,null,null,null,null,null,null,null,null,null,null,"Enterprise","Enterprise"]
["FIXED COSTS",null,null,"Quantity","Quantity","Units","$/Unit","$/Unit","Total","Total","Share","Share","Landlord","Landlord","Tenant","Tenant","Total","Total"]
[null,"Machinery Depreciation",null,null,null,null,null,null,"$22.58"]
[null,null,"Tractors/Self-Propelled",1,null,"Acre",14.12764375098136,null,14.12764375098136,{"$f":"E73*H73","v":0},0,null,0,{"$f":"J73*L73","v":0},14.12764375098136,{"$f":"+J73-N73","v":0},7063.8218754906802,{"$f":"+J73*E$7","v":0}]
[null,null,"Implements",1,null,"Acre",8.453802247174492,null,8.453802247174492,0,0,null,0,{"$f":"J74*L74","v":0},8.453802247174492,0,4226.9011235872458,0]
[null,"Equipment Investment",null,null,null,null,null,null,"$12.04"]
[null,null,"Tractors/Self-Propelled",107.19984682179152,null,"Dollars",0.08,null,8.5759877457433227,{"$f":"E76*H76","v":0},0,null,0,{"$f":"J76*L76","v":0},8.5759877457433227,{"$f":"+J76-N76","v":0},4287.9938728716616,{"$f":"+J76*E$7","v":0}]
[null,null,"Implements",43.285166917439838,null,"Dollars",0.08,null,3.462813353395187,0,0,null,0,{"$f":"J77*L77","v":0},3.462813353395187,0,1731.4066766975934,0]
[null,"Salaried Labor",null,1,null,"Acre",0,null,0,0,0,null,0,{"$f":"J78*L78","v":0},0,{"$f":"+J78-N78","v":0},0,{"$f":"+J78*E$7","v":0}]
[null,"Management Fee, Owner/Operator Labor",null,1,null,"Acre",51.677999999999997,null,51.677999999999997,0,0,null,0,0,51.677999999999997,0,25839,0]
[null,"Allocated Establishment Cost",null,1,null,"Acre",0,null,0,0,0,null,0,0,0,0,0,0]
[null,"UCB - Land Charge",null,1,null,"Acre",85,null,85,0,0,null,0,0,85,0,42500,0]
[null,"Property Taxes",null,1,null,"Acre",0,null,0,0,0,null,0,0,0,0,0,0]
[null,"Whole Farm Insurance",null,1,null,"Acre",0,null,0,0,0,null,0,0,0,0,0,0]
[null,null,null,1,null,null,0,null,0,0,0,null,0,0,0,0,0,0]
[null,null,null,1,null,null,0,null,0,{"$f":"E85*H85","v":0},0,null,0,0,0,0,0,0]
["Total Fixed Costs",null,null,null,null,null,null,null,171.29824709729436,{"$f":"+SUM(J73:J85)","v":0},null,null,0,{"$f":"+SUM(N73:N85)","v":0},171.29824709729436,{"$f":"+SUM(P73:P85)","v":0},85649.123548647185,{"$f":"+SUM(R73:R85)","v":0}]
["Total Specified Costs",null,null,null,null,null,null,null,727.35576365884504,{"$f":"+J67+J86","v":0},null,null,0,{"$f":"+N67+N86","v":0},727.35576365884504,{"$f":"+P67+P86","v":0},363677.88182942243,{"$f":"+R67+R86","v":0}]
[]
["Returns Above Specified Costs",null,null,null,null,null,null,null,306.20423634115491,{"$f":"+J14-J87","v":0},null,null,0,{"$f":"+N14-N87","v":0},306.20423634115491,{"$f":"+P14-P87","v":0},153102.11817057757,{"$f":"+R14-R87","v":0}]
[]
["    Breakeven Price to Cover Total Costs",null,null,null,null,null,0.55977307073205007,{"$f":"IF(E10=0,\"n/a\",(YTotExp-(YTotExp+YTotRet-J10))/E10)","v":"n/a"},"Pound"]
[]
[null,null,null,"Example Breakeven Prices"]
[null,"Example","Example","To Cover",null,null,"To Cover"]
[null,"Yield","Yield","Variable",null,null,"Total"]
[null,"Percent","Pound","Costs",null,null,"Costs"]
[null,0.75,675,0.49258891342451949,null,null,0.74636409430940009]
[null,0.9,810,0.41049076118709954,null,null,0.62197007859116671]
[null,1,900,0.36944168506838959,null,null,0.55977307073205007]
[null,1.1000000000000001,990.00000000000011,0.33585607733489958,null,null,0.50888460975640903]
[null,1.25,1125,0.29555334805471167,null,null,0.44781845658564001]
[]
["  Developed by Extension Economists, Texas A&M AgriLife Extension Service, budgets@tamu.edu.  "]
[]
["Information presented is prepared solely as a general guide and not intended to recognize or predict the costs and returns from any one operation.  Brand names are mentioned only as examples and imply no endorsement."]

{"sheet":"SorghumUCB","index":14,"n_rows":98,"n_cols":18,"rows_kept":98,"cut":false,"hidden":false,"merged":[[85,3,85,8],[97,0,97,11],[0,0,0,11],[1,0,1,11],[2,0,2,11],[3,0,3,11]]}
["Projections for Planning Purposes Only -- Not to be Used without Updating"]
["2023 Estimated Costs and Returns per Acre"]
["Sorghum - Conventional Till-12 Row, Dryland, 90 bu. Yield Goal - Upper Coast"]
["Enter your name for this budget in the cell above."]
["Enter  Your Values in the cells highlighed in MAROON."]
[null,null,null,null,"Your Acres",null,null,null,null,null,null,null,null,null,null,null,null,"Your"]
[null,null,"Crop Acres",500,null,null,null,null,null,null,null,"Your",null,null,null,null,"Enterprise","Enterprise"]
[null,null,null,null,"Your",null,null,"Your","Cash","Your","Landlord","Landlord",null,"Your",null,"Your","Total","Total"]
["REVENUE",null,null,"Quantity","Quantity","Units","$/Unit","$/Unit","Total","Total","Share","Share","Landlord","Landlord","Tenant","Tenant","(500 acres)",{"$f":"\"(\" & E7 & \" acres)\"","v":"( acres)"}]
[null,"Grain Sorghum, Upper Coast",null,90,null,"Bushel",5.0999999999999996,null,458.99999999999994,{"$f":"E10*H10","v":0},0,null,0,{"$f":"J10*L10","v":0},458.99999999999994,{"$f":"+J10-N10","v":0},229499.99999999997,{"$f":"+J10*E$7","v":0}]
[null,null,null,0,null,null,0,null,0,0,0,null,0,0,0,{"$f":"+J11-N11","v":0},0,0]
[null,null,null,0,null,null,0,null,0,0,0,null,0,0,0,0,0,0]
["Total Revenue",null,null,null,null,null,null,null,458.99999999999994,{"$f":"SUM(J10:J12)","v":0},null,null,0,{"$f":"SUM(N10:N12)","v":0},458.99999999999994,{"$f":"SUM(P10:P12)","v":0},229499.99999999997,{"$f":"SUM(R10:R12)","v":0}]
[null,null,null,null,null,null,null,null,null,null,null,null,null,null,null,null,"Enterprise","Enterprise"]
["VARIABLE COSTS",null,null,"Quantity","Quantity","Units","$/Unit","$/Unit","Total","Total","Share","Share","Landlord","Landlord","Tenant","Tenant","Total","Total"]
["Production Costs"]
[null,"Herbicide",null,null,null,null,null,null,"$50.8"]
[null,"","Glyphosate (Generic)",2,null,"Quart",7.75,null,15.5,{"$f":"E18*H18","v":0},0,null,0,{"$f":"J18*L18","v":0},15.5,{"$f":"+J18-N18","v":0},7750,{"$f":"+J18*E$7","v":0}]
[null,"","2, 4D Amine`",1,null,"Pint",3.625,null,3.625,0,0,null,0,0,3.625,0,1812.5,0]
[null,"","Atrazine 4L`",2,null,"Quart",5.75,null,11.5,0,0,null,0,0,11.5,0,5750,0]
[null,"","Sorghum PreEmerge Herbicide",14,null,"Ounce",1.03,null,14.42,0,0,null,0,0,14.42,0,7210,0]
[null,"","Atrazine 4L",1,null,"Quart",5.75,null,5.75,0,0,null,0,0,5.75,0,2875,0]
[null,"Seed",null,null,null,null,null,null,"$23.74"]
[null,"","Treated Sorghum Seed",7,null,"Pound",3.3920000000000003,null,23.744000000000003,0,0,null,0,0,23.744000000000003,0,11872.000000000002,0]
[null,"Fertilizer",null,null,null,null,null,null,"$82.14"]
[null,"","24-8-0`",0.21,null,"Ton",391.14000000000004,null,82.139400000000009,0,0,null,0,0,82.139400000000009,0,41069.700000000004,0]
[null,"Custom",null,null,null,null,null,null,"$34.98"]
[null,"","Apply by Air",1,null,"Acre",8.2680000000000007,null,8.2680000000000007,0,0,null,0,0,8.2680000000000007,0,4134,0]
[null,"","Custom Grain Haul",50.4,null,"CWT",0.53,null,26.712,0,0,null,0,0,26.712,0,13356,0]
[null,"Miscellaneous",null,null,null,null,null,null,"$8"]
[null,"","Crop Insurance -Sorghum UC",1,null,"Acre",8,null,8,0,0,null,0,0,8,0,4000,0]
[null,"Insecticide",null,null,null,null,null,null,"$8.24"]
[null,"","Transform",1,null,"Ounce",8.1938000000000013,null,8.1938000000000013,0,0,null,0,0,8.1938000000000013,0,4096.9000000000005,0]
[null,"","Headworn Control",2.8500000000000001E-2,null,"Ounce",1.7,null,4.845E-2,0,0,null,0,0,4.845E-2,0,24.225000000000001,0]
[null,"Other Labor",null,null,null,null,null,null,"$3.56"]
[null,"","Hand Labor",0.21,null,"Hour",16.96,null,3.5615999999999999,0,0,null,0,0,3.5615999999999999,0,1780.8,0]
[null,null,null,0,null,null,0,null,0,0,0,null,0,0,0,0,0,0]
[null,null,null,0,null,null,0,null,0,0,0,null,0,0,0,0,0,0]
[null,null,null,0,null,null,0,null,0,{"$f":"E39*H39","v":0},0,null,0,{"$f":"J39*L39","v":0},0,{"$f":"+J39-N39","v":0},0,{"$f":"+J39*E$7","v":0}]
[null,"Machinery Labor",null,null,null,null,null,null,"$7.57"]
[null,null,"Tractors/Self-Propelled",0.44,null,"Hour",17.21,null,7.5724,{"$f":"E41*H41","v":0},0,null,0,{"$f":"J41*L41","v":0},7.5724,{"$f":"+J41-N41","v":0},3786.2,{"$f":"+J41*E$7","v":0}]
[null,null,"Other Labor",0,null,"Hour",17.21,null,0,{"$f":"E42*H42","v":0},0,null,0,{"$f":"J42*L42","v":0},0,{"$f":"+J42-N42","v":0},0,{"$f":"+J42*E$7","v":0}]
[]
[null,"Diesel Fuel",null,null,null,null,null,null,"$10.64"]
[null,null,"Pickup/General Use Equipment",1,null,"Acre",0,null,0,{"$f":"E45*H45","v":0},0,null,0,{"$f":"J45*L45","v":0},0,{"$f":"+J45-N45","v":0},0,{"$f":"+J45*E$7","v":0}]
[null,null,"Tractors/Self-Propelled",4.75,null,"Gallon",2.2400000000000002,null,10.64,{"$f":"E46*H46","v":0},0,null,0,{"$f":"J46*L46","v":0},10.64,{"$f":"+J46-N46","v":0},5320,{"$f":"+J46*E$7","v":0}]
[]
[null,"Gasoline",null,null,null,null,null,null,"$0"]
[null,null,"Pickup/General Use Equipment",1,null,"Acre",0,null,0,{"$f":"E49*H49","v":0},0,null,0,{"$f":"J49*L49","v":0},0,{"$f":"+J49-N49","v":0},0,{"$f":"+J49*E$7","v":0}]
[null,null,"Tractors/Self-Propelled",0,null,"Gallon",2.09,null,0,{"$f":"E50*H50","v":0},0,null,0,{"$f":"J50*L50","v":0},0,{"$f":"+J50-N50","v":0},0,{"$f":"+J50*E$7","v":0}]
[]
[null,"Repairs & Maintenance",null,null,null,null,null,null,"$23.67"]
[null,null,"Pickup/General Use Equipment",1,null,"Acre",0,null,0,{"$f":"E53*H53","v":0},0,null,0,{"$f":"J53*L53","v":0},0,{"$f":"+J53-N53","v":0},0,{"$f":"+J53*E$7","v":0}]
[null,null,"Irrigation Equipment",1,null,"Acre",0,null,0,0,0,null,0,0,0,0,0,0]
[null,null,"Tractors/Self-Propelled",1,null,"Acre",15.455317107419312,null,15.455317107419312,0,0,null,0,0,15.455317107419312,0,7727.6585537096562,0]
[null,null,"Implements",1,null,"Acre",8.2124758850609272,null,8.2124758850609272,0,0,null,0,0,8.2124758850609272,0,4106.2379425304634,0]
[null,null,null,null,null,null,null,null,0,0,0,null,0,0,0,0,0,0]
[null,null,null,null,null,null,null,null,0,0,0,null,0,0,0,0,0,0]
[null,"Interest on Credit Line",null,null,null,null,0.08,null,12.610904006895185,{"$f":"+SUM(J17:J58)/2*H59","v":0},null,null,0,{"$f":"+SUM(N17:N58)/2*L59","v":0},12.610904006895185,{"$f":"+SUM(P17:P58)/2*L59","v":0},6305.4520034475927,{"$f":"+J59*E$7","v":0}]
["Total Variable Costs",null,null,null,null,null,null,null,265.95334699937541,{"$f":"SUM(J18:J59)","v":0},null,null,0,{"$f":"SUM(N18:N59)","v":0},265.95334699937541,{"$f":"SUM(P18:P59)","v":0},132976.67349968772,{"$f":"SUM(R18:R59)","v":0}]
["Planned Returns Above Variable Costs:",null,null,null,null,null,null,null,193.04665300062453,{"$f":"+J13-J60","v":0},null,null,0,{"$f":"+N13-N60","v":0},193.04665300062453,{"$f":"+P13-P60","v":0},96523.326500312251,{"$f":"+R13-R60","v":0}]
[null,"Breakeven Price to Cover Variable Costs",null,null,null,null,2.9550371888819491,{"$f":"IF(E10=0,\"n/a\",(YVarExp-(YTotExp+YTotRet-J10))/E10)","v":"n/a"},"Bushel"]
[null,null,null,null,null,null,null,null,null,null,null,null,null,null,null,null,"Enterprise","Enterprise"]
["FIXED COSTS",null,null,"Quantity","Quantity","Units","$/Unit","$/Unit","Total","Total","Share","Share","Landlord","Landlord","Tenant","Tenant","Total","Total"]
[null,"Machinery Depreciation",null,null,null,null,null,null,"$24.89"]
[null,null,"Tractors/Self-Propelled",1,null,"Acre",15.662194221976858,null,15.662194221976858,{"$f":"E66*H66","v":0},0,null,0,{"$f":"J66*L66","v":0},15.662194221976858,{"$f":"+J66-N66","v":0},7831.0971109884285,{"$f":"+J66*E$7","v":0}]
[null,null,"Implements",1,null,"Acre",9.2320416467429247,null,9.2320416467429247,0,0,null,0,{"$f":"J67*L67","v":0},9.2320416467429247,0,4616.020823371462,0]
[null,"Equipment Investment",null,null,null,null,null,null,"$15.18"]
[null,null,"Tractors/Self-Propelled",119.6911806499033,null,"Dollars",0.08,null,9.5752944519922636,{"$f":"E69*H69","v":0},0,null,0,{"$f":"J69*L69","v":0},9.5752944519922636,{"$f":"+J69-N69","v":0},4787.647225996132,{"$f":"+J69*E$7","v":0}]
[null,null,"Implements",70.011116200195858,null,"Dollars",0.08,null,5.6008892960156684,0,0,null,0,{"$f":"J70*L70","v":0},5.6008892960156684,0,2800.4446480078341,0]
[null,"Salaried Labor",null,1,null,"Acre",0,null,0,0,0,null,0,{"$f":"J71*L71","v":0},0,{"$f":"+J71-N71","v":0},0,{"$f":"+J71*E$7","v":0}]
[null,"Management Fee, Owner/Operator Labor",null,1,null,"Acre",22.95,null,22.95,0,0,null,0,0,22.95,0,11475,0]
[null,"Allocated Establishment Cost",null,1,null,"Acre",0,null,0,0,0,null,0,0,0,0,0,0]
[null,"UCB - Land Charge",null,1,null,"Acre",85,null,85,0,0,null,0,0,85,0,42500,0]
[null,"Property Taxes",null,1,null,"Acre",0,null,0,0,0,null,0,0,0,0,0,0]
[null,"Whole Farm Insurance",null,1,null,"Acre",0,null,0,0,0,null,0,0,0,0,0,0]
[null,null,null,1,null,null,0,null,0,0,0,null,0,0,0,0,0,0]
[null,null,null,1,null,null,0,null,0,{"$f":"E78*H78","v":0},0,null,0,0,0,0,0,0]
["Total Fixed Costs",null,null,null,null,null,null,null,148.02041961672771,{"$f":"+SUM(J66:J78)","v":0},null,null,0,{"$f":"+SUM(N66:N78)","v":0},148.02041961672771,{"$f":"+SUM(P66:P78)","v":0},74010.209808363856,{"$f":"+SUM(R66:R78)","v":0}]
["Total Specified Costs",null,null,null,null,null,null,null,413.97376661610315,{"$f":"+J60+J79","v":0},null,null,0,{"$f":"+N60+N79","v":0},413.97376661610315,{"$f":"+P60+P79","v":0},206986.88330805156,{"$f":"+R60+R79","v":0}]
[]
["Returns Above Specified Costs",null,null,null,null,null,null,null,45.026233383896795,{"$f":"+J13-J80","v":0},null,null,0,{"$f":"+N13-N80","v":0},45.026233383896795,{"$f":"+P13-P80","v":0},22513.116691948409,{"$f":"+R13-R80","v":0}]
[]
["    Breakeven Price to Cover Total Costs",null,null,null,null,null,4.5997085179567012,{"$f":"IF(E10=0,\"n/a\",(YTotExp-(YTotExp+YTotRet-J10))/E10)","v":"n/a"},"Bushel"]
[]
[null,null,null,"Example Breakeven Prices"]
[null,"Example","Example","To Cover",null,null,"To Cover"]
[null,"Yield","Yield","Variable",null,null,"Total"]
[null,"Percent","Bushel","Costs",null,null,"Costs"]
[null,0.75,67.5,3.9400495851759318,null,null,6.1329446906089355]
[null,0.9,81,3.2833746543132767,null,null,5.110787242174113]
[null,1,90,2.9550371888819491,null,null,4.5997085179567012]
[null,1.1000000000000001,99.000000000000014,2.6863974444381351,null,null,4.1815531981424554]
[null,1.25,112.5,2.364029751105559,null,null,3.6797668143653612]
[]
["  Developed by Extension Economists, Texas A&M AgriLife Extension Service, budgets@tamu.edu.  "]
[]
["Information presented is prepared solely as a general guide and not intended to recognize or predict the costs and returns from any one operation.  Brand names are mentioned only as examples and imply no endorsement."]

{"sheet":"WheatUCB","index":15,"n_rows":93,"n_cols":18,"rows_kept":93,"cut":false,"hidden":false,"merged":[[80,3,80,8],[92,0,92,11],[0,0,0,11],[1,0,1,11],[2,0,2,11],[3,0,3,11]]}
["Projections for Planning Purposes Only -- Not to be Used without Updating"]
["2023 Estimated Costs and Returns per Acre"]
["Soft Red Winter Wheat, 45 bu. Yield Goal - Upper Coast"]
["Enter your name for this budget in the cell above."]
["Enter  Your Values in the cells highlighed in MAROON."]
[null,null,null,null,"Your Acres",null,null,null,null,null,null,null,null,null,null,null,null,"Your"]
[null,null,"Crop Acres",500,null,null,null,null,null,null,null,"Your",null,null,null,null,"Enterprise","Enterprise"]
[null,null,null,null,"Your",null,null,"Your","Cash","Your","Landlord","Landlord",null,"Your",null,"Your","Total","Total"]
["REVENUE",null,null,"Quantity","Quantity","Units","$/Unit","$/Unit","Total","Total","Share","Share","Landlord","Landlord","Tenant","Tenant","(500 acres)",{"$f":"\"(\" & E7 & \" acres)\"","v":"( acres)"}]
[null,"Soft Red Winter Wheat",null,45,null,"Bushel",7.6,null,342,{"$f":"E10*H10","v":0},0,null,0,{"$f":"J10*L10","v":0},342,{"$f":"+J10-N10","v":0},171000,{"$f":"+J10*E$7","v":0}]
[null,null,null,0,null,null,0,null,0,0,0,null,0,0,0,{"$f":"+J11-N11","v":0},0,0]
[null,null,null,0,null,null,0,null,0,0,0,null,0,0,0,0,0,0]
["Total Revenue",null,null,null,null,null,null,null,342,{"$f":"SUM(J10:J12)","v":0},null,null,0,{"$f":"SUM(N10:N12)","v":0},342,{"$f":"SUM(P10:P12)","v":0},171000,{"$f":"SUM(R10:R12)","v":0}]
[null,null,null,null,null,null,null,null,null,null,null,null,null,null,null,null,"Enterprise","Enterprise"]
["VARIABLE COSTS",null,null,"Quantity","Quantity","Units","$/Unit","$/Unit","Total","Total","Share","Share","Landlord","Landlord","Tenant","Tenant","Total","Total"]
["Production Costs"]
[null,"Herbicide",null,null,null,null,null,null,"$3.74"]
[null,"","Wheat PostEmerge Herbicide",0.35,null,"Ounce",10.684800000000001,null,3.7396799999999999,{"$f":"E18*H18","v":0},0,null,0,{"$f":"J18*L18","v":0},3.7396799999999999,{"$f":"+J18-N18","v":0},1869.84,{"$f":"+J18*E$7","v":0}]
[null,"Seed",null,null,null,null,null,null,"$27.86"]
[null,"","Soft Red Wheat",90,null,"Pound",0.30952000000000002,null,27.8568,0,0,null,0,0,27.8568,0,13928.4,0]
[null,"Fertilizer",null,null,null,null,null,null,"$82.04"]
[null,"","24-8-0`",0.14050000000000001,null,"Ton",391.14000000000004,null,54.95517000000001,0,0,null,0,0,54.95517000000001,0,27477.585000000006,0]
[null,"","46-0-0`",0.05,null,"Ton",541.66000000000008,null,27.083000000000006,0,0,null,0,0,27.083000000000006,0,13541.500000000004,0]
[null,"Custom",null,null,null,null,null,null,"$32.44"]
[null,"","Fertilizer Application UC",2,null,"Acre",9.5400000000000009,null,19.080000000000002,0,0,null,0,0,19.080000000000002,0,9540.0000000000018,0]
[null,"","Custom Grain Haul",25.2,null,"CWT",0.53,null,13.356,0,0,null,0,0,13.356,0,6678,0]
[null,"Miscellaneous",null,null,null,null,null,null,"$10.41"]
[null,"","Crop Insurance -Wheat UC",1,null,"Acre",9,null,9,0,0,null,0,0,9,0,4500,0]
[null,"","Hand Labor",8.3299999999999999E-2,null,"Hour",16.96,null,1.412768,0,0,null,0,0,1.412768,0,706.38400000000001,0]
[null,"Fungicides",null,null,null,null,null,null,"$15.77"]
[null,"","Wheat Fungicide",6,null,"Ounce",2.6288,null,15.7728,0,0,null,0,0,15.7728,0,7886.4,0]
[null,null,null,0,null,null,0,null,0,0,0,null,0,0,0,0,0,0]
[null,null,null,0,null,null,0,null,0,0,0,null,0,0,0,0,0,0]
[null,null,null,0,null,null,0,null,0,{"$f":"E34*H34","v":0},0,null,0,{"$f":"J34*L34","v":0},0,{"$f":"+J34-N34","v":0},0,{"$f":"+J34*E$7","v":0}]
[null,"Machinery Labor",null,null,null,null,null,null,"$6.54"]
[null,null,"Tractors/Self-Propelled",0.38,null,"Hour",17.21,null,6.5398000000000005,{"$f":"E36*H36","v":0},0,null,0,{"$f":"J36*L36","v":0},6.5398000000000005,{"$f":"+J36-N36","v":0},3269.9,{"$f":"+J36*E$7","v":0}]
[null,null,"Other Labor",0,null,"Hour",17.21,null,0,{"$f":"E37*H37","v":0},0,null,0,{"$f":"J37*L37","v":0},0,{"$f":"+J37-N37","v":0},0,{"$f":"+J37*E$7","v":0}]
[]
[null,"Diesel Fuel",null,null,null,null,null,null,"$9.23"]
[null,null,"Pickup/General Use Equipment",1,null,"Acre",0,null,0,{"$f":"E40*H40","v":0},0,null,0,{"$f":"J40*L40","v":0},0,{"$f":"+J40-N40","v":0},0,{"$f":"+J40*E$7","v":0}]
[null,null,"Tractors/Self-Propelled",4.12,null,"Gallon",2.2400000000000002,null,9.2288000000000014,{"$f":"E41*H41","v":0},0,null,0,{"$f":"J41*L41","v":0},9.2288000000000014,{"$f":"+J41-N41","v":0},4614.4000000000005,{"$f":"+J41*E$7","v":0}]
[]
[null,"Gasoline",null,null,null,null,null,null,"$0"]
[null,null,"Pickup/General Use Equipment",1,null,"Acre",0,null,0,{"$f":"E44*H44","v":0},0,null,0,{"$f":"J44*L44","v":0},0,{"$f":"+J44-N44","v":0},0,{"$f":"+J44*E$7","v":0}]
[null,null,"Tractors/Self-Propelled",0,null,"Gallon",2.09,null,0,{"$f":"E45*H45","v":0},0,null,0,{"$f":"J45*L45","v":0},0,{"$f":"+J45-N45","v":0},0,{"$f":"+J45*E$7","v":0}]
[]
[null,"Repairs & Maintenance",null,null,null,null,null,null,"$21.73"]
[null,null,"Pickup/General Use Equipment",1,null,"Acre",0,null,0,{"$f":"E48*H48","v":0},0,null,0,{"$f":"J48*L48","v":0},0,{"$f":"+J48-N48","v":0},0,{"$f":"+J48*E$7","v":0}]
[null,null,"Irrigation Equipment",1,null,"Acre",0,null,0,0,0,null,0,0,0,0,0,0]
[null,null,"Tractors/Self-Propelled",1,null,"Acre",14.25226922074277,null,14.25226922074277,0,0,null,0,0,14.25226922074277,0,7126.134610371385,0]
[null,null,"Implements",1,null,"Acre",7.482257002627386,null,7.482257002627386,0,0,null,0,0,7.482257002627386,0,3741.1285013136931,0]
[null,null,null,null,null,null,null,null,0,0,0,null,0,0,0,0,0,0]
[null,null,null,null,null,null,null,null,0,0,0,null,0,0,0,0,0,0]
[null,"Interest on Credit Line",null,null,null,null,0.08,null,9.9538280775536947,{"$f":"+SUM(J17:J53)/2*H54","v":0},null,null,0,{"$f":"+SUM(N17:N53)/2*L54","v":0},9.9538280775536947,{"$f":"+SUM(P17:P53)/2*L54","v":0},4976.9140387768475,{"$f":"+J54*E$7","v":0}]
["Total Variable Costs",null,null,null,null,null,null,null,219.71317230092387,{"$f":"SUM(J18:J54)","v":0},null,null,0,{"$f":"SUM(N18:N54)","v":0},219.71317230092387,{"$f":"SUM(P18:P54)","v":0},109856.58615046192,{"$f":"SUM(R18:R54)","v":0}]
["Planned Returns Above Variable Costs:",null,null,null,null,null,null,null,122.28682769907613,{"$f":"+J13-J55","v":0},null,null,0,{"$f":"+N13-N55","v":0},122.28682769907613,{"$f":"+P13-P55","v":0},61143.413849538076,{"$f":"+R13-R55","v":0}]
[null,"Breakeven Price to Cover Variable Costs",null,null,null,null,4.8825149400205303,{"$f":"IF(E10=0,\"n/a\",(YVarExp-(YTotExp+YTotRet-J10))/E10)","v":"n/a"},"Bushel"]
[null,null,null,null,null,null,null,null,null,null,null,null,null,null,null,null,"Enterprise","Enterprise"]
["FIXED COSTS",null,null,"Quantity","Quantity","Units","$/Unit","$/Unit","Total","Total","Share","Share","Landlord","Landlord","Tenant","Tenant","Total","Total"]
[null,"Machinery Depreciation",null,null,null,null,null,null,"$23.05"]
[null,null,"Tractors/Self-Propelled",1,null,"Acre",14.072824247593941,null,14.072824247593941,{"$f":"E61*H61","v":0},0,null,0,{"$f":"J61*L61","v":0},14.072824247593941,{"$f":"+J61-N61","v":0},7036.4121237969703,{"$f":"+J61*E$7","v":0}]
[null,null,"Implements",1,null,"Acre",8.9805806100818462,null,8.9805806100818462,0,0,null,0,{"$f":"J62*L62","v":0},8.9805806100818462,0,4490.2903050409232,0]
[null,"Equipment Investment",null,null,null,null,null,null,"$13.54"]
[null,null,"Tractors/Self-Propelled",107.47034183692934,null,"Dollars",0.08,null,8.5976273469543472,{"$f":"E64*H64","v":0},0,null,0,{"$f":"J64*L64","v":0},8.5976273469543472,{"$f":"+J64-N64","v":0},4298.8136734771733,{"$f":"+J64*E$7","v":0}]
[null,null,"Implements",61.813742238841172,null,"Dollars",0.08,null,4.9450993791072939,0,0,null,0,{"$f":"J65*L65","v":0},4.9450993791072939,0,2472.5496895536471,0]
[null,"Salaried Labor",null,1,null,"Acre",0,null,0,0,0,null,0,{"$f":"J66*L66","v":0},0,{"$f":"+J66-N66","v":0},0,{"$f":"+J66*E$7","v":0}]
[null,"Management Fee, Owner/Operator Labor",null,1,null,"Acre",17.100000000000001,null,17.100000000000001,0,0,null,0,0,17.100000000000001,0,8550,0]
[null,"Allocated Establishment Cost",null,1,null,"Acre",0,null,0,0,0,null,0,0,0,0,0,0]
[null,"UCB - Land Charge",null,1,null,"Acre",85,null,85,0,0,null,0,0,85,0,42500,0]
[null,"Property Taxes",null,1,null,"Acre",0,null,0,0,0,null,0,0,0,0,0,0]
[null,"Whole Farm Insurance",null,1,null,"Acre",0,null,0,0,0,null,0,0,0,0,0,0]
[null,null,null,1,null,null,0,null,0,0,0,null,0,0,0,0,0,0]
[null,null,null,1,null,null,0,null,0,{"$f":"E73*H73","v":0},0,null,0,0,0,0,0,0]
["Total Fixed Costs",null,null,null,null,null,null,null,138.69613158373744,{"$f":"+SUM(J61:J73)","v":0},null,null,0,{"$f":"+SUM(N61:N73)","v":0},138.69613158373744,{"$f":"+SUM(P61:P73)","v":0},69348.065791868721,{"$f":"+SUM(R61:R73)","v":0}]
["Total Specified Costs",null,null,null,null,null,null,null,358.40930388466131,{"$f":"+J55+J74","v":0},null,null,0,{"$f":"+N55+N74","v":0},358.40930388466131,{"$f":"+P55+P74","v":0},179204.65194233065,{"$f":"+R55+R74","v":0}]
[]
["Returns Above Specified Costs",null,null,null,null,null,null,null,-16.409303884661313,{"$f":"+J13-J75","v":0},null,null,0,{"$f":"+N13-N75","v":0},-16.409303884661313,{"$f":"+P13-P75","v":0},-8204.6519423306454,{"$f":"+R13-R75","v":0}]
[]
["    Breakeven Price to Cover Total Costs",null,null,null,null,null,7.9646511974369183,{"$f":"IF(E10=0,\"n/a\",(YTotExp-(YTotExp+YTotRet-J10))/E10)","v":"n/a"},"Bushel"]
[]
[null,null,null,"Example Breakeven Prices"]
[null,"Example","Example","To Cover",null,null,"To Cover"]
[null,"Yield","Yield","Variable",null,null,"Total"]
[null,"Percent","Bushel","Costs",null,null,"Costs"]
[null,0.75,33.75,6.5100199200273741,null,null,10.61953492991589]
[null,0.9,40.5,5.4250166000228113,null,null,8.8496124415965749]
[null,1,45,4.8825149400205303,null,null,7.9646511974369183]
[null,1.1000000000000001,49.500000000000007,4.4386499454732089,null,null,7.2405919976699247]
[null,1.25,56.25,3.9060119520164243,null,null,6.3717209579495346]
[]
["  Developed by Extension Economists, Texas A&M AgriLife Extension Service, budgets@tamu.edu.  "]
[]
["Information presented is prepared solely as a general guide and not intended to recognize or predict the costs and returns from any one operation.  Brand names are mentioned only as examples and imply no endorsement."]

{"sheet":"Corn","index":16,"n_rows":99,"n_cols":18,"rows_kept":99,"cut":false,"hidden":false,"merged":[[86,3,86,8],[98,0,98,11],[0,0,0,11],[1,0,1,11],[2,0,2,11],[3,0,3,11]]}
["Projections for Planning Purposes Only -- Not to be Used without Updating"]
["2023 Estimated Costs and Returns per Acre"]
["Corn - GMO Seed, Conventional Till-12 Row, Dryland, 100 bu. Yield Goal - Upper Coast"]
["Enter your name for this budget in the cell above."]
["Enter  Your Values in the cells highlighed in MAROON."]
[null,null,null,null,"Your Acres",null,null,null,null,null,null,null,null,null,null,null,null,"Your"]
[null,null,"Crop Acres",500,null,null,null,null,null,null,null,"Your",null,null,null,null,"Enterprise","Enterprise"]
[null,null,null,null,"Your",null,null,"Your","Cash","Your","Landlord","Landlord",null,"Your",null,"Your","Total","Total"]
["REVENUE",null,null,"Quantity","Quantity","Units","$/Unit","$/Unit","Total","Total","Share","Share","Landlord","Landlord","Tenant","Tenant","(500 acres)",{"$f":"\"(\" & E7 & \" acres)\"","v":"( acres)"}]
[null,"Corn",null,100,null,"Bushel",6,null,600,{"$f":"E10*H10","v":0},0,null,0,{"$f":"J10*L10","v":0},600,{"$f":"+J10-N10","v":0},300000,{"$f":"+J10*E$7","v":0}]
[null,null,null,0,null,null,0,null,0,0,0,null,0,0,0,{"$f":"+J11-N11","v":0},0,0]
[null,null,null,0,null,null,0,null,0,0,0,null,0,0,0,0,0,0]
["Total Revenue",null,null,null,null,null,null,null,600,{"$f":"SUM(J10:J12)","v":0},null,null,0,{"$f":"SUM(N10:N12)","v":0},600,{"$f":"SUM(P10:P12)","v":0},300000,{"$f":"SUM(R10:R12)","v":0}]
[null,null,null,null,null,null,null,null,null,null,null,null,null,null,null,null,"Enterprise","Enterprise"]
["VARIABLE COSTS",null,null,"Quantity","Quantity","Units","$/Unit","$/Unit","Total","Total","Share","Share","Landlord","Landlord","Tenant","Tenant","Total","Total"]
["Production Costs"]
[null,"Seed",null,null,null,null,null,null,"$118.5"]
[null,"","Corn",25,null,"Thousand",4.74,null,118.5,{"$f":"E18*H18","v":0},0,null,0,{"$f":"J18*L18","v":0},118.5,{"$f":"+J18-N18","v":0},59250,{"$f":"+J18*E$7","v":0}]
[null,"Fertilizer",null,null,null,null,null,null,"$97.78"]
[null,"","24-8-0`",0.25,null,"Ton",391.14000000000004,null,97.785000000000011,0,0,null,0,0,97.785000000000011,0,48892.500000000007,0]
[null,"Custom",null,null,null,null,null,null,"$30.21"]
[null,"","Custom Grain Haul",57,null,"CWT",0.53,null,30.21,0,0,null,0,0,30.21,0,15105,0]
[null,"Herbicide",null,null,null,null,null,null,"$78.52"]
[null,"","Glyphosate (Generic)",2,null,"Quart",7.75,null,15.5,0,0,null,0,0,15.5,0,7750,0]
[null,"","2, 4D Amine",1,null,"Pint",3.875,null,3.875,0,0,null,0,0,3.875,0,1937.5,0]
[null,"","Atrazine 4L",2,null,"Quart",5.75,null,11.5,0,0,null,0,0,11.5,0,5750,0]
[null,"","Corn PreEmerge Herbicide",2.1,null,"Quart",10.9,null,22.89,0,0,null,0,0,22.89,0,11445,0]
[null,"","Corn PostEmerge Herbicide",1,null,"Quart",24.75,null,24.75,0,0,null,0,0,24.75,0,12375,0]
[null,"Insecticide",null,null,null,null,null,null,"$0.93"]
[null,"","Cutworm Control",1.25,null,"Ounce",0.74199999999999999,null,0.92749999999999999,0,0,null,0,0,0.92749999999999999,0,463.75,0]
[null,"Miscellaneous",null,null,null,null,null,null,"$28.51"]
[null,"","Crop Insurance -Corn",1,null,"Acre",17.384,null,17.384,0,0,null,0,0,17.384,0,8692,0]
[null,"","G&A Overhead",1,null,"Acre",11.13,null,11.13,0,0,null,0,0,11.13,0,5565,0]
[null,"Other Chemicals",null,null,null,null,null,null,"$0.98"]
[null,"","Crop Oil",0.5,null,"Pint",1.9610000000000003,null,0.98050000000000015,0,0,null,0,0,0.98050000000000015,0,490.25000000000006,0]
[null,"Other Labor",null,null,null,null,null,null,"$3.56"]
[null,"","Hand Labor",0.21,null,"Hour",16.96,null,3.5615999999999999,0,0,null,0,0,3.5615999999999999,0,1780.8,0]
[null,null,null,0,null,null,0,null,0,0,0,null,0,0,0,0,0,0]
[null,null,null,0,null,null,0,null,0,0,0,null,0,0,0,0,0,0]
[null,null,null,0,null,null,0,null,0,{"$f":"E40*H40","v":0},0,null,0,{"$f":"J40*L40","v":0},0,{"$f":"+J40-N40","v":0},0,{"$f":"+J40*E$7","v":0}]
[null,"Machinery Labor",null,null,null,null,null,null,"$6.2"]
[null,null,"Tractors/Self-Propelled",0.36,null,"Hour",17.21,null,6.1955999999999998,{"$f":"E42*H42","v":0},0,null,0,{"$f":"J42*L42","v":0},6.1955999999999998,{"$f":"+J42-N42","v":0},3097.7999999999997,{"$f":"+J42*E$7","v":0}]
[null,null,"Other Labor",0,null,"Hour",17.21,null,0,{"$f":"E43*H43","v":0},0,null,0,{"$f":"J43*L43","v":0},0,{"$f":"+J43-N43","v":0},0,{"$f":"+J43*E$7","v":0}]
[]
[null,"Diesel Fuel",null,null,null,null,null,null,"$9.05"]
[null,null,"Pickup/General Use Equipment",1,null,"Acre",0,null,0,{"$f":"E46*H46","v":0},0,null,0,{"$f":"J46*L46","v":0},0,{"$f":"+J46-N46","v":0},0,{"$f":"+J46*E$7","v":0}]
[null,null,"Tractors/Self-Propelled",4.04,null,"Gallon",2.2400000000000002,null,9.0496000000000016,{"$f":"E47*H47","v":0},0,null,0,{"$f":"J47*L47","v":0},9.0496000000000016,{"$f":"+J47-N47","v":0},4524.8000000000011,{"$f":"+J47*E$7","v":0}]
[]
[null,"Gasoline",null,null,null,null,null,null,"$0"]
[null,null,"Pickup/General Use Equipment",1,null,"Acre",0,null,0,{"$f":"E50*H50","v":0},0,null,0,{"$f":"J50*L50","v":0},0,{"$f":"+J50-N50","v":0},0,{"$f":"+J50*E$7","v":0}]
[null,null,"Tractors/Self-Propelled",0,null,"Gallon",2.09,null,0,{"$f":"E51*H51","v":0},0,null,0,{"$f":"J51*L51","v":0},0,{"$f":"+J51-N51","v":0},0,{"$f":"+J51*E$7","v":0}]
[]
[null,"Repairs & Maintenance",null,null,null,null,null,null,"$21.4"]
[null,null,"Pickup/General Use Equipment",1,null,"Acre",0,null,0,{"$f":"E54*H54","v":0},0,null,0,{"$f":"J54*L54","v":0},0,{"$f":"+J54-N54","v":0},0,{"$f":"+J54*E$7","v":0}]
[null,null,"Irrigation Equipment",1,null,"Acre",0,null,0,0,0,null,0,0,0,0,0,0]
[null,null,"Tractors/Self-Propelled",1,null,"Acre",13.255598539681152,null,13.255598539681152,0,0,null,0,0,13.255598539681152,0,6627.799269840576,0]
[null,null,"Implements",1,null,"Acre",8.1423499205320606,null,8.1423499205320606,0,0,null,0,0,8.1423499205320606,0,4071.1749602660302,0]
[null,null,null,null,null,null,null,null,0,0,0,null,0,0,0,0,0,0]
[null,null,null,null,null,null,null,null,0,0,0,null,0,0,0,0,0,0]
[null,"Interest on Credit Line",null,null,null,null,0.08,null,17.173554024828853,{"$f":"+SUM(J17:J59)/2*H60","v":0},null,null,0,{"$f":"+SUM(N17:N59)/2*L60","v":0},17.173554024828853,{"$f":"+SUM(P17:P59)/2*L60","v":0},8586.7770124144263,{"$f":"+J60*E$7","v":0}]
["Total Variable Costs",null,null,null,null,null,null,null,412.81030248504209,{"$f":"SUM(J18:J60)","v":0},null,null,0,{"$f":"SUM(N18:N60)","v":0},412.81030248504209,{"$f":"SUM(P18:P60)","v":0},206405.15124252101,{"$f":"SUM(R18:R60)","v":0}]
["Planned Returns Above Variable Costs:",null,null,null,null,null,null,null,187.18969751495791,{"$f":"+J13-J61","v":0},null,null,0,{"$f":"+N13-N61","v":0},187.18969751495791,{"$f":"+P13-P61","v":0},93594.848757478991,{"$f":"+R13-R61","v":0}]
[null,"Breakeven Price to Cover Variable Costs",null,null,null,null,4.1281030248504207,{"$f":"IF(E10=0,\"n/a\",(YVarExp-(YTotExp+YTotRet-J10))/E10)","v":"n/a"},"Bushel"]
[null,null,null,null,null,null,null,null,null,null,null,null,null,null,null,null,"Enterprise","Enterprise"]
["FIXED COSTS",null,null,"Quantity","Quantity","Units","$/Unit","$/Unit","Total","Total","Share","Share","Landlord","Landlord","Tenant","Tenant","Total","Total"]
[null,"Machinery Depreciation",null,null,null,null,null,null,"$23.11"]
[null,null,"Tractors/Self-Propelled",1,null,"Acre",14.059714661310679,null,14.059714661310679,{"$f":"E67*H67","v":0},0,null,0,{"$f":"J67*L67","v":0},14.059714661310679,{"$f":"+J67-N67","v":0},7029.857330655339,{"$f":"+J67*E$7","v":0}]
[null,null,"Implements",1,null,"Acre",9.0479024791041009,null,9.0479024791041009,0,0,null,0,{"$f":"J68*L68","v":0},9.0479024791041009,0,4523.9512395520505,0]
[null,"Equipment Investment",null,null,null,null,null,null,"$14.29"]
[null,null,"Tractors/Self-Propelled",107.41485736596064,null,"Dollars",0.08,null,8.5931885892768509,{"$f":"E70*H70","v":0},0,null,0,{"$f":"J70*L70","v":0},8.5931885892768509,{"$f":"+J70-N70","v":0},4296.5942946384257,{"$f":"+J70*E$7","v":0}]
[null,null,"Implements",71.152206647284359,null,"Dollars",0.08,null,5.6921765317827484,0,0,null,0,{"$f":"J71*L71","v":0},5.6921765317827484,0,2846.0882658913742,0]
[null,"Salaried Labor",null,1,null,"Acre",0,null,0,0,0,null,0,{"$f":"J72*L72","v":0},0,{"$f":"+J72-N72","v":0},0,{"$f":"+J72*E$7","v":0}]
[null,"Management Fee, Owner/Operator Labor",null,1,null,"Acre",30,null,30,0,0,null,0,0,30,0,15000,0]
[null,"Allocated Establishment Cost",null,1,null,"Acre",0,null,0,0,0,null,0,0,0,0,0,0]
[null,"UCB - Land Charge",null,1,null,"Acre",85,null,85,0,0,null,0,0,85,0,42500,0]
[null,"Property Taxes",null,1,null,"Acre",0,null,0,0,0,null,0,0,0,0,0,0]
[null,"Whole Farm Insurance",null,1,null,"Acre",0,null,0,0,0,null,0,0,0,0,0,0]
[null,null,null,1,null,null,0,null,0,0,0,null,0,0,0,0,0,0]
[null,null,null,1,null,null,0,null,0,{"$f":"E79*H79","v":0},0,null,0,0,0,0,0,0]
["Total Fixed Costs",null,null,null,null,null,null,null,152.39298226147437,{"$f":"+SUM(J67:J79)","v":0},null,null,0,{"$f":"+SUM(N67:N79)","v":0},152.39298226147437,{"$f":"+SUM(P67:P79)","v":0},76196.49113073718,{"$f":"+SUM(R67:R79)","v":0}]
["Total Specified Costs",null,null,null,null,null,null,null,565.20328474651649,{"$f":"+J61+J80","v":0},null,null,0,{"$f":"+N61+N80","v":0},565.20328474651649,{"$f":"+P61+P80","v":0},282601.64237325819,{"$f":"+R61+R80","v":0}]
[]
["Returns Above Specified Costs",null,null,null,null,null,null,null,34.796715253483512,{"$f":"+J13-J81","v":0},null,null,0,{"$f":"+N13-N81","v":0},34.796715253483512,{"$f":"+P13-P81","v":0},17398.35762674181,{"$f":"+R13-R81","v":0}]
[]
["    Breakeven Price to Cover Total Costs",null,null,null,null,null,5.6520328474651649,{"$f":"IF(E10=0,\"n/a\",(YTotExp-(YTotExp+YTotRet-J10))/E10)","v":"n/a"},"Bushel"]
[]
[null,null,null,"Example Breakeven Prices"]
[null,"Example","Example","To Cover",null,null,"To Cover"]
[null,"Yield","Yield","Variable",null,null,"Total"]
[null,"Percent","Bushel","Costs",null,null,"Costs"]
[null,0.75,75,5.5041373664672282,null,null,7.5360437966202198]
[null,0.9,90,4.5867811387226896,null,null,6.2800364971835165]
[null,1,100,4.1281030248504207,null,null,5.6520328474651649]
[null,1.1000000000000001,110.00000000000001,3.7528209316822001,null,null,5.1382116795137858]
[null,1.25,125,3.3024824198803366,null,null,4.5216262779721319]
[]
["  Developed by Extension Economists, Texas A&M AgriLife Extension Service, budgets@tamu.edu.  "]
[]
["Information presented is prepared solely as a general guide and not intended to recognize or predict the costs and returns from any one operation.  Brand names are mentioned only as examples and imply no endorsement."]

{"sheet":"Soybeans","index":17,"n_rows":97,"n_cols":18,"rows_kept":97,"cut":false,"hidden":false,"merged":[[84,3,84,8],[96,0,96,11],[0,0,0,11],[1,0,1,11],[2,0,2,11],[3,0,3,11]]}
["Projections for Planning Purposes Only -- Not to be Used without Updating"]
["2023 Estimated Costs and Returns per Acre"]
["Soybeans - GMO Seed, Conventional Till-12 Row, Dryland, 30 bu. Yield Goal - Upper Coast"]
["Enter your name for this budget in the cell above."]
["Enter  Your Values in the cells highlighed in MAROON."]
[null,null,null,null,"Your Acres",null,null,null,null,null,null,null,null,null,null,null,null,"Your"]
[null,null,"Crop Acres",500,null,null,null,null,null,null,null,"Your",null,null,null,null,"Enterprise","Enterprise"]
[null,null,null,null,"Your",null,null,"Your","Cash","Your","Landlord","Landlord",null,"Your",null,"Your","Total","Total"]
["REVENUE",null,null,"Quantity","Quantity","Units","$/Unit","$/Unit","Total","Total","Share","Share","Landlord","Landlord","Tenant","Tenant","(500 acres)",{"$f":"\"(\" & E7 & \" acres)\"","v":"( acres)"}]
[null,"Soybeans",null,30,null,"Bushel",12.8,null,384,{"$f":"E10*H10","v":0},0,null,0,{"$f":"J10*L10","v":0},384,{"$f":"+J10-N10","v":0},192000,{"$f":"+J10*E$7","v":0}]
[null,null,null,0,null,null,0,null,0,0,0,null,0,0,0,{"$f":"+J11-N11","v":0},0,0]
[null,null,null,0,null,null,0,null,0,0,0,null,0,0,0,0,0,0]
["Total Revenue",null,null,null,null,null,null,null,384,{"$f":"SUM(J10:J12)","v":0},null,null,0,{"$f":"SUM(N10:N12)","v":0},384,{"$f":"SUM(P10:P12)","v":0},192000,{"$f":"SUM(R10:R12)","v":0}]
[null,null,null,null,null,null,null,null,null,null,null,null,null,null,null,null,"Enterprise","Enterprise"]
["VARIABLE COSTS",null,null,"Quantity","Quantity","Units","$/Unit","$/Unit","Total","Total","Share","Share","Landlord","Landlord","Tenant","Tenant","Total","Total"]
["Production Costs"]
[null,"Herbicide",null,null,null,null,null,null,"$63.36"]
[null,"","Glyphosate",4,null,"Quart",12.25,null,49,{"$f":"E18*H18","v":0},0,null,0,{"$f":"J18*L18","v":0},49,{"$f":"+J18-N18","v":0},24500,{"$f":"+J18*E$7","v":0}]
[null,"","2, 4D Amine`",1,null,"Pint",3.625,null,3.625,0,0,null,0,0,3.625,0,1812.5,0]
[null,"","Soybean PreEmerge Herbicide",1,null,"Pint",10.737800000000002,null,10.737800000000002,0,0,null,0,0,10.737800000000002,0,5368.9000000000005,0]
[null,"Seed",null,null,null,null,null,null,"$65.58"]
[null,"","Roundup Ready Soybean Seed",1,null,"Bag",63.6,null,63.6,0,0,null,0,0,63.6,0,31800,0]
[null,"","Inoculants",1,null,"Bag",1.9822000000000002,null,1.9822000000000002,0,0,null,0,0,1.9822000000000002,0,991.10000000000014,0]
[null,"Custom",null,null,null,null,null,null,"$9.54"]
[null,"","Custom Grain Haul",18,null,"CWT",0.53,null,9.5400000000000009,0,0,null,0,0,9.5400000000000009,0,4770.0000000000009,0]
[null,"Miscellaneous",null,null,null,null,null,null,"$20.13"]
[null,"","Crop Insurance -Soybeans",1,null,"Acre",9,null,9,0,0,null,0,0,9,0,4500,0]
[null,"","G&A Overhead",1,null,"Acre",11.13,null,11.13,0,0,null,0,0,11.13,0,5565,0]
[null,"Insecticide",null,null,null,null,null,null,"$18.75"]
[null,"","Stinkbug Control Soybeans",1.5,null,"Pound",12.5,null,18.75,0,0,null,0,0,18.75,0,9375,0]
[null,"Other Labor",null,null,null,null,null,null,"$3.73"]
[null,"","Hand Labor",0.22,null,"Hour",16.96,null,3.7312000000000003,0,0,null,0,0,3.7312000000000003,0,1865.6000000000001,0]
[null,"Other Chemicals",null,null,null,null,null,null,"$7.02"]
[null,"","Gromoxone",2,null,"Pint",3.5,null,7,0,0,null,0,0,7,0,3500,0]
[null,"","Surfactant",1.2500000000000001E-2,null,"Pint",1.4734,null,1.84175E-2,0,0,null,0,0,1.84175E-2,0,9.2087500000000002,0]
[null,null,null,0,null,null,0,null,0,0,0,null,0,0,0,0,0,0]
[null,null,null,0,null,null,0,null,0,0,0,null,0,0,0,0,0,0]
[null,null,null,0,null,null,0,null,0,{"$f":"E38*H38","v":0},0,null,0,{"$f":"J38*L38","v":0},0,{"$f":"+J38-N38","v":0},0,{"$f":"+J38*E$7","v":0}]
[null,"Machinery Labor",null,null,null,null,null,null,"$6.37"]
[null,null,"Tractors/Self-Propelled",0.37,null,"Hour",17.21,null,6.3677000000000001,{"$f":"E40*H40","v":0},0,null,0,{"$f":"J40*L40","v":0},6.3677000000000001,{"$f":"+J40-N40","v":0},3183.85,{"$f":"+J40*E$7","v":0}]
[null,null,"Other Labor",0,null,"Hour",17.21,null,0,{"$f":"E41*H41","v":0},0,null,0,{"$f":"J41*L41","v":0},0,{"$f":"+J41-N41","v":0},0,{"$f":"+J41*E$7","v":0}]
[]
[null,"Diesel Fuel",null,null,null,null,null,null,"$9.3"]
[null,null,"Pickup/General Use Equipment",1,null,"Acre",0,null,0,{"$f":"E44*H44","v":0},0,null,0,{"$f":"J44*L44","v":0},0,{"$f":"+J44-N44","v":0},0,{"$f":"+J44*E$7","v":0}]
[null,null,"Tractors/Self-Propelled",4.1500000000000004,null,"Gallon",2.2400000000000002,null,9.2960000000000012,{"$f":"E45*H45","v":0},0,null,0,{"$f":"J45*L45","v":0},9.2960000000000012,{"$f":"+J45-N45","v":0},4648.0000000000009,{"$f":"+J45*E$7","v":0}]
[]
[null,"Gasoline",null,null,null,null,null,null,"$0"]
[null,null,"Pickup/General Use Equipment",1,null,"Acre",0,null,0,{"$f":"E48*H48","v":0},0,null,0,{"$f":"J48*L48","v":0},0,{"$f":"+J48-N48","v":0},0,{"$f":"+J48*E$7","v":0}]
[null,null,"Tractors/Self-Propelled",0,null,"Gallon",2.09,null,0,{"$f":"E49*H49","v":0},0,null,0,{"$f":"J49*L49","v":0},0,{"$f":"+J49-N49","v":0},0,{"$f":"+J49*E$7","v":0}]
[]
[null,"Repairs & Maintenance",null,null,null,null,null,null,"$20.27"]
[null,null,"Pickup/General Use Equipment",1,null,"Acre",0,null,0,{"$f":"E52*H52","v":0},0,null,0,{"$f":"J52*L52","v":0},0,{"$f":"+J52-N52","v":0},0,{"$f":"+J52*E$7","v":0}]
[null,null,"Irrigation Equipment",1,null,"Acre",0,null,0,0,0,null,0,0,0,0,0,0]
[null,null,"Tractors/Self-Propelled",1,null,"Acre",13.672359892041003,null,13.672359892041003,0,0,null,0,0,13.672359892041003,0,6836.1799460205011,0]
[null,null,"Implements",1,null,"Acre",6.6011323901804193,null,6.6011323901804193,0,0,null,0,0,6.6011323901804193,0,3300.5661950902095,0]
[null,null,null,null,null,null,null,null,0,0,0,null,0,0,0,0,0,0]
[null,null,null,null,null,null,null,null,0,0,0,null,0,0,0,0,0,0]
[null,"Interest on Credit Line",null,null,null,null,0.08,null,8.6237639941640918,{"$f":"+SUM(J17:J57)/2*H58","v":0},null,null,0,{"$f":"+SUM(N17:N57)/2*L58","v":0},8.6237639941640918,{"$f":"+SUM(P17:P57)/2*L58","v":0},4311.8819970820459,{"$f":"+J58*E$7","v":0}]
["Total Variable Costs",null,null,null,null,null,null,null,232.67557377638551,{"$f":"SUM(J18:J58)","v":0},null,null,0,{"$f":"SUM(N18:N58)","v":0},232.67557377638551,{"$f":"SUM(P18:P58)","v":0},116337.78688819279,{"$f":"SUM(R18:R58)","v":0}]
["Planned Returns Above Variable Costs:",null,null,null,null,null,null,null,151.32442622361449,{"$f":"+J13-J59","v":0},null,null,0,{"$f":"+N13-N59","v":0},151.32442622361449,{"$f":"+P13-P59","v":0},75662.213111807214,{"$f":"+R13-R59","v":0}]
[null,"Breakeven Price to Cover Variable Costs",null,null,null,null,7.7558524592128499,{"$f":"IF(E10=0,\"n/a\",(YVarExp-(YTotExp+YTotRet-J10))/E10)","v":"n/a"},"Bushel"]
[null,null,null,null,null,null,null,null,null,null,null,null,null,null,null,null,"Enterprise","Enterprise"]
["FIXED COSTS",null,null,"Quantity","Quantity","Units","$/Unit","$/Unit","Total","Total","Share","Share","Landlord","Landlord","Tenant","Tenant","Total","Total"]
[null,"Machinery Depreciation",null,null,null,null,null,null,"$22.97"]
[null,null,"Tractors/Self-Propelled",1,null,"Acre",15.204687065354548,null,15.204687065354548,{"$f":"E65*H65","v":0},0,null,0,{"$f":"J65*L65","v":0},15.204687065354548,{"$f":"+J65-N65","v":0},7602.3435326772742,{"$f":"+J65*E$7","v":0}]
[null,null,"Implements",1,null,"Acre",7.7623172637444267,null,7.7623172637444267,0,0,null,0,{"$f":"J66*L66","v":0},7.7623172637444267,0,3881.1586318722134,0]
[null,"Equipment Investment",null,null,null,null,null,null,"$13.77"]
[null,null,"Tractors/Self-Propelled",115.48358836701911,null,"Dollars",0.08,null,9.2386870693615286,{"$f":"E68*H68","v":0},0,null,0,{"$f":"J68*L68","v":0},9.2386870693615286,{"$f":"+J68-N68","v":0},4619.3435346807646,{"$f":"+J68*E$7","v":0}]
[null,null,"Implements",56.602282368397759,null,"Dollars",0.08,null,4.5281825894718208,0,0,null,0,{"$f":"J69*L69","v":0},4.5281825894718208,0,2264.0912947359102,0]
[null,"Salaried Labor",null,1,null,"Acre",0,null,0,0,0,null,0,{"$f":"J70*L70","v":0},0,{"$f":"+J70-N70","v":0},0,{"$f":"+J70*E$7","v":0}]
[null,"Management Fee, Owner/Operator Labor",null,1,null,"Acre",19.200000000000003,null,19.200000000000003,0,0,null,0,0,19.200000000000003,0,9600.0000000000018,0]
[null,"Allocated Establishment Cost",null,1,null,"Acre",0,null,0,0,0,null,0,0,0,0,0,0]
[null,"UCB - Land Charge",null,1,null,"Acre",85,null,85,0,0,null,0,0,85,0,42500,0]
[null,"Property Taxes",null,1,null,"Acre",0,null,0,0,0,null,0,0,0,0,0,0]
[null,"Whole Farm Insurance",null,1,null,"Acre",0,null,0,0,0,null,0,0,0,0,0,0]
[null,null,null,1,null,null,0,null,0,0,0,null,0,0,0,0,0,0]
[null,null,null,1,null,null,0,null,0,{"$f":"E77*H77","v":0},0,null,0,0,0,0,0,0]
["Total Fixed Costs",null,null,null,null,null,null,null,140.93387398793232,{"$f":"+SUM(J65:J77)","v":0},null,null,0,{"$f":"+SUM(N65:N77)","v":0},140.93387398793232,{"$f":"+SUM(P65:P77)","v":0},70466.93699396617,{"$f":"+SUM(R65:R77)","v":0}]
["Total Specified Costs",null,null,null,null,null,null,null,373.60944776431779,{"$f":"+J59+J78","v":0},null,null,0,{"$f":"+N59+N78","v":0},373.60944776431779,{"$f":"+P59+P78","v":0},186804.72388215896,{"$f":"+R59+R78","v":0}]
[]
["Returns Above Specified Costs",null,null,null,null,null,null,null,10.390552235682208,{"$f":"+J13-J79","v":0},null,null,0,{"$f":"+N13-N79","v":0},10.390552235682208,{"$f":"+P13-P79","v":0},5195.2761178410437,{"$f":"+R13-R79","v":0}]
[]
["    Breakeven Price to Cover Total Costs",null,null,null,null,null,12.453648258810594,{"$f":"IF(E10=0,\"n/a\",(YTotExp-(YTotExp+YTotRet-J10))/E10)","v":"n/a"},"Bushel"]
[]
[null,null,null,"Example Breakeven Prices"]
[null,"Example","Example","To Cover",null,null,"To Cover"]
[null,"Yield","Yield","Variable",null,null,"Total"]
[null,"Percent","Bushel","Costs",null,null,"Costs"]
[null,0.75,22.5,10.341136612283801,null,null,16.604864345080792]
[null,0.9,27,8.6176138435698331,null,null,13.837386954233992]
[null,1,30,7.7558524592128499,null,null,12.453648258810594]
[null,1.1000000000000001,33,7.050774962920773,null,null,11.321498417100539]
[null,1.25,37.5,6.2046819673702798,null,null,9.9629186070484739]
[]
["  Developed by Extension Economists, Texas A&M AgriLife Extension Service, budgets@tamu.edu.  "]
[]
["Information presented is prepared solely as a general guide and not intended to recognize or predict the costs and returns from any one operation.  Brand names are mentioned only as examples and imply no endorsement."]

{"sheet":"CoastalHay","index":18,"n_rows":88,"n_cols":18,"rows_kept":88,"cut":false,"hidden":false,"merged":[[75,3,75,8],[87,0,87,11],[0,0,0,11],[1,0,1,11],[2,0,2,11],[3,0,3,11]]}
["Projections for Planning Purposes Only -- Not to be Used without Updating"]
["2023 Estimated Costs and Returns per Acre"]
["Coastal Bermudagrass Hay and Grazing (3 Cuttings)"]
["Enter your name for this budget in the cell above."]
["Enter  Your Values in the cells highlighed in MAROON."]
[null,null,null,null,"Your Acres",null,null,null,null,null,null,null,null,null,null,null,null,"Your"]
[null,null,"Crop Acres",100,null,null,null,null,null,null,null,"Your",null,null,null,null,"Enterprise","Enterprise"]
[null,null,null,null,"Your",null,null,"Your","Cash","Your","Landlord","Landlord",null,"Your",null,"Your","Total","Total"]
["REVENUE",null,null,"Quantity","Quantity","Units","$/Unit","$/Unit","Total","Total","Share","Share","Landlord","Landlord","Tenant","Tenant","(100 acres)",{"$f":"\"(\" & E7 & \" acres)\"","v":"( acres)"}]
[null,"Coastal Hay",null,9,null,"Roll",195,null,1755,{"$f":"E10*H10","v":0},0,null,0,{"$f":"J10*L10","v":0},1755,{"$f":"+J10-N10","v":0},175500,{"$f":"+J10*E$7","v":0}]
[null,"Coastal Grazing",null,2,null,"AUM",15,null,30,0,0,null,0,0,30,{"$f":"+J11-N11","v":0},3000,0]
[null,null,null,0,null,null,0,null,0,0,0,null,0,0,0,0,0,0]
[null,null,null,0,null,null,0,null,0,0,0,null,0,0,0,0,0,0]
["Total Revenue",null,null,null,null,null,null,null,1785,{"$f":"SUM(J10:J13)","v":0},null,null,0,{"$f":"SUM(N10:N13)","v":0},1785,{"$f":"SUM(P10:P13)","v":0},178500,{"$f":"SUM(R10:R13)","v":0}]
[null,null,null,null,null,null,null,null,null,null,null,null,null,null,null,null,"Enterprise","Enterprise"]
["VARIABLE COSTS",null,null,"Quantity","Quantity","Units","$/Unit","$/Unit","Total","Total","Share","Share","Landlord","Landlord","Tenant","Tenant","Total","Total"]
["Production Costs"]
[null,"Herbicide",null,null,null,null,null,null,"$10.12"]
[null,"","Broadleaf Herbicide",1.5,null,"Pint",6.75,null,10.125,{"$f":"E19*H19","v":0},0,null,0,{"$f":"J19*L19","v":0},10.125,{"$f":"+J19-N19","v":0},1012.5,{"$f":"+J19*E$7","v":0}]
[null,"Fertilizer",null,null,null,null,null,null,"$172.8"]
[null,"","24-8-0",0.30000000000000004,null,"Ton",576,null,172.8,0,0,null,0,0,172.8,0,17280,0]
[null,"Custom",null,null,null,null,null,null,"$46.75"]
[null,"","Custom Spread Truck",3,null,"Acre",15.582000000000001,null,46.746000000000002,0,0,null,0,0,46.746000000000002,0,4674.6000000000004,0]
[null,"Miscellaneous",null,null,null,null,null,null,"$13.85"]
[null,"","Hay Wrap",9,null,"Bale",1.5158,null,13.642200000000001,0,0,null,0,0,13.642200000000001,0,1364.22,0]
[null,"","Soil Test",1,null,"Acre",0.21200000000000002,null,0.21200000000000002,0,0,null,0,0,0.21200000000000002,0,21.200000000000003,0]
[null,null,null,0,null,null,0,null,0,0,0,null,0,0,0,0,0,0]
[null,null,null,0,null,null,0,null,0,0,0,null,0,0,0,0,0,0]
[null,null,null,0,null,null,0,null,0,{"$f":"E29*H29","v":0},0,null,0,{"$f":"J29*L29","v":0},0,{"$f":"+J29-N29","v":0},0,{"$f":"+J29*E$7","v":0}]
[null,"Machinery Labor",null,null,null,null,null,null,"$30.63"]
[null,null,"Tractors/Self-Propelled",1.78,null,"Hour",17.21,null,30.633800000000001,{"$f":"E31*H31","v":0},0,null,0,{"$f":"J31*L31","v":0},30.633800000000001,{"$f":"+J31-N31","v":0},3063.38,{"$f":"+J31*E$7","v":0}]
[null,null,"Other Labor",0,null,"Hour",17.21,null,0,{"$f":"E32*H32","v":0},0,null,0,{"$f":"J32*L32","v":0},0,{"$f":"+J32-N32","v":0},0,{"$f":"+J32*E$7","v":0}]
[]
[null,"Diesel Fuel",null,null,null,null,null,null,"$18.59"]
[null,null,"Pickup/General Use Equipment",1,null,"Acre",0,null,0,{"$f":"E35*H35","v":0},0,null,0,{"$f":"J35*L35","v":0},0,{"$f":"+J35-N35","v":0},0,{"$f":"+J35*E$7","v":0}]
[null,null,"Tractors/Self-Propelled",8.3000000000000007,null,"Gallon",2.2400000000000002,null,18.592000000000002,{"$f":"E36*H36","v":0},0,null,0,{"$f":"J36*L36","v":0},18.592000000000002,{"$f":"+J36-N36","v":0},1859.2000000000003,{"$f":"+J36*E$7","v":0}]
[]
[null,"Gasoline",null,null,null,null,null,null,"$0"]
[null,null,"Pickup/General Use Equipment",1,null,"Acre",0,null,0,{"$f":"E39*H39","v":0},0,null,0,{"$f":"J39*L39","v":0},0,{"$f":"+J39-N39","v":0},0,{"$f":"+J39*E$7","v":0}]
[null,null,"Tractors/Self-Propelled",0,null,"Gallon",2.09,null,0,{"$f":"E40*H40","v":0},0,null,0,{"$f":"J40*L40","v":0},0,{"$f":"+J40-N40","v":0},0,{"$f":"+J40*E$7","v":0}]
[]
[null,"Repairs & Maintenance",null,null,null,null,null,null,"$22.86"]
[null,null,"Pickup/General Use Equipment",1,null,"Acre",0,null,0,{"$f":"E43*H43","v":0},0,null,0,{"$f":"J43*L43","v":0},0,{"$f":"+J43-N43","v":0},0,{"$f":"+J43*E$7","v":0}]
[null,null,"Irrigation Equipment",1,null,"Acre",0,null,0,0,0,null,0,0,0,0,0,0]
[null,null,"Tractors/Self-Propelled",1,null,"Acre",13.229220842191044,null,13.229220842191044,0,0,null,0,0,13.229220842191044,0,1322.9220842191044,0]
[null,null,"Implements",1,null,"Acre",9.6258142418981496,null,9.6258142418981496,0,0,null,0,0,9.6258142418981496,0,962.58142418981492,0]
[null,null,null,null,null,null,null,null,0,0,0,null,0,0,0,0,0,0]
[null,null,null,null,null,null,null,null,0,0,0,null,0,0,0,0,0,0]
[null,"Interest on Credit Line",null,null,null,null,0.08,null,9.744300274523388,{"$f":"+SUM(J18:J48)/2*H49","v":0},null,null,0,{"$f":"+SUM(N18:N48)/2*L49","v":0},9.744300274523388,{"$f":"+SUM(P18:P48)/2*L49","v":0},974.43002745233878,{"$f":"+J49*E$7","v":0}]
["Total Variable Costs",null,null,null,null,null,null,null,325.35033535861254,{"$f":"SUM(J19:J49)","v":0},null,null,0,{"$f":"SUM(N19:N49)","v":0},325.35033535861254,{"$f":"SUM(P19:P49)","v":0},32535.033535861257,{"$f":"SUM(R19:R49)","v":0}]
["Planned Returns Above Variable Costs:",null,null,null,null,null,null,null,1459.6496646413875,{"$f":"+J14-J50","v":0},null,null,0,{"$f":"+N14-N50","v":0},1459.6496646413875,{"$f":"+P14-P50","v":0},145964.96646413874,{"$f":"+R14-R50","v":0}]
[null,"Breakeven Price to Cover Variable Costs",null,null,null,null,32.816703928734725,{"$f":"IF(E10=0,\"n/a\",(YVarExp-(YTotExp+YTotRet-J10))/E10)","v":"n/a"},"Roll"]
[null,null,null,null,null,null,null,null,null,null,null,null,null,null,null,null,"Enterprise","Enterprise"]
["FIXED COSTS",null,null,"Quantity","Quantity","Units","$/Unit","$/Unit","Total","Total","Share","Share","Landlord","Landlord","Tenant","Tenant","Total","Total"]
[null,"Machinery Depreciation",null,null,null,null,null,null,"$26.84"]
[null,null,"Tractors/Self-Propelled",1,null,"Acre",11.563483129098167,null,11.563483129098167,{"$f":"E56*H56","v":0},0,null,0,{"$f":"J56*L56","v":0},11.563483129098167,{"$f":"+J56-N56","v":0},1156.3483129098167,{"$f":"+J56*E$7","v":0}]
[null,null,"Implements",1,null,"Acre",15.281040676876653,null,15.281040676876653,0,0,null,0,{"$f":"J57*L57","v":0},15.281040676876653,0,1528.1040676876653,0]
[null,"Equipment Investment",null,null,null,null,null,null,"$16.32"]
[null,null,"Tractors/Self-Propelled",90.08326373152282,null,"Dollars",0.08,null,7.2066610985218258,{"$f":"E59*H59","v":0},0,null,0,{"$f":"J59*L59","v":0},7.2066610985218258,{"$f":"+J59-N59","v":0},720.66610985218256,{"$f":"+J59*E$7","v":0}]
[null,null,"Implements",113.92900146846067,null,"Dollars",0.08,null,9.1143201174768542,0,0,null,0,{"$f":"J60*L60","v":0},9.1143201174768542,0,911.43201174768546,0]
[null,"Salaried Labor",null,1,null,"Acre",0,null,0,0,0,null,0,{"$f":"J61*L61","v":0},0,{"$f":"+J61-N61","v":0},0,{"$f":"+J61*E$7","v":0}]
[null,"Management Fee, Owner/Operator Labor",null,1,null,"Acre",0,null,0,0,0,null,0,0,0,0,0,0]
[null,"Allocated Establishment Cost",null,1,null,"Acre",0,null,0,0,0,null,0,0,0,0,0,0]
[null,"Land - Hay Meadow",null,1,null,"Acre",25,null,25,0,0,null,0,0,25,0,2500,0]
[null,"Property Taxes",null,1,null,"Acre",0,null,0,0,0,null,0,0,0,0,0,0]
[null,"Whole Farm Insurance",null,1,null,"Acre",0,null,0,0,0,null,0,0,0,0,0,0]
[null,null,null,1,null,null,0,null,0,0,0,null,0,0,0,0,0,0]
[null,null,null,1,null,null,0,null,0,{"$f":"E68*H68","v":0},0,null,0,0,0,0,0,0]
["Total Fixed Costs",null,null,null,null,null,null,null,68.165505021973502,{"$f":"+SUM(J56:J68)","v":0},null,null,0,{"$f":"+SUM(N56:N68)","v":0},68.165505021973502,{"$f":"+SUM(P56:P68)","v":0},6816.5505021973504,{"$f":"+SUM(R56:R68)","v":0}]
["Total Specified Costs",null,null,null,null,null,null,null,393.51584038058604,{"$f":"+J50+J69","v":0},null,null,0,{"$f":"+N50+N69","v":0},393.51584038058604,{"$f":"+P50+P69","v":0},39351.584038058609,{"$f":"+R50+R69","v":0}]
[]
["Returns Above Specified Costs",null,null,null,null,null,null,null,1391.484159619414,{"$f":"+J14-J70","v":0},null,null,0,{"$f":"+N14-N70","v":0},1391.484159619414,{"$f":"+P14-P70","v":0},139148.41596194138,{"$f":"+R14-R70","v":0}]
[]
["    Breakeven Price to Cover Total Costs",null,null,null,null,null,40.39064893117623,{"$f":"IF(E10=0,\"n/a\",(YTotExp-(YTotExp+YTotRet-J10))/E10)","v":"n/a"},"Roll"]
[]
[null,null,null,"Example Breakeven Prices"]
[null,"Example","Example","To Cover",null,null,"To Cover"]
[null,"Yield","Yield","Variable",null,null,"Total"]
[null,"Percent","Roll","Costs",null,null,"Costs"]
[null,0.75,6.75,43.755605238312967,null,null,53.854198574901638]
[null,0.9,8.1,36.463004365260808,null,null,44.87849881241803]
[null,1,9,32.816703928734725,null,null,40.39064893117623]
[null,1.1000000000000001,9.9,29.833367207940661,null,null,36.718771755614753]
[null,1.25,11.25,26.25336314298778,null,null,32.312519144940978]
[]
["  Developed by Extension Economists, Texas A&M AgriLife Extension Service, budgets@tamu.edu.  "]
[]
["Information presented is prepared solely as a general guide and not intended to recognize or predict the costs and returns from any one operation.  Brand names are mentioned only as examples and imply no endorsement."]

{"sheet":"CoastalPasture","index":19,"n_rows":92,"n_cols":18,"rows_kept":92,"cut":false,"hidden":false,"merged":[[79,3,79,8],[91,0,91,11],[0,0,0,11],[1,0,1,11],[2,0,2,11],[3,0,3,11]]}
["Projections for Planning Purposes Only -- Not to be Used without Updating"]
["2023 Estimated Costs and Returns per Acre"]
["Coastal Bermudagrass Pasture"]
["Enter your name for this budget in the cell above."]
["Enter  Your Values in the cells highlighed in MAROON."]
[null,null,null,null,"Your Acres",null,null,null,null,null,null,null,null,null,null,null,null,"Your"]
[null,null,"Crop Acres",400,null,null,null,null,null,null,null,"Your",null,null,null,null,"Enterprise","Enterprise"]
[null,null,null,null,"Your",null,null,"Your","Cash","Your","Landlord","Landlord",null,"Your",null,"Your","Total","Total"]
["REVENUE",null,null,"Quantity","Quantity","Units","$/Unit","$/Unit","Total","Total","Share","Share","Landlord","Landlord","Tenant","Tenant","(400 acres)",{"$f":"\"(\" & E7 & \" acres)\"","v":"( acres)"}]
[null,0,null,0,null,"",0,null,0,{"$f":"E10*H10","v":0},0,null,0,{"$f":"J10*L10","v":0},0,{"$f":"+J10-N10","v":0},0,{"$f":"+J10*E$7","v":0}]
[null,null,null,0,null,null,0,null,0,0,0,null,0,0,0,{"$f":"+J11-N11","v":0},0,0]
[null,null,null,0,null,null,0,null,0,0,0,null,0,0,0,0,0,0]
["Total Revenue",null,null,null,null,null,null,null,0,{"$f":"SUM(J10:J12)","v":0},null,null,0,{"$f":"SUM(N10:N12)","v":0},0,{"$f":"SUM(P10:P12)","v":0},0,{"$f":"SUM(R10:R12)","v":0}]
[null,null,null,null,null,null,null,null,null,null,null,null,null,null,null,null,"Enterprise","Enterprise"]
["VARIABLE COSTS",null,null,"Quantity","Quantity","Units","$/Unit","$/Unit","Total","Total","Share","Share","Landlord","Landlord","Tenant","Tenant","Total","Total"]
["Production Costs"]
[null,"Herbicide",null,null,null,null,null,null,"$17.54"]
[null,"","Broadleaf Herbicide",1.5,null,"Pint",6.75,null,10.125,{"$f":"E18*H18","v":0},0,null,0,{"$f":"J18*L18","v":0},10.125,{"$f":"+J18-N18","v":0},4050,{"$f":"+J18*E$7","v":0}]
[null,"","Custom Pasture Spray",1,null,"Acre",7.42,null,7.42,0,0,null,0,0,7.42,0,2968,0]
[null,"Fertilizer",null,null,null,null,null,null,"$57.6"]
[null,"","24-8-0",0.1,null,"Ton",576,null,57.6,0,0,null,0,0,57.6,0,23040,0]
[null,"Custom",null,null,null,null,null,null,"$15.58"]
[null,"","Custom Spread Truck",1,null,"Acre",15.582000000000001,null,15.582000000000001,0,0,null,0,0,15.582000000000001,0,6232.8,0]
[null,"Miscellaneous",null,null,null,null,null,null,"$0.21"]
[null,"","Soil Test",1,null,"Acre",0.21200000000000002,null,0.21200000000000002,0,0,null,0,0,0.21200000000000002,0,84.800000000000011,0]
[null,null,null,0,null,null,0,null,0,0,0,null,0,0,0,0,0,0]
[null,null,null,0,null,null,0,null,0,0,0,null,0,0,0,0,0,0]
[null,null,null,0,null,null,0,null,0,{"$f":"E28*H28","v":0},0,null,0,{"$f":"J28*L28","v":0},0,{"$f":"+J28-N28","v":0},0,{"$f":"+J28*E$7","v":0}]
[null,"Irrigation",null,null,null,null,null,null,"$22.54"]
[null,null,"Energy Cost",7,null,"AcreInch",2.1,null,14.700000000000001,{"$f":"E30*H30","v":0},0,null,0,{"$f":"J30*L30","v":0},14.700000000000001,{"$f":"+J30-N30","v":0},5880,{"$f":"+J30*E$7","v":0}]
[null,null,"Irrigation Labor",0.44799999999999995,null,"Hour",17.5,null,7.839999999999999,0,0,null,0,0,7.839999999999999,0,3135.9999999999995,0]
[null,"Machinery Labor",null,null,null,null,null,null,"$2.93"]
[null,null,"Tractors/Self-Propelled",0.17,null,"Hour",17.21,null,2.9257000000000004,{"$f":"E33*H33","v":0},0,null,0,{"$f":"J33*L33","v":0},2.9257000000000004,{"$f":"+J33-N33","v":0},1170.2800000000002,{"$f":"+J33*E$7","v":0}]
[null,null,"Other Labor",0,null,"Hour",17.21,null,0,{"$f":"E34*H34","v":0},0,null,0,{"$f":"J34*L34","v":0},0,{"$f":"+J34-N34","v":0},0,{"$f":"+J34*E$7","v":0}]
[]
[null,"Diesel Fuel",null,null,null,null,null,null,"$1.72"]
[null,null,"Pickup/General Use Equipment",1,null,"Acre",0,null,0,{"$f":"E37*H37","v":0},0,null,0,{"$f":"J37*L37","v":0},0,{"$f":"+J37-N37","v":0},0,{"$f":"+J37*E$7","v":0}]
[null,null,"Tractors/Self-Propelled",0.77,null,"Gallon",2.2400000000000002,null,1.7248000000000001,{"$f":"E38*H38","v":0},0,null,0,{"$f":"J38*L38","v":0},1.7248000000000001,{"$f":"+J38-N38","v":0},689.92000000000007,{"$f":"+J38*E$7","v":0}]
[]
[null,"Gasoline",null,null,null,null,null,null,"$0"]
[null,null,"Pickup/General Use Equipment",1,null,"Acre",0,null,0,{"$f":"E41*H41","v":0},0,null,0,{"$f":"J41*L41","v":0},0,{"$f":"+J41-N41","v":0},0,{"$f":"+J41*E$7","v":0}]
[null,null,"Tractors/Self-Propelled",0,null,"Gallon",2.09,null,0,{"$f":"E42*H42","v":0},0,null,0,{"$f":"J42*L42","v":0},0,{"$f":"+J42-N42","v":0},0,{"$f":"+J42*E$7","v":0}]
[]
[null,"Repairs & Maintenance",null,null,null,null,null,null,"$28.15"]
[null,null,"Pickup/General Use Equipment",1,null,"Acre",0,null,0,{"$f":"E45*H45","v":0},0,null,0,{"$f":"J45*L45","v":0},0,{"$f":"+J45-N45","v":0},0,{"$f":"+J45*E$7","v":0}]
[null,null,"Irrigation Equipment",1,null,"Acre",26.25,null,26.25,0,0,null,0,0,26.25,0,10500,0]
[null,null,"Tractors/Self-Propelled",1,null,"Acre",1.2300492931547615,null,1.2300492931547615,0,0,null,0,0,1.2300492931547615,0,492.01971726190459,0]
[null,null,"Implements",1,null,"Acre",0.6667433449074075,null,0.6667433449074075,0,0,null,0,0,0.6667433449074075,0,266.69733796296299,0]
[null,null,null,null,null,null,null,null,0,0,0,null,0,0,0,0,0,0]
[null,null,null,null,null,null,null,null,0,0,0,null,0,0,0,0,0,0]
[null,"Interest on Credit Line",null,null,null,null,0.08,null,5.3718691981658164,{"$f":"+SUM(J17:J50)/2*H51","v":0},null,null,0,{"$f":"+SUM(N17:N50)/2*L51","v":0},5.3718691981658164,{"$f":"+SUM(P17:P50)/2*L51","v":0},2148.7476792663265,{"$f":"+J51*E$7","v":0}]
["Total Variable Costs",null,null,null,null,null,null,null,151.64816183622801,{"$f":"SUM(J18:J51)","v":0},null,null,0,{"$f":"SUM(N18:N51)","v":0},151.64816183622801,{"$f":"SUM(P18:P51)","v":0},60659.264734491204,{"$f":"SUM(R18:R51)","v":0}]
["Planned Returns Above Variable Costs:",null,null,null,null,null,null,null,-151.64816183622801,{"$f":"+J13-J52","v":0},null,null,0,{"$f":"+N13-N52","v":0},-151.64816183622801,{"$f":"+P13-P52","v":0},-60659.264734491204,{"$f":"+R13-R52","v":0}]
[null,"Breakeven Price to Cover Variable Costs",null,null,null,null,"n/a",{"$f":"IF(E10=0,\"n/a\",(YVarExp-(YTotExp+YTotRet-J10))/E10)","v":"n/a"},""]
[null,null,null,null,null,null,null,null,null,null,null,null,null,null,null,null,"Enterprise","Enterprise"]
["FIXED COSTS",null,null,"Quantity","Quantity","Units","$/Unit","$/Unit","Total","Total","Share","Share","Landlord","Landlord","Tenant","Tenant","Total","Total"]
[null,"Machinery Depreciation",null,null,null,null,null,null,"$19.31"]
[null,null,"Irrigation Equipment",1,null,"Acre",16.7925,null,16.7925,{"$f":"E58*H58","v":0},0,null,0,{"$f":"J58*L58","v":0},16.7925,{"$f":"+J58-N58","v":0},6717,{"$f":"+J58*E$7","v":0}]
[null,null,"Tractors/Self-Propelled",1,null,"Acre",1.0168407490079363,null,1.0168407490079363,0,0,null,0,{"$f":"J59*L59","v":0},1.0168407490079363,0,406.73629960317453,0]
[null,null,"Implements",1,null,"Acre",1.5001725260416665,null,1.5001725260416665,0,0,null,0,{"$f":"J60*L60","v":0},1.5001725260416665,0,600.06901041666663,0]
[null,"Equipment Investment",null,null,null,null,null,null,"$13.65"]
[null,null,"Irrigation Equipment",156.30625000000001,null,"Dollars",0.08,null,12.5045,{"$f":"E62*H62","v":0},0,null,0,{"$f":"J62*L62","v":0},12.5045,{"$f":"+J62-N62","v":0},5001.8,{"$f":"+J62*E$7","v":0}]
[null,null,"Tractors/Self-Propelled",7.9215174479166652,null,"Dollars",0.08,null,0.6337213958333332,0,0,null,0,{"$f":"J63*L63","v":0},0.6337213958333332,0,253.48855833333329,0]
[null,null,"Implements",6.417404694733797,null,"Dollars",0.08,null,0.51339237557870376,0,0,null,0,{"$f":"J64*L64","v":0},0.51339237557870376,0,205.35695023148151,0]
[null,"Salaried Labor",null,1,null,"Acre",0,null,0,0,0,null,0,{"$f":"J65*L65","v":0},0,{"$f":"+J65-N65","v":0},0,{"$f":"+J65*E$7","v":0}]
[null,"Management Fee, Owner/Operator Labor",null,1,null,"Acre",0,null,0,0,0,null,0,0,0,0,0,0]
[null,"Allocated Establishment Cost",null,1,null,"Acre",0,null,0,0,0,null,0,0,0,0,0,0]
[null,"None",null,1,null,"Acre",0,null,0,0,0,null,0,0,0,0,0,0]
[null,"Property Taxes",null,1,null,"Acre",0,null,0,0,0,null,0,0,0,0,0,0]
[null,"Whole Farm Insurance",null,1,null,"Acre",0,null,0,0,0,null,0,0,0,0,0,0]
[null,null,null,1,null,null,0,null,0,0,0,null,0,0,0,0,0,0]
[null,null,null,1,null,null,0,null,0,{"$f":"E72*H72","v":0},0,null,0,0,0,0,0,0]
["Total Fixed Costs",null,null,null,null,null,null,null,32.961127046461641,{"$f":"+SUM(J58:J72)","v":0},null,null,0,{"$f":"+SUM(N58:N72)","v":0},32.961127046461641,{"$f":"+SUM(P58:P72)","v":0},13184.450818584655,{"$f":"+SUM(R58:R72)","v":0}]
["Total Specified Costs",null,null,null,null,null,null,null,184.60928888268967,{"$f":"+J52+J73","v":0},null,null,0,{"$f":"+N52+N73","v":0},184.60928888268967,{"$f":"+P52+P73","v":0},73843.715553075861,{"$f":"+R52+R73","v":0}]
[]
["Returns Above Specified Costs",null,null,null,null,null,null,null,-184.60928888268967,{"$f":"+J13-J74","v":0},null,null,0,{"$f":"+N13-N74","v":0},-184.60928888268967,{"$f":"+P13-P74","v":0},-73843.715553075861,{"$f":"+R13-R74","v":0}]
[]
["    Breakeven Price to Cover Total Costs",null,null,null,null,null,"n/a",{"$f":"IF(E10=0,\"n/a\",(YTotExp-(YTotExp+YTotRet-J10))/E10)","v":"n/a"},""]
[]
[null,null,null,"Example Breakeven Prices"]
[null,"Example","Example","To Cover",null,null,"To Cover"]
[null,"Yield","Yield","Variable",null,null,"Total"]
[null,"Percent","","Costs",null,null,"Costs"]
[null,0.75,0,0,null,null,0]
[null,0.9,0,0,null,null,0]
[null,1,0,0,null,null,0]
[null,1.1000000000000001,0,0,null,null,0]
[null,1.25,0,0,null,null,0]
[]
["  Developed by Extension Economists, Texas A&M AgriLife Extension Service, budgets@tamu.edu.  "]
[]
["Information presented is prepared solely as a general guide and not intended to recognize or predict the costs and returns from any one operation.  Brand names are mentioned only as examples and imply no endorsement."]

{"sheet":"SorghumHay","index":20,"n_rows":87,"n_cols":18,"rows_kept":87,"cut":false,"hidden":false,"merged":[[74,3,74,8],[86,0,86,11],[0,0,0,11],[1,0,1,11],[2,0,2,11],[3,0,3,11]]}
["Projections for Planning Purposes Only -- Not to be Used without Updating"]
["2023 Estimated Costs and Returns per Acre"]
["Sorghum Hay (2 Cuttings)"]
["Enter your name for this budget in the cell above."]
["Enter  Your Values in the cells highlighed in MAROON."]
[null,null,null,null,"Your Acres",null,null,null,null,null,null,null,null,null,null,null,null,"Your"]
[null,null,"Crop Acres",100,null,null,null,null,null,null,null,"Your",null,null,null,null,"Enterprise","Enterprise"]
[null,null,null,null,"Your",null,null,"Your","Cash","Your","Landlord","Landlord",null,"Your",null,"Your","Total","Total"]
["REVENUE",null,null,"Quantity","Quantity","Units","$/Unit","$/Unit","Total","Total","Share","Share","Landlord","Landlord","Tenant","Tenant","(100 acres)",{"$f":"\"(\" & E7 & \" acres)\"","v":"( acres)"}]
[null,"Sorghum Hay",null,8,null,"Roll",90,null,720,{"$f":"E10*H10","v":0},0,null,0,{"$f":"J10*L10","v":0},720,{"$f":"+J10-N10","v":0},72000,{"$f":"+J10*E$7","v":0}]
[null,null,null,0,null,null,0,null,0,0,0,null,0,0,0,{"$f":"+J11-N11","v":0},0,0]
[null,null,null,0,null,null,0,null,0,0,0,null,0,0,0,0,0,0]
["Total Revenue",null,null,null,null,null,null,null,720,{"$f":"SUM(J10:J12)","v":0},null,null,0,{"$f":"SUM(N10:N12)","v":0},720,{"$f":"SUM(P10:P12)","v":0},72000,{"$f":"SUM(R10:R12)","v":0}]
[null,null,null,null,null,null,null,null,null,null,null,null,null,null,null,null,"Enterprise","Enterprise"]
["VARIABLE COSTS",null,null,"Quantity","Quantity","Units","$/Unit","$/Unit","Total","Total","Share","Share","Landlord","Landlord","Tenant","Tenant","Total","Total"]
["Production Costs"]
[null,"Seed",null,null,null,null,null,null,"$11.92"]
[null,"","Sorghum Hay Seed",15,null,"Pound",0.79500000000000004,null,11.925000000000001,{"$f":"E18*H18","v":0},0,null,0,{"$f":"J18*L18","v":0},11.925000000000001,{"$f":"+J18-N18","v":0},1192.5,{"$f":"+J18*E$7","v":0}]
[null,"Fertilizer",null,null,null,null,null,null,"$155.81"]
[null,"","24-8-0",0.27050000000000002,null,"Ton",576,null,155.80800000000002,0,0,null,0,0,155.80800000000002,0,15580.800000000003,0]
[null,"Custom",null,null,null,null,null,null,"$31.16"]
[null,"","Custom Spread Truck",2,null,"Acre",15.582000000000001,null,31.164000000000001,0,0,null,0,0,31.164000000000001,0,3116.4,0]
[null,"Miscellaneous",null,null,null,null,null,null,"$12.34"]
[null,"","Hay Wrap",8,null,"Bale",1.5158,null,12.1264,0,0,null,0,0,12.1264,0,1212.6400000000001,0]
[null,"","Soil Test",1,null,"Acre",0.21200000000000002,null,0.21200000000000002,0,0,null,0,0,0.21200000000000002,0,21.200000000000003,0]
[null,null,null,0,null,null,0,null,0,0,0,null,0,0,0,0,0,0]
[null,null,null,0,null,null,0,null,0,0,0,null,0,0,0,0,0,0]
[null,null,null,0,null,null,0,null,0,{"$f":"E28*H28","v":0},0,null,0,{"$f":"J28*L28","v":0},0,{"$f":"+J28-N28","v":0},0,{"$f":"+J28*E$7","v":0}]
[null,"Machinery Labor",null,null,null,null,null,null,"$26.33"]
[null,null,"Tractors/Self-Propelled",1.53,null,"Hour",17.21,null,26.331300000000002,{"$f":"E30*H30","v":0},0,null,0,{"$f":"J30*L30","v":0},26.331300000000002,{"$f":"+J30-N30","v":0},2633.13,{"$f":"+J30*E$7","v":0}]
[null,null,"Other Labor",0,null,"Hour",17.21,null,0,{"$f":"E31*H31","v":0},0,null,0,{"$f":"J31*L31","v":0},0,{"$f":"+J31-N31","v":0},0,{"$f":"+J31*E$7","v":0}]
[]
[null,"Diesel Fuel",null,null,null,null,null,null,"$18.97"]
[null,null,"Pickup/General Use Equipment",1,null,"Acre",0,null,0,{"$f":"E34*H34","v":0},0,null,0,{"$f":"J34*L34","v":0},0,{"$f":"+J34-N34","v":0},0,{"$f":"+J34*E$7","v":0}]
[null,null,"Tractors/Self-Propelled",8.4700000000000006,null,"Gallon",2.2400000000000002,null,18.972800000000003,{"$f":"E35*H35","v":0},0,null,0,{"$f":"J35*L35","v":0},18.972800000000003,{"$f":"+J35-N35","v":0},1897.2800000000002,{"$f":"+J35*E$7","v":0}]
[]
[null,"Gasoline",null,null,null,null,null,null,"$0"]
[null,null,"Pickup/General Use Equipment",1,null,"Acre",0,null,0,{"$f":"E38*H38","v":0},0,null,0,{"$f":"J38*L38","v":0},0,{"$f":"+J38-N38","v":0},0,{"$f":"+J38*E$7","v":0}]
[null,null,"Tractors/Self-Propelled",0,null,"Gallon",2.09,null,0,{"$f":"E39*H39","v":0},0,null,0,{"$f":"J39*L39","v":0},0,{"$f":"+J39-N39","v":0},0,{"$f":"+J39*E$7","v":0}]
[]
[null,"Repairs & Maintenance",null,null,null,null,null,null,"$23.52"]
[null,null,"Pickup/General Use Equipment",1,null,"Acre",0,null,0,{"$f":"E42*H42","v":0},0,null,0,{"$f":"J42*L42","v":0},0,{"$f":"+J42-N42","v":0},0,{"$f":"+J42*E$7","v":0}]
[null,null,"Irrigation Equipment",1,null,"Acre",0,null,0,0,0,null,0,0,0,0,0,0]
[null,null,"Tractors/Self-Propelled",1,null,"Acre",12.553812020896318,null,12.553812020896318,0,0,null,0,0,12.553812020896318,0,1255.3812020896319,0]
[null,null,"Implements",1,null,"Acre",10.965973438602294,null,10.965973438602294,0,0,null,0,0,10.965973438602294,0,1096.5973438602293,0]
[null,null,null,null,null,null,null,null,0,0,0,null,0,0,0,0,0,0]
[null,null,null,null,null,null,null,null,0,0,0,null,0,0,0,0,0,0]
[null,"Interest on Credit Line",null,null,null,null,0.08,null,8.9380400745220445,{"$f":"+SUM(J17:J47)/2*H48","v":0},null,null,0,{"$f":"+SUM(N17:N47)/2*L48","v":0},8.9380400745220445,{"$f":"+SUM(P17:P47)/2*L48","v":0},893.80400745220447,{"$f":"+J48*E$7","v":0}]
["Total Variable Costs",null,null,null,null,null,null,null,288.99732553402072,{"$f":"SUM(J18:J48)","v":0},null,null,0,{"$f":"SUM(N18:N48)","v":0},288.99732553402072,{"$f":"SUM(P18:P48)","v":0},28899.732553402071,{"$f":"SUM(R18:R48)","v":0}]
["Planned Returns Above Variable Costs:",null,null,null,null,null,null,null,431.00267446597928,{"$f":"+J13-J49","v":0},null,null,0,{"$f":"+N13-N49","v":0},431.00267446597928,{"$f":"+P13-P49","v":0},43100.267446597929,{"$f":"+R13-R49","v":0}]
[null,"Breakeven Price to Cover Variable Costs",null,null,null,null,36.12466569175259,{"$f":"IF(E10=0,\"n/a\",(YVarExp-(YTotExp+YTotRet-J10))/E10)","v":"n/a"},"Roll"]
[null,null,null,null,null,null,null,null,null,null,null,null,null,null,null,null,"Enterprise","Enterprise"]
["FIXED COSTS",null,null,"Quantity","Quantity","Units","$/Unit","$/Unit","Total","Total","Share","Share","Landlord","Landlord","Tenant","Tenant","Total","Total"]
[null,"Machinery Depreciation",null,null,null,null,null,null,"$27.13"]
[null,null,"Tractors/Self-Propelled",1,null,"Acre",11.567797927482257,null,11.567797927482257,{"$f":"E55*H55","v":0},0,null,0,{"$f":"J55*L55","v":0},11.567797927482257,{"$f":"+J55-N55","v":0},1156.7797927482256,{"$f":"+J55*E$7","v":0}]
[null,null,"Implements",1,null,"Acre",15.566081185378088,null,15.566081185378088,0,0,null,0,{"$f":"J56*L56","v":0},15.566081185378088,0,1556.6081185378089,0]
[null,"Equipment Investment",null,null,null,null,null,null,"$15.13"]
[null,null,"Tractors/Self-Propelled",90.116877402805329,null,"Dollars",0.08,null,7.2093501922244263,{"$f":"E58*H58","v":0},0,null,0,{"$f":"J58*L58","v":0},7.2093501922244263,{"$f":"+J58-N58","v":0},720.93501922244263,{"$f":"+J58*E$7","v":0}]
[null,null,"Implements",98.961639674961404,null,"Dollars",0.08,null,7.9169311739969128,0,0,null,0,{"$f":"J59*L59","v":0},7.9169311739969128,0,791.69311739969123,0]
[null,"Salaried Labor",null,1,null,"Acre",0,null,0,0,0,null,0,{"$f":"J60*L60","v":0},0,{"$f":"+J60-N60","v":0},0,{"$f":"+J60*E$7","v":0}]
[null,"Management Fee, Owner/Operator Labor",null,1,null,"Acre",0,null,0,0,0,null,0,0,0,0,0,0]
[null,"Allocated Establishment Cost",null,1,null,"Acre",0,null,0,0,0,null,0,0,0,0,0,0]
[null,"Land - Hay Meadow",null,1,null,"Acre",25,null,25,0,0,null,0,0,25,0,2500,0]
[null,"Property Taxes",null,1,null,"Acre",0,null,0,0,0,null,0,0,0,0,0,0]
[null,"Whole Farm Insurance",null,1,null,"Acre",0,null,0,0,0,null,0,0,0,0,0,0]
[null,null,null,1,null,null,0,null,0,0,0,null,0,0,0,0,0,0]
[null,null,null,1,null,null,0,null,0,{"$f":"E67*H67","v":0},0,null,0,0,0,0,0,0]
["Total Fixed Costs",null,null,null,null,null,null,null,67.260160479081691,{"$f":"+SUM(J55:J67)","v":0},null,null,0,{"$f":"+SUM(N55:N67)","v":0},67.260160479081691,{"$f":"+SUM(P55:P67)","v":0},6726.0160479081678,{"$f":"+SUM(R55:R67)","v":0}]
["Total Specified Costs",null,null,null,null,null,null,null,356.25748601310238,{"$f":"+J49+J68","v":0},null,null,0,{"$f":"+N49+N68","v":0},356.25748601310238,{"$f":"+P49+P68","v":0},35625.748601310239,{"$f":"+R49+R68","v":0}]
[]
["Returns Above Specified Costs",null,null,null,null,null,null,null,363.74251398689762,{"$f":"+J13-J69","v":0},null,null,0,{"$f":"+N13-N69","v":0},363.74251398689762,{"$f":"+P13-P69","v":0},36374.251398689761,{"$f":"+R13-R69","v":0}]
[]
["    Breakeven Price to Cover Total Costs",null,null,null,null,null,44.532185751637797,{"$f":"IF(E10=0,\"n/a\",(YTotExp-(YTotExp+YTotRet-J10))/E10)","v":"n/a"},"Roll"]
[]
[null,null,null,"Example Breakeven Prices"]
[null,"Example","Example","To Cover",null,null,"To Cover"]
[null,"Yield","Yield","Variable",null,null,"Total"]
[null,"Percent","Roll","Costs",null,null,"Costs"]
[null,0.75,6,48.166220922336784,null,null,59.376247668850397]
[null,0.9,7.2,40.138517435280654,null,null,49.480206390708659]
[null,1,8,36.12466569175259,null,null,44.532185751637797]
[null,1.1000000000000001,8.8000000000000007,32.840605174320537,null,null,40.483805228761632]
[null,1.25,10,28.899732553402071,null,null,35.625748601310235]
[]
["  Developed by Extension Economists, Texas A&M AgriLife Extension Service, budgets@tamu.edu.  "]
[]
["Information presented is prepared solely as a general guide and not intended to recognize or predict the costs and returns from any one operation.  Brand names are mentioned only as examples and imply no endorsement."]

{"sheet":"RiceFirstCrop","index":21,"n_rows":122,"n_cols":18,"rows_kept":122,"cut":false,"hidden":false,"merged":[[109,3,109,8],[121,0,121,11],[0,0,0,11],[1,0,1,11],[2,0,2,11],[3,0,3,11]]}
["Projections for Planning Purposes Only -- Not to be Used without Updating"]
["2023 Estimated Costs and Returns per Acre"]
["Rice West of Houston, 1st Crop, Surface Water"]
["Enter your name for this budget in the cell above."]
["Enter  Your Values in the cells highlighed in MAROON."]
[null,null,null,null,"Your Acres",null,null,null,null,null,null,null,null,null,null,null,null,"Your"]
[null,null,"Crop Acres",450,null,null,null,null,null,null,null,"Your",null,null,null,null,"Enterprise","Enterprise"]
[null,null,null,null,"Your",null,null,"Your","Cash","Your","Landlord","Landlord",null,"Your",null,"Your","Total","Total"]
["REVENUE",null,null,"Quantity","Quantity","Units","$/Unit","$/Unit","Total","Total","Share","Share","Landlord","Landlord","Tenant","Tenant","(450 acres)",{"$f":"\"(\" & E7 & \" acres)\"","v":"( acres)"}]
[null,"Rice 1st Crop Loan",null,70,null,"CWT",7.26,null,508.2,{"$f":"E10*H10","v":0},0,null,0,{"$f":"J10*L10","v":0},508.2,{"$f":"+J10-N10","v":0},228690,{"$f":"+J10*E$7","v":0}]
[null,"Rice 1st Crop Premium",null,70,null,"CWT",8.74,null,611.80000000000007,0,0,null,0,0,611.80000000000007,{"$f":"+J11-N11","v":0},275310.00000000006,0]
[null,null,null,0,null,null,0,null,0,0,0,null,0,0,0,0,0,0]
[null,null,null,0,null,null,0,null,0,0,0,null,0,0,0,0,0,0]
["Total Revenue",null,null,null,null,null,null,null,1120,{"$f":"SUM(J10:J13)","v":0},null,null,0,{"$f":"SUM(N10:N13)","v":0},1120,{"$f":"SUM(P10:P13)","v":0},504000.00000000006,{"$f":"SUM(R10:R13)","v":0}]
[null,null,null,null,null,null,null,null,null,null,null,null,null,null,null,null,"Enterprise","Enterprise"]
["VARIABLE COSTS",null,null,"Quantity","Quantity","Units","$/Unit","$/Unit","Total","Total","Share","Share","Landlord","Landlord","Tenant","Tenant","Total","Total"]
["Production Costs"]
[null,"Seed",null,null,null,null,null,null,"$46.75"]
[null,"","Rice",0.9,null,"CWT",51.940000000000005,null,46.746000000000002,{"$f":"E19*H19","v":0},0,null,0,{"$f":"J19*L19","v":0},46.746000000000002,{"$f":"+J19-N19","v":0},21035.7,{"$f":"+J19*E$7","v":0}]
[null,"Fertilizer",null,null,null,null,null,null,"$192.3"]
[null,"","17-21-14-4.3S`",0.14099999999999999,null,"Ton",643.42000000000007,null,90.722220000000007,0,0,null,0,0,90.722220000000007,0,40824.999000000003,0]
[null,"","33-0-0`",0.1,null,"Ton",609.5,null,60.95,0,0,null,0,0,60.95,0,27427.5,0]
[null,"","46-0-0`",7.4999999999999997E-2,null,"Ton",541.66000000000008,null,40.624500000000005,0,0,null,0,0,40.624500000000005,0,18281.025000000001,0]
[null,"Custom",null,null,null,null,null,null,"$232.21"]
[null,"","Base Fertilizer",1,null,"Acre",11.925000000000001,null,11.925000000000001,0,0,null,0,0,11.925000000000001,0,5366.25,0]
[null,"","Ground Application",1,null,"Acre",9.5400000000000009,null,9.5400000000000009,0,0,null,0,0,9.5400000000000009,0,4293,0]
[null,"","Survey Levees",1,null,"Acre",6.36,null,6.36,0,0,null,0,0,6.36,0,2862,0]
[null,"","Pre-Flood Application",1,null,"Acre",12.5822,null,12.5822,0,0,null,0,0,12.5822,0,5661.99,0]
[null,"","Aerial Application",4.5,null,"Acre",8.2680000000000007,null,37.206000000000003,0,0,null,0,0,37.206000000000003,0,16742.7,0]
[null,"","Top Dress",1,null,"Acre",9.5400000000000009,null,9.5400000000000009,0,0,null,0,0,9.5400000000000009,0,4293,0]
[null,"","Rice Hauling",80.5,null,"CWT",0.47700000000000004,null,38.398500000000006,0,0,null,0,0,38.398500000000006,0,17279.325000000001,0]
[null,"","Rice Drying",80.5,null,"CWT",1.3250000000000002,null,106.66250000000001,0,0,null,0,0,106.66250000000001,0,47998.125000000007,0]
[null,"Miscellaneous",null,null,null,null,null,null,"$157.73"]
[null,"","Crop Insurance -Rice Enterprise",1,null,"Acre",11,null,11,0,0,null,0,0,11,0,4950,0]
[null,"","G&A Overhead",1,null,"Acre",11.13,null,11.13,0,0,null,0,0,11.13,0,5008.5,0]
[null,"","Pickup Milage Charge - Rice",1,null,"Acre",19.61,null,19.61,0,0,null,0,0,19.61,0,8824.5,0]
[null,"","Base Water Charge",1,null,"Acre",70.299199999999999,null,70.299199999999999,0,0,null,0,0,70.299199999999999,0,31634.639999999999,0]
[null,"","Butt Up Field",1,null,"Acre",4.24,null,4.24,0,0,null,0,0,4.24,0,1908,0]
[null,"","Plastic",1,null,"Acre",2.6500000000000004,null,2.6500000000000004,0,0,null,0,0,2.6500000000000004,0,1192.5000000000002,0]
[null,"","Pipe",1,null,"Acre",3.18,null,3.18,0,0,null,0,0,3.18,0,1431,0]
[null,"","Commission",70,null,"CWT",8.48E-2,null,5.9359999999999999,0,0,null,0,0,5.9359999999999999,0,2671.2,0]
[null,"","Check Off",70,null,"CWT",8.48E-2,null,5.9359999999999999,0,0,null,0,0,5.9359999999999999,0,2671.2,0]
[null,"","Rice Storage",70,null,"CWT",0.3392,null,23.744,0,0,null,0,0,23.744,0,10684.8,0]
[null,"Insecticide",null,null,null,null,null,null,"$13.64"]
[null,"","Waterweevil",1.6,null,"Ounce",2.8408000000000002,null,4.5452800000000009,0,0,null,0,0,4.5452800000000009,0,2045.3760000000004,0]
[null,"","Stinkbug Pyrthyroid Rice",3.2,null,"Ounce",2.8408000000000002,null,9.0905600000000018,0,0,null,0,0,9.0905600000000018,0,4090.7520000000009,0]
[null,"Herbicide",null,null,null,null,null,null,"$51.36"]
[null,"","Clomazone",0.1,null,"Gallon",145,null,14.5,0,0,null,0,0,14.5,0,6525,0]
[null,"","Rice PostEmerge Herbicide 1",1,null,"Acre",21.200000000000003,null,21.200000000000003,0,0,null,0,0,21.200000000000003,0,9540.0000000000018,0]
[null,"","Rice PostEmerge Herbicide 2",7,null,"Ounce",2.2366000000000001,null,15.656200000000002,0,0,null,0,0,15.656200000000002,0,7045.2900000000009,0]
[null,"Other Chemicals",null,null,null,null,null,null,"$4.45"]
[null,"","Herbicide Surfactant",2.5,null,"Acre",1.59,null,3.9750000000000001,0,0,null,0,0,3.9750000000000001,0,1788.75,0]
[null,"","Fungicide Surfactant",1,null,"Acre",0.47700000000000004,null,0.47700000000000004,0,0,null,0,0,0.47700000000000004,0,214.65,0]
[null,"Fungicides",null,null,null,null,null,null,"$31.78"]
[null,"","Rice Fungicide",1,null,"Acre",31.7788,null,31.7788,0,0,null,0,0,31.7788,0,14300.460000000001,0]
[null,null,null,0,null,null,0,null,0,0,0,null,0,0,0,0,0,0]
[null,null,null,0,null,null,0,null,0,0,0,null,0,0,0,0,0,0]
[null,null,null,0,null,null,0,null,0,{"$f":"E58*H58","v":0},0,null,0,{"$f":"J58*L58","v":0},0,{"$f":"+J58-N58","v":0},0,{"$f":"+J58*E$7","v":0}]
[null,"Irrigation",null,null,null,null,null,null,"$70.93"]
[null,null,"Water Cost",2.75,null,"AcreFoot",15.8,null,43.45,{"$f":"E60*H60","v":0},0,null,0,{"$f":"J60*L60","v":0},43.45,{"$f":"+J60-N60","v":0},19552.5,{"$f":"+J60*E$7","v":0}]
[null,null,"Irrigation Labor",1.57,null,"Hour",17.5,null,27.475000000000001,0,0,null,0,0,27.475000000000001,0,12363.75,0]
[null,"Machinery Labor",null,null,null,null,null,null,"$15.32"]
[null,null,"Tractors/Self-Propelled",0.89,null,"Hour",17.21,null,15.3169,{"$f":"E63*H63","v":0},0,null,0,{"$f":"J63*L63","v":0},15.3169,{"$f":"+J63-N63","v":0},6892.6050000000005,{"$f":"+J63*E$7","v":0}]
[null,null,"Other Labor",0,null,"Hour",17.21,null,0,{"$f":"E64*H64","v":0},0,null,0,{"$f":"J64*L64","v":0},0,{"$f":"+J64-N64","v":0},0,{"$f":"+J64*E$7","v":0}]
[]
[null,"Diesel Fuel",null,null,null,null,null,null,"$18.64"]
[null,null,"Pickup/General Use Equipment",1,null,"Acre",0,null,0,{"$f":"E67*H67","v":0},0,null,0,{"$f":"J67*L67","v":0},0,{"$f":"+J67-N67","v":0},0,{"$f":"+J67*E$7","v":0}]
[null,null,"Tractors/Self-Propelled",8.32,null,"Gallon",2.2400000000000002,null,18.636800000000001,{"$f":"E68*H68","v":0},0,null,0,{"$f":"J68*L68","v":0},18.636800000000001,{"$f":"+J68-N68","v":0},8386.5600000000013,{"$f":"+J68*E$7","v":0}]
[]
[null,"Gasoline",null,null,null,null,null,null,"$0"]
[null,null,"Pickup/General Use Equipment",1,null,"Acre",0,null,0,{"$f":"E71*H71","v":0},0,null,0,{"$f":"J71*L71","v":0},0,{"$f":"+J71-N71","v":0},0,{"$f":"+J71*E$7","v":0}]
[null,null,"Tractors/Self-Propelled",0,null,"Gallon",2.09,null,0,{"$f":"E72*H72","v":0},0,null,0,{"$f":"J72*L72","v":0},0,{"$f":"+J72-N72","v":0},0,{"$f":"+J72*E$7","v":0}]
[]
[null,"Repairs & Maintenance",null,null,null,null,null,null,"$40.18"]
[null,null,"Pickup/General Use Equipment",1,null,"Acre",0,null,0,{"$f":"E75*H75","v":0},0,null,0,{"$f":"J75*L75","v":0},0,{"$f":"+J75-N75","v":0},0,{"$f":"+J75*E$7","v":0}]
[null,null,"Irrigation Equipment",1,null,"Acre",1.1851851851851853E-2,null,1.1851851851851853E-2,0,0,null,0,0,1.1851851851851853E-2,0,5.3333333333333339,0]
[null,null,"Tractors/Self-Propelled",1,null,"Acre",26.860864245840059,null,26.860864245840059,0,0,null,0,0,26.860864245840059,0,12087.388910628026,0]
[null,null,"Implements",1,null,"Acre",13.31048914428337,null,13.31048914428337,0,0,null,0,0,13.31048914428337,0,5989.7201149275161,0]
[null,null,null,null,null,null,null,null,0,0,0,null,0,0,0,0,0,0]
[null,null,null,null,null,null,null,null,0,0,0,null,0,0,0,0,0,0]
[null,"Interest on Credit Line",null,null,null,null,0.08,null,44.052857133201563,{"$f":"+SUM(J18:J80)/2*H81","v":0},null,null,0,{"$f":"+SUM(N18:N80)/2*L81","v":0},44.052857133201563,{"$f":"+SUM(P18:P80)/2*L81","v":0},19823.785709940705,{"$f":"+J81*E$7","v":0}]
["Total Variable Costs",null,null,null,null,null,null,null,919.31972237517721,{"$f":"SUM(J19:J81)","v":0},null,null,0,{"$f":"SUM(N19:N81)","v":0},919.31972237517721,{"$f":"SUM(P19:P81)","v":0},413693.87506882957,{"$f":"SUM(R19:R81)","v":0}]
["Planned Returns Above Variable Costs:",null,null,null,null,null,null,null,200.68027762482279,{"$f":"+J14-J82","v":0},null,null,0,{"$f":"+N14-N82","v":0},200.68027762482279,{"$f":"+P14-P82","v":0},90306.124931170489,{"$f":"+R14-R82","v":0}]
[null,"Breakeven Price to Cover Variable Costs",null,null,null,null,4.3931388910739591,{"$f":"IF(E10=0,\"n/a\",(YVarExp-(YTotExp+YTotRet-J10))/E10)","v":"n/a"},"CWT"]
[null,null,null,null,null,null,null,null,null,null,null,null,null,null,null,null,"Enterprise","Enterprise"]
["FIXED COSTS",null,null,"Quantity","Quantity","Units","$/Unit","$/Unit","Total","Total","Share","Share","Landlord","Landlord","Tenant","Tenant","Total","Total"]
[null,"Machinery Depreciation",null,null,null,null,null,null,"$44.28"]
[null,null,"Irrigation Equipment",1,null,"Acre",0.23703703703703707,null,0.23703703703703707,{"$f":"E88*H88","v":0},0,null,0,{"$f":"J88*L88","v":0},0.23703703703703707,{"$f":"+J88-N88","v":0},106.66666666666669,{"$f":"+J88*E$7","v":0}]
[null,null,"Tractors/Self-Propelled",1,null,"Acre",26.755485282043988,null,26.755485282043988,0,0,null,0,{"$f":"J89*L89","v":0},26.755485282043988,0,12039.968376919795,0]
[null,null,"Implements",1,null,"Acre",17.29041821046027,null,17.29041821046027,0,0,null,0,{"$f":"J90*L90","v":0},17.29041821046027,0,7780.6881947071215,0]
[null,"Equipment Investment",null,null,null,null,null,null,"$28.46"]
[null,null,"Irrigation Equipment",1.7777777777777777,null,"Dollars",0.08,null,0.14222222222222222,{"$f":"E92*H92","v":0},0,null,0,{"$f":"J92*L92","v":0},0.14222222222222222,{"$f":"+J92-N92","v":0},64,{"$f":"+J92*E$7","v":0}]
[null,null,"Tractors/Self-Propelled",206.43322846373465,null,"Dollars",0.08,null,16.514658277098771,0,0,null,0,{"$f":"J93*L93","v":0},16.514658277098771,0,7431.5962246944473,0]
[null,null,"Implements",147.49758010686881,null,"Dollars",0.08,null,11.799806408549506,0,0,null,0,{"$f":"J94*L94","v":0},11.799806408549506,0,5309.912883847278,0]
[null,"Salaried Labor",null,1,null,"Acre",0,null,0,0,0,null,0,{"$f":"J95*L95","v":0},0,{"$f":"+J95-N95","v":0},0,{"$f":"+J95*E$7","v":0}]
[null,"Management Fee, Owner/Operator Labor",null,1,null,"Acre",56,null,56,0,0,null,0,0,56,0,25200,0]
[null,"Allocated Establishment Cost",null,1,null,"Acre",0,null,0,0,0,null,0,0,0,0,0,0]
[null,"Rice - Land Charge",null,1,null,"Acre",130,null,130,0,0,null,0,0,130,0,58500,0]
[null,"Property Taxes",null,1,null,"Acre",0,null,0,0,0,null,0,0,0,0,0,0]
[null,"Whole Farm Insurance",null,1,null,"Acre",0,null,0,0,0,null,0,0,0,0,0,0]
[null,null,null,1,null,null,0,null,0,0,0,null,0,0,0,0,0,0]
[null,null,null,1,null,null,0,null,0,{"$f":"E102*H102","v":0},0,null,0,0,0,0,0,0]
["Total Fixed Costs",null,null,null,null,null,null,null,258.7396274374118,{"$f":"+SUM(J88:J102)","v":0},null,null,0,{"$f":"+SUM(N88:N102)","v":0},258.7396274374118,{"$f":"+SUM(P88:P102)","v":0},116432.8323468353,{"$f":"+SUM(R88:R102)","v":0}]
["Total Specified Costs",null,null,null,null,null,null,null,1178.0593498125891,{"$f":"+J82+J103","v":0},null,null,0,{"$f":"+N82+N103","v":0},1178.0593498125891,{"$f":"+P82+P103","v":0},530126.70741566492,{"$f":"+R82+R103","v":0}]
[]
["Returns Above Specified Costs",null,null,null,null,null,null,null,-58.059349812589062,{"$f":"+J14-J104","v":0},null,null,0,{"$f":"+N14-N104","v":0},-58.059349812589062,{"$f":"+P14-P104","v":0},-26126.70741566486,{"$f":"+R14-R104","v":0}]
[]
["    Breakeven Price to Cover Total Costs",null,null,null,null,null,8.0894192830369853,{"$f":"IF(E10=0,\"n/a\",(YTotExp-(YTotExp+YTotRet-J10))/E10)","v":"n/a"},"CWT"]
[]
[null,null,null,"Example Breakeven Prices"]
[null,"Example","Example","To Cover",null,null,"To Cover"]
[null,"Yield","Yield","Variable",null,null,"Total"]
[null,"Percent","CWT","Costs",null,null,"Costs"]
[null,0.75,52.5,5.8575185214319454,null,null,10.785892377382648]
[null,0.9,63,4.8812654345266209,null,null,8.988243647818873]
[null,1,70,4.3931388910739591,null,null,8.0894192830369853]
[null,1.1000000000000001,77,3.9937626282490539,null,null,7.354017530033623]
[null,1.25,87.5,3.5145111128591675,null,null,6.4715354264295888]
[]
["  Developed by Extension Economists, Texas A&M AgriLife Extension Service, budgets@tamu.edu.  "]
[]
["Information presented is prepared solely as a general guide and not intended to recognize or predict the costs and returns from any one operation.  Brand names are mentioned only as examples and imply no endorsement."]

{"sheet":"RiceSecondCrop","index":22,"n_rows":97,"n_cols":18,"rows_kept":97,"cut":false,"hidden":false,"merged":[[84,3,84,8],[96,0,96,11],[0,0,0,11],[1,0,1,11],[2,0,2,11],[3,0,3,11]]}
["Projections for Planning Purposes Only -- Not to be Used without Updating"]
["2023 Estimated Costs and Returns per Acre"]
["Rice West of Houston, 2nd Crop, Surface Water"]
["Enter your name for this budget in the cell above."]
["Enter  Your Values in the cells highlighed in MAROON."]
[null,null,null,null,"Your Acres",null,null,null,null,null,null,null,null,null,null,null,null,"Your"]
[null,null,"Crop Acres",450,null,null,null,null,null,null,null,"Your",null,null,null,null,"Enterprise","Enterprise"]
[null,null,null,null,"Your",null,null,"Your","Cash","Your","Landlord","Landlord",null,"Your",null,"Your","Total","Total"]
["REVENUE",null,null,"Quantity","Quantity","Units","$/Unit","$/Unit","Total","Total","Share","Share","Landlord","Landlord","Tenant","Tenant","(450 acres)",{"$f":"\"(\" & E7 & \" acres)\"","v":"( acres)"}]
[null,"Rice 2nd Crop Loan",null,16,null,"CWT",7,null,112,{"$f":"E10*H10","v":0},0,null,0,{"$f":"J10*L10","v":0},112,{"$f":"+J10-N10","v":0},50400,{"$f":"+J10*E$7","v":0}]
[null,"Rice 2nd Crop Premium",null,16,null,"CWT",5.5,null,88,0,0,null,0,0,88,{"$f":"+J11-N11","v":0},39600,0]
[null,null,null,0,null,null,0,null,0,0,0,null,0,0,0,0,0,0]
[null,null,null,0,null,null,0,null,0,0,0,null,0,0,0,0,0,0]
["Total Revenue",null,null,null,null,null,null,null,200,{"$f":"SUM(J10:J13)","v":0},null,null,0,{"$f":"SUM(N10:N13)","v":0},200,{"$f":"SUM(P10:P13)","v":0},90000,{"$f":"SUM(R10:R13)","v":0}]
[null,null,null,null,null,null,null,null,null,null,null,null,null,null,null,null,"Enterprise","Enterprise"]
["VARIABLE COSTS",null,null,"Quantity","Quantity","Units","$/Unit","$/Unit","Total","Total","Share","Share","Landlord","Landlord","Tenant","Tenant","Total","Total"]
["Production Costs"]
[null,"Fertilizer",null,null,null,null,null,null,"$40.62"]
[null,"","46-0-0`",7.4999999999999997E-2,null,"Ton",541.66000000000008,null,40.624500000000005,{"$f":"E19*H19","v":0},0,null,0,{"$f":"J19*L19","v":0},40.624500000000005,{"$f":"+J19-N19","v":0},18281.025000000001,{"$f":"+J19*E$7","v":0}]
[null,"Custom",null,null,null,null,null,null,"$52.59"]
[null,"","Top Dress",1,null,"Acre",9.5400000000000009,null,9.5400000000000009,0,0,null,0,0,9.5400000000000009,0,4293,0]
[null,"","Aerial Application",1,null,"Acre",8.2680000000000007,null,8.2680000000000007,0,0,null,0,0,8.2680000000000007,0,3720.6000000000004,0]
[null,"","Rice Hauling",19.3,null,"CWT",0.47700000000000004,null,9.2061000000000011,0,0,null,0,0,9.2061000000000011,0,4142.7450000000008,0]
[null,"","Rice Drying",19.3,null,"CWT",1.3250000000000002,null,25.572500000000005,0,0,null,0,0,25.572500000000005,0,11507.625000000002,0]
[null,"Insecticide",null,null,null,null,null,null,"$4.56"]
[null,"","Stinkbug Rice",0.222222,null,"Pint",20.521599999999999,null,4.5603509952000003,0,0,null,0,0,4.5603509952000003,0,2052.1579478400004,0]
[null,"Miscellaneous",null,null,null,null,null,null,"$8.14"]
[null,"","Check Off",16,null,"CWT",8.48E-2,null,1.3568,0,0,null,0,0,1.3568,0,610.56000000000006,0]
[null,"","Commission",16,null,"CWT",8.48E-2,null,1.3568,0,0,null,0,0,1.3568,0,610.56000000000006,0]
[null,"","Rice Storage",16,null,"CWT",0.3392,null,5.4272,0,0,null,0,0,5.4272,0,2442.2400000000002,0]
[null,null,null,0,null,null,0,null,0,0,0,null,0,0,0,0,0,0]
[null,null,null,0,null,null,0,null,0,0,0,null,0,0,0,0,0,0]
[null,null,null,0,null,null,0,null,0,{"$f":"E33*H33","v":0},0,null,0,{"$f":"J33*L33","v":0},0,{"$f":"+J33-N33","v":0},0,{"$f":"+J33*E$7","v":0}]
[null,"Irrigation",null,null,null,null,null,null,"$48.32"]
[null,null,"Water Cost",1.9,null,"AcreFoot",18.89,null,35.890999999999998,{"$f":"E35*H35","v":0},0,null,0,{"$f":"J35*L35","v":0},35.890999999999998,{"$f":"+J35-N35","v":0},16150.949999999999,{"$f":"+J35*E$7","v":0}]
[null,null,"Irrigation Labor",0.71000000000000008,null,"Hour",17.5,null,12.425000000000001,0,0,null,0,0,12.425000000000001,0,5591.25,0]
[null,"Machinery Labor",null,null,null,null,null,null,"$3.44"]
[null,null,"Tractors/Self-Propelled",0.2,null,"Hour",17.21,null,3.4420000000000002,{"$f":"E38*H38","v":0},0,null,0,{"$f":"J38*L38","v":0},3.4420000000000002,{"$f":"+J38-N38","v":0},1548.9,{"$f":"+J38*E$7","v":0}]
[null,null,"Other Labor",0,null,"Hour",17.21,null,0,{"$f":"E39*H39","v":0},0,null,0,{"$f":"J39*L39","v":0},0,{"$f":"+J39-N39","v":0},0,{"$f":"+J39*E$7","v":0}]
[]
[null,"Diesel Fuel",null,null,null,null,null,null,"$3.54"]
[null,null,"Pickup/General Use Equipment",1,null,"Acre",0,null,0,{"$f":"E42*H42","v":0},0,null,0,{"$f":"J42*L42","v":0},0,{"$f":"+J42-N42","v":0},0,{"$f":"+J42*E$7","v":0}]
[null,null,"Tractors/Self-Propelled",1.58,null,"Gallon",2.2400000000000002,null,3.5392000000000006,{"$f":"E43*H43","v":0},0,null,0,{"$f":"J43*L43","v":0},3.5392000000000006,{"$f":"+J43-N43","v":0},1592.6400000000003,{"$f":"+J43*E$7","v":0}]
[]
[null,"Gasoline",null,null,null,null,null,null,"$0"]
[null,null,"Pickup/General Use Equipment",1,null,"Acre",0,null,0,{"$f":"E46*H46","v":0},0,null,0,{"$f":"J46*L46","v":0},0,{"$f":"+J46-N46","v":0},0,{"$f":"+J46*E$7","v":0}]
[null,null,"Tractors/Self-Propelled",0,null,"Gallon",2.09,null,0,{"$f":"E47*H47","v":0},0,null,0,{"$f":"J47*L47","v":0},0,{"$f":"+J47-N47","v":0},0,{"$f":"+J47*E$7","v":0}]
[]
[null,"Repairs & Maintenance",null,null,null,null,null,null,"$7.75"]
[null,null,"Pickup/General Use Equipment",1,null,"Acre",0,null,0,{"$f":"E50*H50","v":0},0,null,0,{"$f":"J50*L50","v":0},0,{"$f":"+J50-N50","v":0},0,{"$f":"+J50*E$7","v":0}]
[null,null,"Irrigation Equipment",1,null,"Acre",1.1851851851851853E-2,null,1.1851851851851853E-2,0,0,null,0,0,1.1851851851851853E-2,0,5.3333333333333339,0]
[null,null,"Tractors/Self-Propelled",1,null,"Acre",6.2931687598275694,null,6.2931687598275694,0,0,null,0,0,6.2931687598275694,0,2831.9259419224063,0]
[null,null,"Implements",1,null,"Acre",1.4497174041025636,null,1.4497174041025636,0,0,null,0,0,1.4497174041025636,0,652.37283184615364,0]
[null,null,null,null,null,null,null,null,0,0,0,null,0,0,0,0,0,0]
[null,null,null,null,null,null,null,null,0,0,0,null,0,0,0,0,0,0]
[null,"Interest on Credit Line",null,null,null,null,0.08,null,1.5490016473821637,{"$f":"+SUM(J18:J55)/2*H56","v":0},null,null,0,{"$f":"+SUM(N18:N55)/2*L56","v":0},1.5490016473821637,{"$f":"+SUM(P18:P55)/2*L56","v":0},697.05074132197365,{"$f":"+J56*E$7","v":0}]
["Total Variable Costs",null,null,null,null,null,null,null,170.51319065836418,{"$f":"SUM(J19:J56)","v":0},null,null,0,{"$f":"SUM(N19:N56)","v":0},170.51319065836418,{"$f":"SUM(P19:P56)","v":0},76730.935796263846,{"$f":"SUM(R19:R56)","v":0}]
["Planned Returns Above Variable Costs:",null,null,null,null,null,null,null,29.486809341635819,{"$f":"+J14-J57","v":0},null,null,0,{"$f":"+N14-N57","v":0},29.486809341635819,{"$f":"+P14-P57","v":0},13269.064203736154,{"$f":"+R14-R57","v":0}]
[null,"Breakeven Price to Cover Variable Costs",null,null,null,null,5.1570744161477613,{"$f":"IF(E10=0,\"n/a\",(YVarExp-(YTotExp+YTotRet-J10))/E10)","v":"n/a"},"CWT"]
[null,null,null,null,null,null,null,null,null,null,null,null,null,null,null,null,"Enterprise","Enterprise"]
["FIXED COSTS",null,null,"Quantity","Quantity","Units","$/Unit","$/Unit","Total","Total","Share","Share","Landlord","Landlord","Tenant","Tenant","Total","Total"]
[null,"Machinery Depreciation",null,null,null,null,null,null,"$7.87"]
[null,null,"Irrigation Equipment",1,null,"Acre",0.23703703703703707,null,0.23703703703703707,{"$f":"E63*H63","v":0},0,null,0,{"$f":"J63*L63","v":0},0.23703703703703707,{"$f":"+J63-N63","v":0},106.66666666666669,{"$f":"+J63*E$7","v":0}]
[null,null,"Tractors/Self-Propelled",1,null,"Acre",5.9024963886273767,null,5.9024963886273767,0,0,null,0,{"$f":"J64*L64","v":0},5.9024963886273767,0,2656.1233748823197,0]
[null,null,"Implements",1,null,"Acre",1.7327496717948714,null,1.7327496717948714,0,0,null,0,{"$f":"J65*L65","v":0},1.7327496717948714,0,779.73735230769216,0]
[null,"Equipment Investment",null,null,null,null,null,null,"$6.32"]
[null,null,"Irrigation Equipment",1.7777777777777777,null,"Dollars",0.08,null,0.14222222222222222,{"$f":"E67*H67","v":0},0,null,0,{"$f":"J67*L67","v":0},0.14222222222222222,{"$f":"+J67-N67","v":0},64,{"$f":"+J67*E$7","v":0}]
[null,null,"Tractors/Self-Propelled",44.781971287445273,null,"Dollars",0.08,null,3.5825577029956222,0,0,null,0,{"$f":"J68*L68","v":0},3.5825577029956222,0,1612.1509663480299,0]
[null,null,"Implements",32.446685662393151,null,"Dollars",0.08,null,2.5957348529914519,0,0,null,0,{"$f":"J69*L69","v":0},2.5957348529914519,0,1168.0806838461533,0]
[null,"Salaried Labor",null,1,null,"Acre",0,null,0,0,0,null,0,{"$f":"J70*L70","v":0},0,{"$f":"+J70-N70","v":0},0,{"$f":"+J70*E$7","v":0}]
[null,"Management Fee, Owner/Operator Labor",null,1,null,"Acre",10,null,10,0,0,null,0,0,10,0,4500,0]
[null,"Allocated Establishment Cost",null,1,null,"Acre",0,null,0,0,0,null,0,0,0,0,0,0]
[null,"None",null,1,null,"Acre",0,null,0,0,0,null,0,0,0,0,0,0]
[null,"Property Taxes",null,1,null,"Acre",0,null,0,0,0,null,0,0,0,0,0,0]
[null,"Whole Farm Insurance",null,1,null,"Acre",0,null,0,0,0,null,0,0,0,0,0,0]
[null,null,null,1,null,null,0,null,0,0,0,null,0,0,0,0,0,0]
[null,null,null,1,null,null,0,null,0,{"$f":"E77*H77","v":0},0,null,0,0,0,0,0,0]
["Total Fixed Costs",null,null,null,null,null,null,null,24.192797875668582,{"$f":"+SUM(J63:J77)","v":0},null,null,0,{"$f":"+SUM(N63:N77)","v":0},24.192797875668582,{"$f":"+SUM(P63:P77)","v":0},10886.759044050861,{"$f":"+SUM(R63:R77)","v":0}]
["Total Specified Costs",null,null,null,null,null,null,null,194.70598853403277,{"$f":"+J57+J78","v":0},null,null,0,{"$f":"+N57+N78","v":0},194.70598853403277,{"$f":"+P57+P78","v":0},87617.694840314711,{"$f":"+R57+R78","v":0}]
[]
["Returns Above Specified Costs",null,null,null,null,null,null,null,5.2940114659672304,{"$f":"+J14-J79","v":0},null,null,0,{"$f":"+N14-N79","v":0},5.2940114659672304,{"$f":"+P14-P79","v":0},2382.3051596852893,{"$f":"+R14-R79","v":0}]
[]
["    Breakeven Price to Cover Total Costs",null,null,null,null,null,6.6691242833770481,{"$f":"IF(E10=0,\"n/a\",(YTotExp-(YTotExp+YTotRet-J10))/E10)","v":"n/a"},"CWT"]
[]
[null,null,null,"Example Breakeven Prices"]
[null,"Example","Example","To Cover",null,null,"To Cover"]
[null,"Yield","Yield","Variable",null,null,"Total"]
[null,"Percent","CWT","Costs",null,null,"Costs"]
[null,0.75,12,6.8760992215303487,null,null,8.8921657111693975]
[null,0.9,14.4,5.7300826846086235,null,null,7.410138092641164]
[null,1,16,5.1570744161477613,null,null,6.6691242833770481]
[null,1.1000000000000001,17.600000000000001,4.6882494692252372,null,null,6.0628402576154974]
[null,1.25,20,4.1256595329182089,null,null,5.3352994267016385]
[]
["  Developed by Extension Economists, Texas A&M AgriLife Extension Service, budgets@tamu.edu.  "]
[]
["Information presented is prepared solely as a general guide and not intended to recognize or predict the costs and returns from any one operation.  Brand names are mentioned only as examples and imply no endorsement."]

{"sheet":"CowCalf","index":23,"n_rows":91,"n_cols":14,"rows_kept":91,"cut":false,"hidden":false,"merged":[[90,0,90,13],[78,7,78,8],[78,10,78,12],[79,7,79,8],[79,10,79,12],[80,7,80,8],[80,10,80,12],[81,7,81,8],[81,10,81,12],[82,7,82,8],[82,10,82,12],[77,7,77,8],[77,10,77,12],[0,0,0,13],[1,0,1,13],[2,0,2,13],[3,0,3,13],[76,2,76,12]]}
["Projections for Planning Purposes Only -- Not to be Used without Updating"]
["2023 Estimated Costs and Returns per Animal Unit"]
["Cow-Calf Improved Pasture"]
["Enter your name for this budget in the cell above."]
["Enter  Your Values in the cells highlighed in MAROON."]
[null,null,null,null,"Your Cows"]
[null,"Animal Units (AU)",null,100,null,"Animal Unit",null,null,null,null,null,null,null,"Your"]
[null,"Breeding Females",null,100,null,"Calf","Your",null,null,null,null,null,"Enterprise","Enterprise"]
[null,null,null,null,"Your","Quantity","Quantity",null,null,"Your",null,"Your","Total","Total"]
["REVENUE",null,null,"Head","Head","Per Head","Per Head","Units","$/Unit","$/Unit","Total","Total",{"$f":"\"(\" & D7 & \" AUs)\"","v":"(100 AUs)"},{"$f":"\"(\" & E7 & \" AUs)\"","v":"( AUs)"}]
[null,"Steer",null,0.43,null,4.8,null,"CWT",187,null,385.96800000000002,{"$f":"+E11*G11*J11","v":0},38596.800000000003,{"$f":"+L11*E$7","v":0}]
[null,"Heifer",null,0.43,null,4.5,null,"CWT",179,null,346.36500000000001,{"$f":"+E12*G12*J12","v":0},34636.5,{"$f":"+L12*E$7","v":0}]
[null,"Cull Cow",null,0.15,null,9,null,"CWT",78,null,105.29999999999998,0,10529.999999999998,0]
[null,"Cull Bull",null,0.01,null,16,null,"CWT",105,null,16.8,0,1680,0]
[null,null,null,0,null,0,null,null,0,null,0,0,0,0]
[null,null,null,0,null,0,null,null,0,null,0,0,0,0]
["Total Revenue",null,null,null,null,399.90000000000003,null,null,null,null,854.43299999999999,{"$f":"+SUM(L11:L16)","v":0},85443.3,{"$f":"+SUM(N11:N16)","v":0}]
[null,null,null,null,null,550.90000000000009]
[null,null,null,null,null,151.00000000000006,null,null,null,null,null,null,"Enterprise","Enterprise"]
["VARIABLE COSTS",null,null,null,null,"Quantity","Quantity","Units","$/Unit","$/Unit","Total","Total","Total","Total"]
["Production Costs"]
[null,"Miscellaneous",null,null,null,null,null,null,null,null,"$0"]
[null,null,null,null,null,1,null,null,0,null,0,{"$f":"+J23*G23","v":0},0,{"$f":"+L23*E$7","v":0}]
[null,null,null,null,null,1,null,null,0,null,0,0,0,0]
[null,"Marketing Expense",null,null,null,1,null,"AU",31.188000000000002,null,31.188000000000002,0,3118.8,0]
[null,"Feed",null,null,null,null,null,null,null,null,"$177.39"]
[null,null,"Bermuda Hay",null,null,2,null,"Roll",68.900000000000006,null,137.80000000000001,{"$f":"+J27*G27","v":0},13780.000000000002,{"$f":"+L27*E$7","v":0}]
[null,null,"40% Cottonseed Meal Cubes",null,null,1,null,"CWT",31.535,null,31.535,0,3153.5,0]
[null,null,"Salt and Mineral",null,null,40,null,"Pound",0.20140000000000002,null,8.0560000000000009,0,805.60000000000014,0]
[null,null,null,null,null,0,null,null,0,null,0,0,0,0]
[null,null,null,null,null,0,null,null,0,null,0,0,0,0]
[null,null,null,null,null,0,null,null,0,null,0,0,0,0]
[null,"Vet. Medicine",null,null,null,null,null,null,null,null,"$33.87"]
[null,null,"Bull Exam",null,null,0.04,null,"Head",79.5,null,3.18,{"$f":"+J34*G34","v":0},318,{"$f":"+L34*E$7","v":0}]
[null,null,"Fly Control",null,null,1.9,null,"Head",3.0210000000000004,null,5.7399000000000004,0,573.99,0]
[null,null,"4-Way Respiratory + Vibrio + Lepto",null,null,1.04,null,"Head",2.1517999999999997,null,2.2378719999999999,0,223.78719999999998,0]
[null,null,"8-Way Clostridials",null,null,2.94,null,"Head",0.50880000000000003,null,1.4958720000000001,0,149.5872,0]
[null,null,"Dewormer-Avermectin",null,null,2.35,null,"Head",3.9326000000000003,null,9.2416100000000014,0,924.16100000000017,0]
[null,null,"Implants",null,null,0.43,null,"Head",1.4627999999999999,null,0.6290039999999999,0,62.900399999999991,0]
[null,null,"Pregnancy Check",null,null,1,null,"Head",6.36,null,6.36,0,636,0]
[null,null,"Pasturella+8 Way Clostridial",null,null,0.86,null,"Head",3.6464000000000003,null,3.135904,0,313.59039999999999,0]
[null,null,"4-Way Respiratory + Vibrio +Lepto",null,null,0.86,null,"Head",2.1517999999999997,null,1.8505479999999996,0,185.05479999999997,0]
[null,null,null,null,null,0,null,null,0,null,0,0,0,0]
[null,null,null,null,null,0,null,null,0,null,0,0,0,0]
[null,null,null,null,null,0,null,null,0,null,0,0,0,0]
[null,"Fuel",null,null,null,1,null,"AU",6.7297999999999991,null,6.7297999999999991,0,672.9799999999999,0]
[null,"Lube (As a % of fuel)",null,null,null,0.05,null,"Percent",6.7297999999999991,null,0.33648999999999996,0,33.648999999999994,0]
[null,"Repairs ",null,null,null,1,null,"AU",10.113933333333334,null,10.113933333333334,0,1011.3933333333333,0]
[null,"Labor",null,null,null,0.4,null,"Hours",14.055000000000001,null,5.6220000000000008,0,562.20000000000005,0]
[null,"Utilities",null,null,null,1,null,"AU",0,null,0,0,0,0]
[null,null,null,null,null,null,null,null,null,null,0,{"$f":"+J51*G51","v":0},0,0]
[null,"Purchase Breeding Female",null,null,null,1,null,null,0,null,0,0,0,0]
[null,"Purchase Breeding Male",null,null,null,1,null,null,0,null,0,0,0,0]
[null,"Purchase Older Repalcement Female",null,null,null,1,null,null,0,null,0,0,0,0]
[null,"Purchase Younger Repalcement Female",null,null,null,1,null,null,0,null,0,0,0,0]
[null,"Interest on Credit Line",null,null,null,null,null,null,0.08,null,19.845818004894973,{"$f":"+SUM(L21:L55)/2*J56","v":0},1984.5818004894973,0]
["Total Variable Costs",null,null,null,null,null,null,null,null,null,285.09775133822836,{"$f":"+SUM(L23:L56)","v":0},28509.775133822837,{"$f":"+SUM(N23:N56)","v":0}]
[]
["Planned Returns Above Variable Costs:",null,null,null,null,null,null,null,null,null,569.33524866177163,{"$f":"+L17-L57","v":0},56933.524866177162,{"$f":"+N17-N57","v":0}]
[null,"Average Calf Breakeven Price to Cover Variable Costs",null,null,null,null,null,null,40.759627741492473,{"$f":"IF((E11*G11+E12*G12)=0,\"n/a\",(L57-SUM(L13:L16))/(E11*G11+E12*G12))","v":"n/a"},"CWT"]
[null,null,null,null,null,null,null,null,null,null,null,null,"Enterprise","Enterprise"]
["FIXED COSTS",null,null,null,null,"Quantity","Quantity","Units","$/Unit","$/Unit","Total","Total","Total","Total"]
[null,"Depreciation - Equipment",null,null,null,1,null,"AU",28.715666666666667,null,28.715666666666667,{"$f":"+G63*J63","v":0},2871.5666666666666,{"$f":"+L63*E$7","v":0}]
[null,"Depreciation - Livestock",null,null,null,1,null,"AU",186.42857142857142,null,186.42857142857142,0,18642.857142857141,0]
[null,"Equipment Investment",null,null,null,140.79650000000001,null,"dollars",0.08,null,11.263720000000001,0,1126.3720000000001,0]
[null,"Insurance",null,null,null,1,null,"AU",0,null,0,0,0,0]
[null,"Management Fee, Owner/Operator Labor",null,null,null,1,null,"AU",20,null,20,{"$f":"+J67*G67","v":0},2000,0]
[null,"Salaried Labor",null,null,null,1,null,"AU",0,null,0,{"$f":"+J68*G68","v":0},0,0]
[null,"Pasture Cost",null,null,null,8,null,"Acres",20,null,160,0,16000,0]
[null,null,null,null,null,null,null,null,null,null,0,{"$f":"+G70*J70","v":0},0,0]
[null,null,null,null,null,null,null,null,null,null,0,0,0,0]
["Total Fixed Costs",null,null,null,null,null,null,null,null,null,406.40795809523809,{"$f":"+SUM(L63:L69)","v":0},40640.795809523806,{"$f":"+SUM(N63:N69)","v":0}]
["Total Costs",null,null,null,null,null,null,null,null,null,691.50570943346645,{"$f":"+L57+L72","v":0},69150.57094334664,{"$f":"+N57+N72","v":0}]
["Planned Returns to Management, Risk, and Profit:",null,null,null,null,null,null,null,null,null,162.92729056653354,{"$f":"+L17-L73","v":0},16292.729056653363,{"$f":"+N17-N73","v":0}]
[null,"Average Calf Breakeven Price to Cover Total Costs",null,null,null,null,null,null,142.38702411439519,{"$f":"IF((E11*G11+E12*G12)=0,\"n/a\",(L73-SUM(L13:L16))/(E11*G11+E12*G12))","v":"n/a"},"CWT"]
[]
[null,null,"Sensitivity Analysis for Example"]
[null,null,"Example Weaning Percent","Example Gross Sales per Animal Unit",null,"Pounds Produced per Animal Unit",null,"Example Breakeven Calf Pay Weight to Cover Total Cost",null,null,"Example Average Breakeven Price to Cover Total Cost"]
[null,null,0.92,905.52600000000007,null,578.80000000000018,null,403.80704534445113,null,null,133.10091384606503]
[null,null,0.89,879.97949999999992,null,564.85000000000014,null,420.17760123679375,null,null,137.58746150379758]
[null,null,0.86,854.43299999999999,null,550.90000000000009,null,437.93158438764419,null,null,142.38702411439519]
[null,null,0.83,828.88650000000007,null,536.95000000000005,null,457.25209546356967,null,null,147.53354305828901]
[null,null,0.79999999999999993,803.33999999999992,null,523,null,478.35603833111907,null,null,153.06605092297488]
[]
[null,null,null,{"$f":"\"Example Male \"&F8&\" Price\"","v":"Example Male Calf Price"},null,null,null,null,null,null,{"$f":"+I11","v":187}]
[null,null,null,{"$f":"\"Example Female \"&F8&\" Price\"","v":"Example Female Calf Price"},null,null,null,null,null,null,{"$f":"+I12","v":179}]
[null,null,null,{"$f":"\"Example Weighted Average \"&F8&\" Price ($/cwt)\"","v":"Example Weighted Average Calf Price ($/cwt)"},null,null,null,null,null,null,{"$f":"+(K11+K12)/(D11*F11+D12*F12)","v":183.12903225806454}]
[]
["  Developed by Extension Economists, Texas A&M AgriLife Extension Service, budgets@tamu.edu.  "]
[]
["Information presented is prepared solely as a general guide and not intended to recognize or predict the costs and returns from any one operation.  Brand names are mentioned only as examples and imply no endorsement."]

{"sheet":"StockersSummer","index":24,"n_rows":83,"n_cols":14,"rows_kept":83,"cut":false,"hidden":false,"merged":[[82,0,82,13],[0,0,0,13],[1,0,1,13],[2,0,2,13],[3,0,3,13],[70,2,70,7],[71,2,72,2],[71,5,71,7]]}
["Projections for Planning Purposes Only -- Not to be Used without Updating"]
["2023 Estimated Costs and Returns per Animal"]
["Summer Stocker Calf Budget (160 Days Grazing)"]
["Enter your name for this budget in the cell above."]
["Enter  Your Values in the cells highlighed in MAROON.",null,null,null,null,null,null,null,null,null,null,null,"Stocker"]
[null,null,null,null,"Your Head",null,null,null,null,null,null,null,null,"Your"]
[null,"Number of Head",null,320,null,null,"Your",null,null,null,null,null,"Enterprise","Enterprise"]
[null,null,null,null,"Your","Pay Weight","Weight",null,null,"Your",null,"Your","Total","Total"]
["REVENUE",null,null,"Head","Head","or Amount","or Amount","Units","$/Unit","$/Unit","Total","Total",{"$f":"\"(\" & D7 & \" Head)\"","v":"(320 Head)"},{"$f":"\"(\" & E7 & \" Head)\"","v":"( Head)"}]
[]
[null,"Stocker",null,0.96,null,7.5,null,"CWT",191,null,1375.1999999999998,{"$f":"+J11*G11*E11","v":0},440063.99999999994,{"$f":"+L11*E$7","v":0}]
[null,null,null,0.96,null,0,null,null,0,null,0,0,0,0]
[null,null,null,0.96,null,0,null,null,0,null,0,0,0,0]
["Total Revenue",null,null,null,null,null,null,null,null,null,1375.1999999999998,{"$f":"+L11","v":0},440063.99999999994,0]
[null,null,null,null,null,null,null,null,null,null,null,null,"Enterprise","Enterprise"]
["VARIABLE COSTS",null,null,null,null,"Quantity","Quantity","Units","$/Unit","$/Unit","Total","Total","Total","Total"]
["Production Costs"]
[null,"Stocker Purchase",null,null,null,5,null,"CWT",202,null,1010,{"$f":"+J18*G18","v":0},323200,{"$f":"+L18*E$7","v":0}]
[null,"Stocker Delivery",null,null,null,1,null,"Head",7.5,null,7.5,{"$f":"+J19*G19","v":0},2400,{"$f":"+L19*E$7","v":0}]
[null,"Grazing",null,null,null,null,null,null,null,null,"$50"]
[null,null,"Acre Lease",null,null,3.1250000000000002E-3,null,"Acre",0,null,0,0,0,{"$f":"+L21*E$7","v":0}]
[null,null,"Grazing by Month",null,null,5,null,"Month",10,null,50,0,16000,0]
[null,null,"Gain Contract",null,null,0,null,"Pounds",0,null,0,0,0,0]
[null,null,"On Weight Per Month",null,null,0,null,"Month",0,null,0,{"$f":"+G24*J24*G18","v":0},0,0]
[null,"Health",null,null,null,null,null,null,null,null,"$11.44"]
[null,null,"Health and Vet - Stocker",null,null,6.7300000000000013,null,"Ounce",1.7,null,11.441000000000003,{"$f":"+J26*G26","v":0},3661.1200000000008,{"$f":"+L26*E$7","v":0}]
[null,null,null,null,null,0,null,null,0,null,0,0,0,0]
[null,null,null,null,null,0,null,null,0,null,0,0,0,0]
[null,null,null,null,null,0,null,null,0,null,0,0,0,0]
[null,"Feed",null,null,null,null,null,null,null,null,"$3.02"]
[null,null,"Salt and Mineral",null,null,15,null,"Pound",0.20140000000000002,null,3.0210000000000004,0,966.72000000000014,0]
[null,null,null,null,null,0,null,null,0,null,0,0,0,0]
[null,null,null,null,null,0,null,null,0,null,0,0,0,0]
[null,null,null,null,null,0,null,null,0,null,0,0,0,0]
[null,"Miscellaneous",null,null,null,null,null,null,null,null,"$2.65"]
[null,null,"Preconditioning",null,null,1,null,"Acre",2.6500000000000004,null,2.6500000000000004,{"$f":"+J36*G36","v":0},848.00000000000011,{"$f":"+L36*E$7","v":0}]
[null,null,null,null,null,1,null,null,0,null,0,0,0,0]
[null,null,null,null,null,1,null,null,0,null,0,0,0,0]
[null,"Fuel",null,null,null,1,null,"Head",0,null,0,0,0,0]
[null,"Lube (As a % of fuel)",null,null,null,0.1,null,"Percent",0,null,0,0,0,0]
[null,"Utilities",null,null,null,1,null,"Head",0,null,0,0,0,0]
[null,"Repairs ",null,null,null,1,null,"Head",0,null,0,0,0,0]
[null,"Marketing",null,null,null,0.96,null,"Head",0,null,0,0,0,0]
[null,"Labor",null,null,null,1,null,"Head",135.90799999999999,null,135.90799999999999,0,43490.559999999998,0]
[null,null,null,null,null,null,null,null,null,null,0,{"$f":"+J45*G45","v":0},0,{"$f":"+L45*E$7","v":0}]
[null,null,null,null,null,null,null,null,null,null,0,{"$f":"+J46*G46","v":0},0,{"$f":"+L46*E$7","v":0}]
[null,"Interest on Credit Line",null,null,null,null,null,null,0.08,null,40.030139397260271,{"$f":"+SUM(L18:L44)*J47/2","v":0},12809.644607123286,0]
["Total Variable Costs",null,null,null,null,null,null,null,null,null,1260.5501393972602,{"$f":"+SUM(L18:L47)","v":0},403376.04460712324,{"$f":"+SUM(N18:N47)","v":0}]
[]
["Planned Returns Above Variable Costs:",null,null,null,null,null,null,null,null,null,114.64986060273964,{"$f":"+L14-L48","v":0},36687.955392876698,{"$f":"+N14-N48","v":0}]
[]
[null,"Breakeven Price to Cover Variable Costs",null,null,null,null,null,null,175.07640824961948,{"$f":"+IF(G11=0,\"n/a\",(L48-SUM(L12:L13))/(G11*E11))","v":"n/a"},"CWT"]
[null,null,null,null,null,null,null,null,null,null,null,null,"Enterprise","Enterprise"]
["FIXED COSTS",null,null,null,null,"Quantity","Quantity","Units","$/Unit","$/Unit","Total","Total","Total","Total"]
[]
[null,"Depreciation",null,null,null,1,null,"Head",0,null,0,{"$f":"+J56*G56","v":0},0,{"$f":"+L56*E$7","v":0}]
[null,"Equipment Investment",null,null,null,0,null,"dollars",0.08,null,0,0,0,0]
[null,"Salaried Labor",null,null,null,1,null,"Head",0,null,0,0,0,0]
[null,"Management Fee, Owner/Operator Labor",null,null,null,1,null,"Head",0,null,0,0,0,0]
[null,"Insurance",null,null,null,1,null,"Head",0,null,0,0,0,0]
[null,null,null,null,null,null,null,null,null,null,0,0,0,0]
[null,null,null,null,null,null,null,null,null,null,0,0,0,0]
["Total Fixed Costs",null,null,null,null,null,null,null,null,null,0,{"$f":"+SUM(L56:L60)","v":0},0,{"$f":"+SUM(N56:N60)","v":0}]
[]
["Total Costs",null,null,null,null,null,null,null,null,null,1260.5501393972602,{"$f":"+L48+L63","v":0},403376.04460712324,{"$f":"+N48+N63","v":0}]
[]
["Planned Returns to Management, Risk, and Profit:",null,null,null,null,null,null,null,null,null,114.64986060273964,{"$f":"+L50-L63","v":0},36687.955392876698,{"$f":"+N50-N63","v":0}]
[]
["    Breakeven Price to Cover Total Costs",null,null,null,null,null,null,null,175.07640824961948,{"$f":"+IF(G11=0,\"n/a\",(L65-SUM(L12:L13))/(G11*E11))","v":"n/a"},"CWT"]
[]
[null,null,"Example Breakeven Sensitivity Analysis"]
[null,null,null,null,null,"Purchase Weight (Lbs/Hd): 500",null,"Sales Price/Cwt of $Total"]
[null,null,null,null,null,"Sales Price/Cwt  191.00",null,"Purchase Price/Cwt  202.00"]
[null,null,"ADG (Lbs/day)","Net Pay Weight with Shrink",null,"Breakeven Purchase Price ($/CWT)",null,"Breakeven Sales Price ($/CWT)"]
[null,null,1.65,770.59999999999991,null,232.48440412054791,null,170.39619282015914]
[null,null,1.5125000000000002,748.05000000000007,null,224.21486812054798,null,175.53279351275262]
[null,null,1.375,750,null,224.929972120548,null,175.07640824961948]
[null,null,1.2375,702.95,null,207.67579612054797,null,186.79465991495073]
[null,null,1.1000000000000001,680.4,null,199.4062601205479,null,192.98545882894564]
[]
["  Developed by Extension Economists, Texas A&M AgriLife Extension Service, budgets@tamu.edu.  "]
[]
["Information presented is prepared solely as a general guide and not intended to recognize or predict the costs and returns from any one operation.  Brand names are mentioned only as examples and imply no endorsement."]

{"sheet":"StockerWinter","index":25,"n_rows":84,"n_cols":14,"rows_kept":84,"cut":false,"hidden":false,"merged":[[83,0,83,13],[0,0,0,13],[1,0,1,13],[2,0,2,13],[3,0,3,13],[71,2,71,7],[72,2,73,2],[72,5,72,7]]}
["Projections for Planning Purposes Only -- Not to be Used without Updating"]
["2023 Estimated Costs and Returns per Animal"]
["Winter Stocker Calf Budget (110 Says Grazing)"]
["Enter your name for this budget in the cell above."]
["Enter  Your Values in the cells highlighed in MAROON.",null,null,null,null,null,null,null,null,null,null,null,"Stocker"]
[null,null,null,null,"Your Head",null,null,null,null,null,null,null,null,"Your"]
[null,"Number of Head",null,320,null,null,"Your",null,null,null,null,null,"Enterprise","Enterprise"]
[null,null,null,null,"Your","Pay Weight","Weight",null,null,"Your",null,"Your","Total","Total"]
["REVENUE",null,null,"Head","Head","or Amount","or Amount","Units","$/Unit","$/Unit","Total","Total",{"$f":"\"(\" & D7 & \" Head)\"","v":"(320 Head)"},{"$f":"\"(\" & E7 & \" Head)\"","v":"( Head)"}]
[]
[null,"Stocker",null,0.96,null,6.1,null,"CWT",183,null,1071.6479999999999,{"$f":"+J11*G11*E11","v":0},342927.35999999999,{"$f":"+L11*E$7","v":0}]
[null,null,null,0.96,null,0,null,null,0,null,0,0,0,0]
[null,null,null,0.96,null,0,null,null,0,null,0,0,0,0]
["Total Revenue",null,null,null,null,null,null,null,null,null,1071.6479999999999,{"$f":"+L11","v":0},342927.35999999999,0]
[null,null,null,null,null,null,null,null,null,null,null,null,"Enterprise","Enterprise"]
["VARIABLE COSTS",null,null,null,null,"Quantity","Quantity","Units","$/Unit","$/Unit","Total","Total","Total","Total"]
["Production Costs"]
[null,"Stocker Purchase",null,null,null,4,null,"CWT",225,null,900,{"$f":"+J18*G18","v":0},288000,{"$f":"+L18*E$7","v":0}]
[null,"Stocker Delivery",null,null,null,1,null,"Head",7.5,null,7.5,{"$f":"+J19*G19","v":0},2400,{"$f":"+L19*E$7","v":0}]
[null,"Grazing",null,null,null,null,null,null,null,null,"$116"]
[null,null,"Acre Lease",null,null,3.1250000000000002E-3,null,"Acre",0,null,0,0,0,{"$f":"+L21*E$7","v":0}]
[null,null,"Grazing by Month",null,null,0,null,"Month",0,null,0,0,0,0]
[null,null,"Gain Contract",null,null,193.33333333333334,null,"Pounds",0.6,null,116,0,37120,0]
[null,null,"On Weight Per Month",null,null,0,null,"Month",0,null,0,{"$f":"+G24*J24*G18","v":0},0,0]
[null,"Health",null,null,null,null,null,null,null,null,"$11.44"]
[null,null,"Health and Vet - Stocker",null,null,6.7300000000000013,null,"Ounce",1.7,null,11.441000000000003,{"$f":"+J26*G26","v":0},3661.1200000000008,{"$f":"+L26*E$7","v":0}]
[null,null,null,null,null,0,null,null,0,null,0,0,0,0]
[null,null,null,null,null,0,null,null,0,null,0,0,0,0]
[null,null,null,null,null,0,null,null,0,null,0,0,0,0]
[null,"Feed",null,null,null,null,null,null,null,null,"$8.74"]
[null,null,"Salt and Mineral",null,null,15,null,"Pound",0.20140000000000002,null,3.0210000000000004,0,966.72000000000014,0]
[null,null,"Bermuda Hay",null,null,8.3000000000000004E-2,null,"Roll",68.900000000000006,null,5.718700000000001,0,1829.9840000000004,0]
[null,null,null,null,null,0,null,null,0,null,0,0,0,0]
[null,null,null,null,null,0,null,null,0,null,0,0,0,0]
[null,null,null,null,null,0,null,null,0,null,0,0,0,0]
[null,"Miscellaneous",null,null,null,null,null,null,null,null,"$2.65"]
[null,null,"Preconditioning",null,null,1,null,"Acre",2.6500000000000004,null,2.6500000000000004,{"$f":"+J37*G37","v":0},848.00000000000011,{"$f":"+L37*E$7","v":0}]
[null,null,null,null,null,1,null,null,0,null,0,0,0,0]
[null,null,null,null,null,1,null,null,0,null,0,0,0,0]
[null,"Fuel",null,null,null,1,null,"Head",0,null,0,0,0,0]
[null,"Lube (As a % of fuel)",null,null,null,0.1,null,"Percent",0,null,0,0,0,0]
[null,"Utilities",null,null,null,1,null,"Head",0,null,0,0,0,0]
[null,"Repairs ",null,null,null,1,null,"Head",0,null,0,0,0,0]
[null,"Marketing",null,null,null,0.96,null,"Head",0,null,0,0,0,0]
[null,"Labor",null,null,null,1,null,"Head",98.407999999999987,null,98.407999999999987,0,31490.559999999998,0]
[null,null,null,null,null,null,null,null,null,null,0,{"$f":"+J46*G46","v":0},0,{"$f":"+L46*E$7","v":0}]
[null,null,null,null,null,null,null,null,null,null,0,{"$f":"+J47*G47","v":0},0,{"$f":"+L47*E$7","v":0}]
[null,"Interest on Credit Line",null,null,null,null,null,null,0.08,null,23.616239627397256,{"$f":"+SUM(L18:L45)*J48/2","v":0},7557.1966807671215,0]
["Total Variable Costs",null,null,null,null,null,null,null,null,null,1168.3549396273972,{"$f":"+SUM(L18:L48)","v":0},373873.58068076707,{"$f":"+SUM(N18:N48)","v":0}]
[]
["Planned Returns Above Variable Costs:",null,null,null,null,null,null,null,null,null,-96.706939627397333,{"$f":"+L14-L49","v":0},-30946.220680767088,{"$f":"+N14-N49","v":0}]
[]
[null,"Breakeven Price to Cover Variable Costs",null,null,null,null,null,null,199.5141631877386,{"$f":"+IF(G11=0,\"n/a\",(L49-SUM(L12:L13))/(G11*E11))","v":"n/a"},"CWT"]
[null,null,null,null,null,null,null,null,null,null,null,null,"Enterprise","Enterprise"]
["FIXED COSTS",null,null,null,null,"Quantity","Quantity","Units","$/Unit","$/Unit","Total","Total","Total","Total"]
[]
[null,"Depreciation",null,null,null,1,null,"Head",0,null,0,{"$f":"+J57*G57","v":0},0,{"$f":"+L57*E$7","v":0}]
[null,"Equipment Investment",null,null,null,0,null,"dollars",0.08,null,0,0,0,0]
[null,"Salaried Labor",null,null,null,1,null,"Head",0,null,0,0,0,0]
[null,"Management Fee, Owner/Operator Labor",null,null,null,1,null,"Head",0,null,0,0,0,0]
[null,"Insurance",null,null,null,1,null,"Head",0,null,0,0,0,0]
[null,null,null,null,null,null,null,null,null,null,0,0,0,0]
[null,null,null,null,null,null,null,null,null,null,0,0,0,0]
["Total Fixed Costs",null,null,null,null,null,null,null,null,null,0,{"$f":"+SUM(L57:L61)","v":0},0,{"$f":"+SUM(N57:N61)","v":0}]
[]
["Total Costs",null,null,null,null,null,null,null,null,null,1168.3549396273972,{"$f":"+L49+L64","v":0},373873.58068076707,{"$f":"+N49+N64","v":0}]
[]
["Planned Returns to Management, Risk, and Profit:",null,null,null,null,null,null,null,null,null,-96.706939627397333,{"$f":"+L51-L64","v":0},-30946.220680767088,{"$f":"+N51-N64","v":0}]
[]
["    Breakeven Price to Cover Total Costs",null,null,null,null,null,null,null,199.5141631877386,{"$f":"+IF(G11=0,\"n/a\",(L66-SUM(L12:L13))/(G11*E11))","v":"n/a"},"CWT"]
[]
[null,null,"Example Breakeven Sensitivity Analysis"]
[null,null,null,null,null,"Purchase Weight (Lbs/Hd): 400",null,"Sales Price/Cwt of $Total"]
[null,null,null,null,null,"Sales Price/Cwt  183.00",null,"Purchase Price/Cwt  225.00"]
[null,null,"ADG (Lbs/day)","Net Pay Weight with Shrink",null,"Breakeven Purchase Price ($/CWT)",null,"Breakeven Sales Price ($/CWT)"]
[null,null,2.0247272727272727,624.74472727272723,null,207.29914931133243,null,194.8053888758821]
[null,null,1.8560000000000003,606.01599999999996,null,199.07349229315065,null,200.82578602631045]
[null,null,1.6872727272727275,610,null,200.82326509315064,null,199.5141631877386]
[null,null,1.5185454545454549,568.55854545454542,null,182.62217825678701,null,214.05647759145393]
[null,null,1.349818181818182,549.82981818181815,null,174.39652123860523,null,221.34783440259966]
[]
["  Developed by Extension Economists, Texas A&M AgriLife Extension Service, budgets@tamu.edu.  "]
[]
["Information presented is prepared solely as a general guide and not intended to recognize or predict the costs and returns from any one operation.  Brand names are mentioned only as examples and imply no endorsement."]

{"sheet":"Livestock Budget","index":26,"n_rows":116,"n_cols":8,"rows_kept":116,"cut":false,"hidden":false,"merged":[[94,4,94,5],[94,6,94,7],[0,0,0,6],[2,0,2,6],[92,1,92,7],[93,4,93,5],[93,6,93,7],[95,4,95,5],[95,6,95,7],[96,4,96,5],[96,6,96,7],[97,4,97,5],[97,6,97,7],[98,4,98,5],[98,6,98,7],[104,2,104,7],[108,2,110,2],[108,3,110,3],[108,4,110,4],[108,5,108,7]]}
["Estimated Costs and Returns per Animal or Breeding Female"]
[]
["Livestock Budget"]
[]
["Number of Head of Livestock",null,null,0]
[]
["Enter Your Values in the cells highlighed in MAROON.",null,null,null,null,null,null,"Enterprise"]
["REVENUE",null,"Head","Quantity","Units","$/Unit","Total","Total"]
[null,"Males Sold",0,0,"CWT",0,{"$f":"IF($D$5=0,0,C9/$D$5*D9*F9)","v":0},{"$f":"+G9*$D$5","v":0}]
[null,"Females Sold",0,0,"CWT",0,{"$f":"IF($D$5=0,0,C10/$D$5*D10*F10)","v":0},{"$f":"+G10*$D$5","v":0}]
[null,"Cull Breeding Females",0,0,"CWT",0,0,0]
[null,"Cull Breeding Males",0,0,"CWT",0,0,0]
[null,"Stocker or Feed Animal",0,0,"CWT",0,0,0]
[null,"Other Revenue",0,0,"CWT",0,0,0]
[null,"Other Revenue",0,0,"CWT",0,0,0]
[null,"Other Revenue",0,0,"CWT",0,0,0]
[]
["Total Revenue",null,null,null,null,null,{"$f":"+SUM(G9:G17)","v":0},{"$f":"+SUM(H9:H17)","v":0}]
[]
[null,null,null,null,null,null,null,"Enterprise"]
["VARIABLE COSTS",null,null,"Quantity","Units","$/Unit","Total","Total"]
["Production Costs"]
[null,"Animal Purchase Price, if applicable",null,0,"Cwt",0,{"$f":"D23*F23","v":0},{"$f":"+G23*$D$5","v":0}]
[null,"Pasture",{"$f":"+SUM(G25:G28)","v":0}]
[null,null,"Pasture 1",0,"Acre",0,{"$f":"D25*F25","v":0},{"$f":"+G25*$D$5","v":0}]
[null,null,"Pasture 2",0,"Acre",0,0,0]
[null,null,"Pasture 3",0,"Acre",0,0,0]
[null,null,"Pasture 4",0,"Acre",0,0,0]
[null,"Feed",{"$f":"SUM(G30:G37)","v":0}]
[null,null,"Hay",0,"Bales",0,{"$f":"D30*F30","v":0},{"$f":"+G30*$D$5","v":0}]
[null,null,"Supplement",0,"Cwt,lb,etc",0,{"$f":"D31*F31","v":0},{"$f":"+G31*$D$5","v":0}]
[null,null,"Salt Minerals",0,"Cwt",0,0,0]
[null,null,"Other Feed",0,"Cwt,lb,etc",0,0,0]
[null,null,"Other Feed",0,"Cwt,lb,etc",0,0,0]
[null,null,"Other Feed",0,"Cwt,lb,etc",0,0,0]
[null,null,"Other Feed",0,"Cwt,lb,etc",0,0,0]
[null,null,"Other Feed",0,"Cwt,lb,etc",0,0,0]
[null,"Health",{"$f":"SUM(G39:G48)","v":0}]
[null,null,"Vet/Medicine 1",0,"Visit,dose,cc's, etc.",0,{"$f":"D39*F39","v":0},{"$f":"+G39*$D$5","v":0}]
[null,null,"Vet/Medicine 2",0,"Visit,dose,cc's, etc.",0,0,0]
[null,null,"Vet/Medicine 3",0,"Visit,dose,cc's, etc.",0,0,0]
[null,null,"Vet/Medicine 4",0,"Visit,dose,cc's, etc.",0,0,0]
[null,null,"Vet/Medicine 5",0,"Visit,dose,cc's, etc.",0,0,0]
[null,null,"Vet/Medicine 6",0,"Visit,dose,cc's, etc.",0,0,0]
[null,null,"Vet/Medicine 7",0,"Visit,dose,cc's, etc.",0,0,0]
[null,null,"Vet/Medicine 8",0,"Visit,dose,cc's, etc.",0,0,0]
[null,null,"Vet/Medicine 9",0,"Visit,dose,cc's, etc.",0,0,0]
[null,null,"Vet/Medicine 10",0,"Visit,dose,cc's, etc.",0,0,0]
[]
[null,"Fuel, Lube, Repair",null,1,"Head",0,0,0]
[]
[null,"Labor",null,0,"Hours",0,0,0]
[]
[null,"Other Variable Expense",null,0,"Cwt,lb,etc",0,0,0]
[null,"Other Variable Expense",null,0,"Cwt,lb,etc",0,0,0]
[null,"Other Variable Expense",null,0,"Cwt,lb,etc",0,0,0]
[null,"Other Variable Expense",null,0,"Cwt,lb,etc",0,0,0]
[null,"Other Variable Expense",null,0,"Cwt,lb,etc",0,0,0]
[null,"Other Variable Expense",null,0,"Cwt,lb,etc",0,0,0]
[]
[null,"Operating Interest",null,null,null,0,{"$f":"+SUM(G23:G59)/2*F61","v":0},0]
[]
["Total Variable Costs",null,null,null,null,null,{"$f":"+SUM(G23:G62)","v":0},{"$f":"+SUM(H23:H62)","v":0}]
[]
["Planned Returns Above Variable Costs",null,null,null,null,null,{"$f":"+G18-G63","v":0},{"$f":"+H18-H63","v":0}]
[]
[null,"Breakeven Price to Cover Variable Costs",null,null,{"$f":"IF((H101/100+C13*D13)=0,0,(G63-SUM(G11:G12,G14:G16))/(H101/100+C13/D5*D13))","v":0},{"$f":"+E9","v":"CWT"}]
[]
[null,null,null,null,null,null,null,"Enterprise"]
["FIXED COSTS",null,null,"Quantity","Units","$/Unit","Total","Total"]
[null,"Depreciation - Equipment",null,0,"Head,$,etc",0,{"$f":"D71*F71","v":0},{"$f":"+G71*$D$5","v":0}]
[null,"Depreciation - Livestock",null,0,"Head,$,etc",0,{"$f":"D72*F72","v":0},0]
[null,"Equipment Investment",null,0,"Head,$,etc",0,0,0]
[null,"Insurance",null,0,"Head,$,etc",0,0,0]
[null,"Management Fee",null,0,"Head,$,etc",0,0,0]
[null,"Owner/Operator Labor",null,0,"Head,$,etc",0,0,0]
[null,"Salaried Labor",null,0,"Head,$,etc",0,0,0]
[null,"Other Fixed Expense",null,0,"Head,$,etc",0,0,0]
[null,"Other Fixed Expense",null,0,"Head,$,etc",0,0,0]
[null,"Other Fixed Expense",null,0,"Head,$,etc",0,0,0]
[null,"Other Fixed Expense",null,0,"Head,$,etc",0,0,0]
[null,"Other Fixed Expense",null,0,"Head,$,etc",0,0,0]
[]
[null,null,null,"Total Fixed Costs",null,null,{"$f":"+SUM(G71:G83)","v":0},{"$f":"+SUM(H71:H83)","v":0}]
[]
[null,null,null,"Total Specified Costs",null,null,{"$f":"+G63+G84","v":0},{"$f":"+H63+H84","v":0}]
[]
[null,null,null,"Returns Above Specifiied Costs",null,null,{"$f":"+G18-G86","v":0},{"$f":"+H18-H86","v":0}]
[]
[null,"Breakeven Price to Cover Total Costs",null,null,{"$f":"IF((H101/100+C13*D13)=0,0,(G86-SUM(G11:G12,G14:G16))/(H101/100+C13/D5*D13))","v":0},{"$f":"+F67","v":"CWT"}]
[]
[]
[null,"Sensitivity Analysis for Your Breeding Herd or Flock Values"]
[null,"Your Weaning Percent","Your Gross Sales per Head","Pounds Produced per Head",{"$f":"\"Your Breakeven Pay Weight to Cover Total Cost\"","v":"Your Breakeven Pay Weight to Cover Total Cost"},null,"Your Average Breakeven Price to Cover Total Cost"]
[null,{"$f":"+B96-0.03","v":-0.06},{"$f":"+IF($B$97=0,0,YTotRet-$G$9-$G$10+($G$9+$G$10)*B95/$B$97)","v":0},{"$f":"IF($B$97=0,0,$H$101*B95/$B$97+$H$102)","v":0},{"$f":"IF($C$97=0,0,(YTotExp-($G$18-$G$9-$G$10))/(YPrice/100)/(B95-$C$11/$D$5))","v":0},null,{"$f":"IF(D95-$H$102=0,0,(YTotExp-($G$18-$G$9-$G$10))/(D95-$H$102)*100)","v":0}]
[null,{"$f":"+B97-0.03","v":-0.03},{"$f":"+IF($B$97=0,0,YTotRet-$G$9-$G$10+($G$9+$G$10)*B96/$B$97)","v":0},{"$f":"IF($B$97=0,0,$H$101*B96/$B$97+$H$102)","v":0},{"$f":"IF($C$97=0,0,(YTotExp-($G$18-$G$9-$G$10))/(YPrice/100)/(B96-$C$11/$D$5))","v":0},null,{"$f":"IF(D96-$H$102=0,0,(YTotExp-($G$18-$G$9-$G$10))/(D96-$H$102)*100)","v":0}]
[null,0,{"$f":"+G18","v":0},{"$f":"H101+H102","v":0},{"$f":"IF($C$97=0,0,(YTotExp-($G$18-$G$9-$G$10))/(YPrice/100)/(B97-$C$11/$D$5))","v":0},null,{"$f":"IF(D97-$H$102=0,0,(YTotExp-($G$18-$G$9-$G$10))/(D97-$H$102)*100)","v":0}]
[null,{"$f":"+B97+0.03","v":0.03},{"$f":"+IF($B$97=0,0,YTotRet-$G$9-$G$10+($G$9+$G$10)*B98/$B$97)","v":0},{"$f":"IF($B$97=0,0,$H$101*B98/$B$97+$H$102)","v":0},{"$f":"IF($C$97=0,0,(YTotExp-($G$18-$G$9-$G$10))/(YPrice/100)/(B98-$C$11/$D$5))","v":0},null,{"$f":"IF(D98-$H$102=0,0,(YTotExp-($G$18-$G$9-$G$10))/(D98-$H$102)*100)","v":0}]
[null,{"$f":"+B98+0.03","v":0.06},{"$f":"+IF($B$97=0,0,YTotRet-$G$9-$G$10+($G$9+$G$10)*B99/$B$97)","v":0},{"$f":"IF($B$97=0,0,$H$101*B99/$B$97+$H$102)","v":0},{"$f":"IF($C$97=0,0,(YTotExp-($G$18-$G$9-$G$10))/(YPrice/100)/(B99-$C$11/$D$5))","v":0},null,{"$f":"IF(D99-$H$102=0,0,(YTotExp-($G$18-$G$9-$G$10))/(D99-$H$102)*100)","v":0}]
[]
[null,null,"Your Male Price",null,null,{"$f":"+F9","v":0},null,{"$f":"IF(D5=0,0,(C9*D9+C10*D10)*100/D5)","v":0}]
[null,null,"Your Female Price",null,null,{"$f":"+F10","v":0},null,{"$f":"IF(D5=0,0,(C11*D11+C12*D12)*100/D5)","v":0}]
[null,null,"Your Weighted Average Price ($/cwt)",null,null,{"$f":"+IF((C9*D9+C10*D10)=0,F13,(G9+G10)/((C9*D9+C10*D10)/D5))","v":0}]
[]
[null,null,"Your Stocker or Feeder Breakeven Sensitivity Analysis"]
[null,null,"Your Average Daily Gain",null,0,"Pounds per Day"]
[null,null,{"$f":"+\"Your Animal\"&IF(M25=\"Stocker\",\" Grazing\",\" Feeding\")&\" Days\"","v":"Your Animal Feeding Days"},null,0,"Days"]
[null,null,"Your Sale Shrink",null,0]
[null,null,"Average Daily Gain    (Pounds/day)","Net Pay Weight with Shrink   (Pounds)",null,{"$f":"+\"Purchase Weight (Pounds/Head): \"&D23*100","v":"Purchase Weight (Pounds/Head): 0"},null,"Sales Price/Cwt of $Total"]
[null,null,null,null,null,{"$f":"\"Sales Price        \"&IF(F13=\"\",\".00\",TEXT(F13,\"#.00\"))","v":"Sales Price        .00"},null,{"$f":"\"Purchase Price        \"&IF(F23=\"\",\".00\",TEXT(F23,\"#.00\"))","v":"Purchase Price        .00"}]
[null,null,null,null,null,"Breakeven Purchase Price ($/CWT)",null,"Breakeven Sales Price ($/CWT)"]
[null,null,{"$f":"+C114*1.2","v":0},{"$f":"+(C112*$E$107+$D$23*100)*(1-$E$108)","v":0},null,{"$f":"IF($D$23=0,0,(((D112*$F$13/100*($C$13/$D$5))-($G$86-SUM($G$14:$G$16)-$G$23))/(100*$D$23))*100)","v":0},null,{"$f":"IF($C$13=0,0,($G$86-SUM($G$14:$G$16))/(D112*($C$13/$D$5)*100))","v":0}]
[null,null,{"$f":"+C114*1.1","v":0},{"$f":"+(C113*$E$107+$D$23*100)*(1-$E$108)","v":0},null,{"$f":"IF($D$23=0,0,(((D113*$F$13/100*($C$13/$D$5))-($G$86-SUM($G$14:$G$16)-$G$23))/(100*$D$23))*100)","v":0},null,{"$f":"IF($C$13=0,0,($G$86-SUM($G$14:$G$16))/(D113*($C$13/$D$5)*100))","v":0}]
[null,null,{"$f":"+E106","v":0},{"$f":"+(C114*$E$107+$D$23*100)*(1-$E$108)","v":0},null,{"$f":"IF($D$23=0,0,(((D114*$F$13/100*($C$13/$D$5))-($G$86-SUM($G$14:$G$16)-$G$23))/(100*$D$23))*100)","v":0},null,{"$f":"IF($C$13=0,0,($G$86-SUM($G$14:$G$16))/(D114*($C$13/$D$5)*100))","v":0}]
[null,null,{"$f":"+C114*0.9","v":0},{"$f":"+(C115*$E$107+$D$23*100)*(1-$E$108)","v":0},null,{"$f":"IF($D$23=0,0,(((D115*$F$13/100*($C$13/$D$5))-($G$86-SUM($G$14:$G$16)-$G$23))/(100*$D$23))*100)","v":0},null,{"$f":"IF($C$13=0,0,($G$86-SUM($G$14:$G$16))/(D115*($C$13/$D$5)*100))","v":0}]
[null,null,{"$f":"+C114*0.8","v":0},{"$f":"+(C116*$E$107+$D$23*100)*(1-$E$108)","v":0},null,{"$f":"IF($D$23=0,0,(((D116*$F$13/100*($C$13/$D$5))-($G$86-SUM($G$14:$G$16)-$G$23))/(100*$D$23))*100)","v":0},null,{"$f":"IF($C$13=0,0,($G$86-SUM($G$14:$G$16))/(D116*($C$13/$D$5)*100))","v":0}]

{"sheet":"Crop Budget","index":27,"n_rows":155,"n_cols":7,"rows_kept":155,"cut":false,"hidden":false,"merged":[[0,0,0,6],[2,0,2,5],[146,1,146,6]]}
["Estimated Costs and Returns per Acre"]
[]
["Crop Enterprise"]
[]
["Number of Acres of Crop",null,null,0]
[]
["Enter Your Values in the cells highlighed in MAROON.",null,null,null,null,null,"Enterprise"]
["REVENUE",null,"Quantity","Units","$/Unit","Total","Total"]
[null,"Primary Product",0,"Cwt,lb,etc",0,{"$f":"C9*E9","v":0},{"$f":"+F9*$D$5","v":0}]
[null,"Secondary Product",0,"Cwt,lb,etc",0,{"$f":"C10*E10","v":0},{"$f":"+F10*$D$5","v":0}]
[null,"Secondary Product",0,"Cwt,lb,etc",0,0,0]
[null,"Secondary Product",0,"Cwt,lb,etc",0,0,0]
[null,"Secondary Product",0,"Cwt,lb,etc",0,0,0]
[null,"Secondary Product",0,"Cwt,lb,etc",0,0,0]
[null,"Secondary Product",0,"Cwt,lb,etc",0,0,0]
[null,"Secondary Product",0,"Cwt,lb,etc",0,0,0]
[]
["Total Revenue",null,null,null,null,{"$f":"+SUM(F9:F16)","v":0},{"$f":"+SUM(G9:G16)","v":0}]
[]
[null,null,null,null,null,null,"Enterprise"]
["VARIABLE COSTS",null,"Quantity","Units","$/Unit","Total","Total"]
[]
["Custom Field and Harvest Operations"]
[null,"Custom Field Operation 1",0,"Acre",0,{"$f":"C24*E24","v":0},{"$f":"+F24*$D$5","v":0}]
[null,"Custom Field Operation 2",0,"Acre",0,0,0]
[null,"Custom Field Operation 3",0,"Acre",0,0,0]
[null,"Custom Field Operation 4",0,"Acre",0,0,0]
[null,"Custom Field Operation 5",0,"Acre",0,0,0]
[null,"Custom Field Operation 6",0,"Acre",0,0,0]
["Machinery Expenses"]
[null,"Diesel",0,"Gallon",0,{"$f":"C31*E31","v":0},0]
[null,"Gasoline",0,"Gallon",0,0,0]
[null,"Lube",0,"Acre",0,0,0]
[null,"Repairs",0,"Acre",0,0,0]
[null,"Other Machinery Expense 1",0,"Acre",0,0,0]
[null,"Other Machinery Expense 2",0,"Acre",0,0,0]
["Labor"]
[null,"Labor 1",0,"Hour",0,{"$f":"C38*E38","v":0},0]
[null,"Labor 2",0,"Hour",0,0,0]
[null,"Labor 3",0,"Hour",0,0,0]
[null,"Labor 4",0,"Hour",0,0,0]
[null,"Labor 5",0,"Hour",0,0,0]
[null,"Irrigation Labor",0,"Hour",0,0,0]
["Seed or Transplants"]
[null,"Seed",0,"Pound",0,{"$f":"C45*E45","v":0},0]
[null,"Seed Treatment",0,"Pound",0,0,0]
[null,"Seed Fee",0,"Pound",0,0,0]
[null,"Transplants",0,"Thousand",0,0,0]
[null,"Mulch",0,"Foot",0,0,0]
[null,"Other Seed or Transplant",0,"Pound",0,0,0]
["Fertilizer and Lime"]
[null,"Fertlizer 1",0,"Pound",0,{"$f":"C52*E52","v":0},0]
[null,"Fertlizer 2",0,"Pound",0,0,0]
[null,"Fertlizer 3",0,"Pound",0,0,0]
[null,"Fertlizer 4",0,"Pound",0,0,0]
[null,"Fertlizer 5",0,"Pound",0,0,0]
[null,"Lime",0,"Ton",0,0,0]
[null,"Other Soil Amendment 1",0,"Pound",0,0,0]
[null,"Other Soil Amendment 2",0,"Pound",0,0,0]
["Herbicides"]
[null,"Herbicide 1",0,"Lb,Oz,Acre",0,{"$f":"C61*E61","v":0},0]
[null,"Herbicide 2",0,"Lb,Oz,Acre",0,0,0]
[null,"Herbicide 3",0,"Lb,Oz,Acre",0,0,0]
[null,"Herbicide 4",0,"Lb,Oz,Acre",0,0,0]
[null,"Herbicide 5",0,"Lb,Oz,Acre",0,0,0]
[null,"Herbicide 6",0,"Lb,Oz,Acre",0,0,0]
["Insecticides"]
[null,"Insecticide 1",0,"Lb,Oz,Acre",0,{"$f":"C68*E68","v":0},0]
[null,"Insecticide 2",0,"Lb,Oz,Acre",0,0,0]
[null,"Insecticide 3",0,"Lb,Oz,Acre",0,0,0]
[null,"Insecticide 4",0,"Lb,Oz,Acre",0,0,0]
[null,"Insecticide 5",0,"Lb,Oz,Acre",0,0,0]
[null,"Insecticide 6",0,"Lb,Oz,Acre",0,0,0]
["Fungicides"]
[null,"Fungicide 1",0,"Lb,Oz,Acre",0,{"$f":"C75*E75","v":0},0]
[null,"Fungicide 2",0,"Lb,Oz,Acre",0,0,0]
[null,"Fungicide 3",0,"Lb,Oz,Acre",0,0,0]
[null,"Fungicide 4",0,"Lb,Oz,Acre",0,0,0]
[null,"Fungicide 5",0,"Lb,Oz,Acre",0,0,0]
[null,"Fungicide 6",0,"Lb,Oz,Acre",0,0,0]
["Growth Regulators"]
[null,"Growth Regulator 1",0,"Lb,Oz,Acre",0,{"$f":"C82*E82","v":0},0]
[null,"Growth Regulator 2",0,"Lb,Oz,Acre",0,0,0]
[null,"Growth Regulator 3",0,"Lb,Oz,Acre",0,0,0]
[null,"Growth Regulator 4",0,"Lb,Oz,Acre",0,0,0]
[null,"Growth Regulator 5",0,"Lb,Oz,Acre",0,0,0]
[null,"Growth Regulator 6",0,"Lb,Oz,Acre",0,0,0]
["Other Chemicals"]
[null,"Fumigant",0,"Lb,Oz,Acre",0,{"$f":"C89*E89","v":0},0]
[null,"Other Chemical 1",0,"Lb,Oz,Acre",0,0,{"$f":"+F90*$D$5","v":0}]
[null,"Other Chemical 2",0,"Lb,Oz,Acre",0,0,{"$f":"+F91*$D$5","v":0}]
[null,"Other Chemical 3",0,"Lb,Oz,Acre",0,0,{"$f":"+F92*$D$5","v":0}]
[null,"Other Chemical 4",0,"Lb,Oz,Acre",0,0,{"$f":"+F93*$D$5","v":0}]
[null,"Other Chemical 5",0,"Lb,Oz,Acre",0,0,{"$f":"+F94*$D$5","v":0}]
["Irrigation"]
[null,"Well Expense",0,"Acre",0,{"$f":"C96*E96","v":0},{"$f":"+F96*$D$5","v":0}]
[null,"Pump Fuel",0,"Mcf,kWh,Gallon",0,0,0]
[null,"Pump Expense",0,"Acre",0,0,0]
[null,"Irrigation Equipment Expense",0,"Acre",0,0,0]
[null,"Repairs",0,"Acre",0,0,0]
[null,"Drip Tape",0,"Foot,Acre",0,0,0]
[null,"Water Cost",0,"AcIn,Gallon",0,0,0]
[null,"Other Irrigation Expense 1",0,"Acre",0,0,0]
[null,"Other Irrigation Expense 2",0,"Acre",0,0,0]
["Miscellaneous Expenses"]
[null,"Crop Insurance",0,"Acre",0,{"$f":"C106*E106","v":0},0]
[null,"Other Variable Expense 1",0,"Enter Unit",0,0,0]
[null,"Other Variable Expense 2",0,"Enter Unit",0,0,0]
[null,"Other Variable Expense 3",0,"Enter Unit",0,0,0]
[null,"Other Variable Expense 4",0,"Enter Unit",0,0,0]
[null,"Other Variable Expense 5",0,"Enter Unit",0,0,0]
[null,"Other Variable Expense 6",0,"Enter Unit",0,0,0]
[null,"Other Variable Expense 7",0,"Enter Unit",0,0,0]
[null,"Other Variable Expense 8",0,"Enter Unit",0,0,0]
[]
[null,"Operating Interest",null,null,0,{"$f":"+SUM(F23:F115)/2*E116","v":0},{"$f":"+F116*$D$6","v":0}]
[]
["Total Variable Costs",null,null,null,null,{"$f":"+SUM(F23:F116)","v":0},{"$f":"+SUM(G23:G116)","v":0}]
[]
["Planned Returns Above Variable Costs",null,null,null,null,{"$f":"+F18-F118","v":0},{"$f":"+G18-G118","v":0}]
[]
[null,"Breakeven Price to Cover Variable Costs",null,null,{"$f":"+IF(C9=0,0,F118-SUM(F10:F16)/C9)","v":0},{"$f":"+D9","v":"Cwt,lb,etc"}]
[]
[null,null,null,null,null,null,"Enterprise"]
["FIXED COSTS",null,"Quantity","Units","$/Unit","Total","Total"]
[null,"Land Rent or Expense",1,"Acre",0,{"$f":"C126*E126","v":0},{"$f":"+F126*$D$6","v":0}]
[null,"Depreciation - Equipment",1,"Acre",0,{"$f":"C127*E127","v":0},0]
[null,"Equipment Investment",0,"$",0,0,0]
[null,"Insurance",1,"Acre",0,0,0]
[null,"Management Fee",1,"Acre",0,0,0]
[null,"Owner/Operator Labor",0,"Acre",0,0,0]
[null,"Salaried Labor",1,"Acre,$,etc",0,0,0]
[null,"Other Fixed Expense",0,"Acre,$,etc",0,0,0]
[null,"Other Fixed Expense",0,"Acre,$,etc",0,0,0]
[null,"Other Fixed Expense",0,"Acre,$,etc",0,0,0]
[null,"Other Fixed Expense",0,"Acre,$,etc",0,0,0]
[null,"Other Fixed Expense",0,"Acre,$,etc",0,0,0]
[]
[null,null,null,"Total Fixed Costs",null,{"$f":"+SUM(F126:F137)","v":0},{"$f":"+SUM(G126:G137)","v":0}]
[]
[null,null,null,"Total Specified Costs",null,{"$f":"+F118+F139","v":0},{"$f":"+G118+G139","v":0}]
[]
[null,null,null,"Returns Above Specifiied Costs",null,{"$f":"+F18-F141","v":0},{"$f":"+G18-G141","v":0}]
[]
[null,"Breakeven Price to Cover Total Costs",null,null,{"$f":"+IF(C9=0,0,F141-SUM(F10:F16)/C9)","v":0},{"$f":"+D9","v":"Cwt,lb,etc"}]
[]
[null,"Breakeven Prices for Your Crop"]
[null,null,null,null,"Price To Cover",null,"Price To Cover"]
[null,"Yield","Yield",null,"Variable",null,"Total"]
[null,"Percent",{"$f":"+D9","v":"Cwt,lb,etc"},null,"Costs",null,"Costs"]
[null,0.75,{"$f":"+$C$153*B151","v":0},null,{"$f":"+IF(C151=0,0,($F$118-SUM($F$10:$F$16))/C151)","v":0},null,{"$f":"+IF(C151=0,0,($F$141-SUM($F$10:$F$16))/C151)","v":0}]
[null,0.9,{"$f":"+$C$153*B152","v":0},null,{"$f":"+IF(C152=0,0,($F$118-SUM($F$10:$F$16))/C152)","v":0},null,{"$f":"+IF(C152=0,0,($F$141-SUM($F$10:$F$16))/C152)","v":0}]
[null,1,{"$f":"+C9","v":0},null,{"$f":"+IF(C153=0,0,($F$118-SUM($F$10:$F$16))/C153)","v":0},null,{"$f":"+IF(C153=0,0,($F$141-SUM($F$10:$F$16))/C153)","v":0}]
[null,1.1000000000000001,0,null,{"$f":"+IF(C154=0,0,($F$118-SUM($F$10:$F$16))/C154)","v":0},null,{"$f":"+IF(C154=0,0,($F$141-SUM($F$10:$F$16))/C154)","v":0}]
[null,1.25,0,null,{"$f":"+IF(C155=0,0,($F$118-SUM($F$10:$F$16))/C155)","v":0},null,{"$f":"+IF(C155=0,0,($F$141-SUM($F$10:$F$16))/C155)","v":0}]

{"sheet":"Comparative Returns - Cash Rent","index":28,"n_rows":45,"n_cols":11,"rows_kept":45,"cut":false,"hidden":false,"merged":[[2,7,2,10],[2,4,2,5],[2,1,2,2]]}
["Comparative Returns - Cash Rent"]
[]
[null,"Returns Above Total Specified Expenses",null,null,"Total Direct Expenses",null,null,"Breakeven Yield to Cover Total Costs at Price Entered"]
[null,"Total Costs","Variable Costs",null,"Total Costs","Variable Costs",null,"Price","Units","Total Costs","Variable Costs"]
["FORAGE CROPS"]
[]
[{"$f":"+CoastalHay!A3","v":"Coastal Bermudagrass Hay and Grazing (3 Cuttings)"},{"$f":"+CoastalHay!TotRet","v":1391.484159619414},{"$f":"+CoastalHay!VarRet","v":1459.6496646413875},null,{"$f":"+CoastalHay!TotExp","v":393.51584038058604},{"$f":"+CoastalHay!VarExp","v":325.35033535861254},null,{"$f":"+CoastalHay!Price","v":195},{"$f":"+CoastalHay!Unit","v":"Roll"},{"$f":"+IF($H7=0,0,E7/$H7)","v":2.0180299506696722},1.6684632582492951]
[{"$f":"+CoastalPasture!A3","v":"Coastal Bermudagrass Pasture"},{"$f":"+CoastalPasture!TotRet","v":-184.60928888268967},{"$f":"+CoastalPasture!VarRet","v":-151.64816183622801},null,{"$f":"+CoastalPasture!TotExp","v":184.60928888268967},{"$f":"+CoastalPasture!VarExp","v":151.64816183622801},null,{"$f":"+CoastalPasture!Price","v":0},{"$f":"+CoastalPasture!Unit","v":""},0,0]
[{"$f":"+SorghumHay!A3","v":"Sorghum Hay (2 Cuttings)"},{"$f":"+SorghumHay!TotRet","v":363.74251398689762},{"$f":"+SorghumHay!VarRet","v":431.00267446597928},null,{"$f":"+SorghumHay!TotExp","v":356.25748601310238},{"$f":"+SorghumHay!VarExp","v":288.99732553402072},null,{"$f":"+SorghumHay!Price","v":90},{"$f":"+SorghumHay!Unit","v":"Roll"},3.9584165112566931,3.2110813948224526]
[]
["FIELD CROPS - IRRIGATED"]
[]
[{"$f":"+IrrigatedCotton!A3","v":"Cotton - Genetically Modified Seed, Conv. Till-24 Row, Irrigated, 1250 lb. Yield Goal"},{"$f":"+IrrigatedCotton!TotRet","v":464.93081721581484},{"$f":"+IrrigatedCotton!VarRet","v":691.64388320529304},null,{"$f":"+IrrigatedCotton!TotExp","v":969.66918278418507},{"$f":"+IrrigatedCotton!VarExp","v":742.95611679470687},null,{"$f":"+IrrigatedCotton!Price","v":0.9},{"$f":"+IrrigatedCotton!Unit","v":"Pound"},{"$f":"+IF($H13=0,0,E13/$H13)","v":1077.4102030935389},825.50679643856313]
[{"$f":"+IrrigatedSesame!A3","v":"Sesame - Conventional Till-12 Row, Irrigated, 1100 lb. Yield Goal"},{"$f":"+IrrigatedSesame!TotRet","v":-13.809239764304266},{"$f":"+IrrigatedSesame!VarRet","v":174.12461876547943},null,{"$f":"+IrrigatedSesame!TotExp","v":365.80923976430427},{"$f":"+IrrigatedSesame!VarExp","v":177.87538123452057},null,{"$f":"+IrrigatedSesame!Price","v":0.32},{"$f":"+IrrigatedSesame!Unit","v":"Pound"},1143.1538742634509,555.86056635787679]
[{"$f":"+IrrigatedSorghumLCB!A3","v":"Sorghum - Conventional Till-24 Row, Irrigated, 100 bu. Yield Goal"},{"$f":"+IrrigatedSorghumLCB!TotRet","v":-52.159533692249681},{"$f":"+IrrigatedSorghumLCB!VarRet","v":148.59951393166392},null,{"$f":"+IrrigatedSorghumLCB!TotExp","v":562.15953369224962},{"$f":"+IrrigatedSorghumLCB!VarExp","v":361.40048606833602},null,{"$f":"+IrrigatedSorghumLCB!Price","v":5.0999999999999996},{"$f":"+IrrigatedSorghumLCB!Unit","v":"Bushel"},110.22735954749993,70.862840405556085]
[{"$f":"+IrrigatedWheatLCB!A3","v":"Hard Red Spring Wheat, Irrigated, 60 bu. Yield Goal"},{"$f":"+IrrigatedWheatLCB!TotRet","v":11.8693482908335},{"$f":"+IrrigatedWheatLCB!VarRet","v":211.17057108508101},null,{"$f":"+IrrigatedWheatLCB!TotExp","v":483.1306517091665},{"$f":"+IrrigatedWheatLCB!VarExp","v":283.82942891491899},null,{"$f":"+IrrigatedWheatLCB!Price","v":8.25},{"$f":"+IrrigatedWheatLCB!Unit","v":"Bushel"},58.561291116262609,34.403567141202302]
[]
["FIELD CROPS - DRYLAND, LOWER COAST"]
[]
[{"$f":"+CanolaLCB!A3","v":"Canola, Dryland, 1500 lb. Yield Goal - Lower Coast"},{"$f":"+CanolaLCB!TotRet","v":-74.782046983559781},{"$f":"+CanolaLCB!VarRet","v":43.936246803067348},null,{"$f":"+CanolaLCB!TotExp","v":344.78204698355978},{"$f":"+CanolaLCB!VarExp","v":226.06375319693265},null,{"$f":"+CanolaLCB!Price","v":0.18},{"$f":"+CanolaLCB!Unit","v":"Pound"},{"$f":"+IF($H20=0,0,E20/$H20)","v":1915.4558165753322},1255.9097399829593]
[{"$f":"+CottonLCB!A3","v":"Cotton - Conventional Seed, Till-24 Row, Dryland, 800 lb. Yield Goal - Lower Coast"},{"$f":"+CottonLCB!TotRet","v":219.74342030035109},{"$f":"+CottonLCB!VarRet","v":370.43821979486461},null,{"$f":"+CottonLCB!TotExp","v":709.05657969964886},{"$f":"+CottonLCB!VarExp","v":558.36178020513535},null,{"$f":"+CottonLCB!Price","v":0.9},{"$f":"+CottonLCB!Unit","v":"Pound"},787.84064411072097,620.40197800570593]
[{"$f":"+Cotton!A3","v":"Cotton - Genetically Modified Seed, Conv. Till-24 Row, Dryland, 800 lb. Yield Goal - Lower Coast"},{"$f":"+Cotton!TotRet","v":240.04644596597541},{"$f":"+Cotton!VarRet","v":389.79954495875393},null,{"$f":"+Cotton!TotExp","v":688.75355403402455},{"$f":"+Cotton!VarExp","v":539.00045504124603},null,{"$f":"+Cotton!Price","v":0.9},{"$f":"+Cotton!Unit","v":"Pound"},765.28172670447168,598.88939449027339]
[{"$f":"+Sesame!A3","v":"Sesame - Conventional Till-12 Row, Dryland, 800 lb. Yield Goal - Lower Coast"},{"$f":"+Sesame!TotRet","v":-40.369140506791041},{"$f":"+Sesame!VarRet","v":91.094751026293011},null,{"$f":"+Sesame!TotExp","v":296.36914050679104},{"$f":"+Sesame!VarExp","v":164.90524897370699},null,{"$f":"+Sesame!Price","v":0.32},{"$f":"+Sesame!Unit","v":"Pound"},926.15356408372202,515.32890304283433]
[{"$f":"+SorghumLCB!A3","v":"Sorghum - Conventional Till-24 Row, Dryland, 72 bu. Yield Goal - Lower Coast"},{"$f":"+SorghumLCB!TotRet","v":-22.390270626879328},{"$f":"+SorghumLCB!VarRet","v":120.48689233411642},null,{"$f":"+SorghumLCB!TotExp","v":389.59027062687932},{"$f":"+SorghumLCB!VarExp","v":246.71310766588357},null,{"$f":"+SorghumLCB!Price","v":5.0999999999999996},{"$f":"+SorghumLCB!Unit","v":"Bushel"},76.390249142525363,48.375119150173255]
[{"$f":"+WheatLCB!A3","v":"Hard Red Spring Wheat, Dryland, 35 bu. Yield Goal - Lower Coast"},{"$f":"+WheatLCB!TotRet","v":-11.883590616222193},{"$f":"+WheatLCB!VarRet","v":106.83050266866999},null,{"$f":"+WheatLCB!TotExp","v":300.63359061622219},{"$f":"+WheatLCB!VarExp","v":181.91949733133001},null,{"$f":"+WheatLCB!Price","v":8.25},{"$f":"+WheatLCB!Unit","v":"Bushel"},36.440435226208749,22.050848161373334]
[{"$f":"+WheatNW!A3","v":"Hard Red Spring Wheat, Dryland, 35 bu. Yield Goal, Northwest - Lower Coast"},{"$f":"+WheatNW!TotRet","v":-16.976625903226363},{"$f":"+WheatNW!VarRet","v":101.73746738166585},null,{"$f":"+WheatNW!TotExp","v":305.72662590322636},{"$f":"+WheatNW!VarExp","v":187.01253261833415},null,{"$f":"+WheatNW!Price","v":8.25},{"$f":"+WheatNW!Unit","v":"Bushel"},37.057772836754708,22.668185771919291]
[]
["FIELD CROPS - DRYLAND, UPPER COAST"]
[]
[{"$f":"+Corn!A3","v":"Corn - GMO Seed, Conventional Till-12 Row, Dryland, 100 bu. Yield Goal - Upper Coast"},{"$f":"+Corn!TotRet","v":34.796715253483512},{"$f":"+Corn!VarRet","v":187.18969751495791},null,{"$f":"+Corn!TotExp","v":565.20328474651649},{"$f":"+Corn!VarExp","v":412.81030248504209},null,{"$f":"+Corn!Price","v":6},{"$f":"+Corn!Unit","v":"Bushel"},{"$f":"+IF($H30=0,0,E30/$H30)","v":94.200547457752748},68.801717080840348]
[{"$f":"+CottonUCB!A3","v":"Cotton - GMO Seed, Conv. Till-12 Row, Dryland, 900 lb. Yield Goal - Upper Coast"},{"$f":"+CottonUCB!TotRet","v":306.20423634115491},{"$f":"+CottonUCB!VarRet","v":477.5024834384493},null,{"$f":"+CottonUCB!TotExp","v":727.35576365884504},{"$f":"+CottonUCB!VarExp","v":556.05751656155064},null,{"$f":"+CottonUCB!Price","v":0.9},{"$f":"+CottonUCB!Unit","v":"Pound"},808.17307073205006,617.84168506838955]
[{"$f":"+SorghumUCB!A3","v":"Sorghum - Conventional Till-12 Row, Dryland, 90 bu. Yield Goal - Upper Coast"},{"$f":"+SorghumUCB!TotRet","v":45.026233383896795},{"$f":"+SorghumUCB!VarRet","v":193.04665300062453},null,{"$f":"+SorghumUCB!TotExp","v":413.97376661610315},{"$f":"+SorghumUCB!VarExp","v":265.95334699937541},null,{"$f":"+SorghumUCB!Price","v":5.0999999999999996},{"$f":"+SorghumUCB!Unit","v":"Bushel"},81.171326787471216,52.147715097916752]
[{"$f":"+Soybeans!A3","v":"Soybeans - GMO Seed, Conventional Till-12 Row, Dryland, 30 bu. Yield Goal - Upper Coast"},{"$f":"+Soybeans!TotRet","v":10.390552235682208},{"$f":"+Soybeans!VarRet","v":151.32442622361449},null,{"$f":"+Soybeans!TotExp","v":373.60944776431779},{"$f":"+Soybeans!VarExp","v":232.67557377638551},null,{"$f":"+Soybeans!Price","v":12.8},{"$f":"+Soybeans!Unit","v":"Bushel"},29.188238106587328,18.177779201280117]
[{"$f":"+WheatUCB!A3","v":"Soft Red Winter Wheat, 45 bu. Yield Goal - Upper Coast"},{"$f":"+WheatUCB!TotRet","v":-16.409303884661313},{"$f":"+WheatUCB!VarRet","v":122.28682769907613},null,{"$f":"+WheatUCB!TotExp","v":358.40930388466131},{"$f":"+WheatUCB!VarExp","v":219.71317230092387},null,{"$f":"+WheatUCB!Price","v":7.6},{"$f":"+WheatUCB!Unit","v":"Bushel"},47.159118932192278,28.909627934332089]
[]
["FIELD CROPS - RICE"]
[]
[{"$f":"+RiceFirstCrop!A3","v":"Rice West of Houston, 1st Crop, Surface Water"},{"$f":"+RiceFirstCrop!TotRet","v":-58.059349812589062},{"$f":"+RiceFirstCrop!VarRet","v":200.68027762482279},null,{"$f":"+RiceFirstCrop!TotExp","v":1178.0593498125891},{"$f":"+RiceFirstCrop!VarExp","v":919.31972237517721},null,{"$f":"+RiceFirstCrop!Price","v":7.26},{"$f":"+RiceFirstCrop!Unit","v":"CWT"},{"$f":"+IF($H38=0,0,E38/$H38)","v":162.26712807335937},{"$f":"+IF($H38=0,0,F38/$H38)","v":126.62806093322}]
[{"$f":"+RiceSecondCrop!A3","v":"Rice West of Houston, 2nd Crop, Surface Water"},{"$f":"+RiceSecondCrop!TotRet","v":5.2940114659672304},{"$f":"+RiceSecondCrop!VarRet","v":29.486809341635819},null,{"$f":"+RiceSecondCrop!TotExp","v":194.70598853403277},{"$f":"+RiceSecondCrop!VarExp","v":170.51319065836418},null,{"$f":"+RiceSecondCrop!Price","v":7},{"$f":"+RiceSecondCrop!Unit","v":"CWT"},{"$f":"+IF($H39=0,0,E39/$H39)","v":27.815141219147538},{"$f":"+IF($H39=0,0,F39/$H39)","v":24.359027236909167}]
[]
["LIVESTOCK"]
[]
[{"$f":"+CowCalf!A3","v":"Cow-Calf Improved Pasture"},{"$f":"+CowCalf!TotRet","v":162.92729056653354},{"$f":"+CowCalf!VarRet","v":569.33524866177163},null,{"$f":"+CowCalf!TotExp","v":691.50570943346645},{"$f":"+CowCalf!VarExp","v":285.09775133822836},null,{"$f":"+CowCalf!Price","v":183.12903225806454},{"$f":"+CowCalf!Unit","v":"CWT"},{"$f":"+IF($H43=0,0,E43/$H43)","v":3.7760572472146303},1.5568135091571389]
[{"$f":"+StockersSummer!A3","v":"Summer Stocker Calf Budget (160 Days Grazing)"},{"$f":"+StockersSummer!TotRet","v":114.64986060273964},{"$f":"+StockersSummer!VarRet","v":114.64986060273964},null,{"$f":"+StockersSummer!TotExp","v":1260.5501393972602},{"$f":"+StockersSummer!VarExp","v":1260.5501393972602},null,{"$f":"+StockersSummer!Price","v":191},{"$f":"+StockersSummer!Unit","v":"CWT"},6.599738949723875,6.599738949723875]
[{"$f":"+StockerWinter!A3","v":"Winter Stocker Calf Budget (110 Says Grazing)"},{"$f":"+StockerWinter!TotRet","v":-96.706939627397333},{"$f":"+StockerWinter!VarRet","v":-96.706939627397333},null,{"$f":"+StockerWinter!TotExp","v":1168.3549396273972},{"$f":"+StockerWinter!VarExp","v":1168.3549396273972},null,{"$f":"+StockerWinter!Price","v":183},{"$f":"+StockerWinter!Unit","v":"CWT"},{"$f":"+IF($H45=0,0,E45/$H45)","v":6.3844532220076351},{"$f":"+IF($H45=0,0,F45/$H45)","v":6.3844532220076351}]

{"sheet":"Comparative Returns-Share Rent","index":29,"n_rows":45,"n_cols":28,"rows_kept":45,"cut":false,"hidden":false,"merged":[[2,23,2,27],[2,1,2,3],[2,5,2,7],[2,9,2,13],[2,15,2,17],[2,19,2,21]]}
["Comparative Returns - Share Rent"]
[]
["Variable Costs to the right of Total Costs","Returns Above Total Specified Expenses",null,null,null,"Total Direct Expenses",null,null,null,"Breakeven Yield to Cover Total Costs at Price Entered",null,null,null,null,null,"Returns Above Variable Specified Expenses",null,null,null,"Variable Direct Expenses",null,null,null,"Breakeven Yield to Cover Variavle Costs at Price Entered"]
[null,"Total","Tenant","Landlord",null,"Total","Tenant","Landlord",null,"Price","Units","Total","Tenant","Landlord",null,"Total","Tenant","Landlord",null,"Total","Tenant","Landlord",null,"Price","Units","Total","Tenant","Landlord"]
["FORAGE CROPS"]
[]
[{"$f":"+CoastalHay!A3","v":"Coastal Bermudagrass Hay and Grazing (3 Cuttings)"},{"$f":"+CoastalHay!TotRet","v":1391.484159619414},{"$f":"+CoastalHay!TTotRet","v":1391.484159619414},{"$f":"+CoastalHay!LTotRet","v":0},null,{"$f":"+CoastalHay!TotExp","v":393.51584038058604},{"$f":"+CoastalHay!TTotExp","v":393.51584038058604},{"$f":"+CoastalHay!LTotExp","v":0},null,{"$f":"+CoastalHay!Price","v":195},{"$f":"+CoastalHay!Unit","v":"Roll"},{"$f":"+IF($J7=0,0,F7/$J7)","v":2.0180299506696722},2.0180299506696722,0,null,{"$f":"+CoastalHay!VarRet","v":1459.6496646413875},{"$f":"+CoastalHay!TVarRet","v":1459.6496646413875},{"$f":"+CoastalHay!LVarRet","v":0},null,{"$f":"+CoastalHay!VarExp","v":325.35033535861254},{"$f":"+CoastalHay!TVarExp","v":325.35033535861254},{"$f":"+CoastalHay!LVarExp","v":0},null,{"$f":"+CoastalHay!Price","v":195},{"$f":"+CoastalHay!Unit","v":"Roll"},{"$f":"+IF($J7=0,0,T7/$J7)","v":1.6684632582492951},1.6684632582492951,0]
[{"$f":"+CoastalPasture!A3","v":"Coastal Bermudagrass Pasture"},{"$f":"+CoastalPasture!TotRet","v":-184.60928888268967},{"$f":"+CoastalPasture!TTotRet","v":-184.60928888268967},{"$f":"+CoastalPasture!LTotRet","v":0},null,{"$f":"+CoastalPasture!TotExp","v":184.60928888268967},{"$f":"+CoastalPasture!TTotExp","v":184.60928888268967},{"$f":"+CoastalPasture!LTotExp","v":0},null,{"$f":"+CoastalPasture!Price","v":0},{"$f":"+CoastalPasture!Unit","v":""},0,0,0,null,{"$f":"+CoastalPasture!VarRet","v":-151.64816183622801},{"$f":"+CoastalPasture!TVarRet","v":-151.64816183622801},{"$f":"+CoastalPasture!LVarRet","v":0},null,{"$f":"+CoastalPasture!VarExp","v":151.64816183622801},{"$f":"+CoastalPasture!TVarExp","v":151.64816183622801},{"$f":"+CoastalPasture!LVarExp","v":0},null,{"$f":"+CoastalPasture!Price","v":0},{"$f":"+CoastalPasture!Unit","v":""},0,0,0]
[{"$f":"+SorghumHay!A3","v":"Sorghum Hay (2 Cuttings)"},{"$f":"+SorghumHay!TotRet","v":363.74251398689762},{"$f":"+SorghumHay!TTotRet","v":363.74251398689762},{"$f":"+SorghumHay!LTotRet","v":0},null,{"$f":"+SorghumHay!TotExp","v":356.25748601310238},{"$f":"+SorghumHay!TTotExp","v":356.25748601310238},{"$f":"+SorghumHay!LTotExp","v":0},null,{"$f":"+SorghumHay!Price","v":90},{"$f":"+SorghumHay!Unit","v":"Roll"},3.9584165112566931,3.9584165112566931,0,null,{"$f":"+SorghumHay!VarRet","v":431.00267446597928},{"$f":"+SorghumHay!TVarRet","v":431.00267446597928},{"$f":"+SorghumHay!LVarRet","v":0},null,{"$f":"+SorghumHay!VarExp","v":288.99732553402072},{"$f":"+SorghumHay!TVarExp","v":288.99732553402072},{"$f":"+SorghumHay!LVarExp","v":0},null,{"$f":"+SorghumHay!Price","v":90},{"$f":"+SorghumHay!Unit","v":"Roll"},3.2110813948224526,3.2110813948224526,0]
[]
["FIELD CROPS - IRRIGATED"]
[]
[{"$f":"+IrrigatedCotton!A3","v":"Cotton - Genetically Modified Seed, Conv. Till-24 Row, Irrigated, 1250 lb. Yield Goal"},{"$f":"+IrrigatedCotton!TotRet","v":464.93081721581484},{"$f":"+IrrigatedCotton!TTotRet","v":464.93081721581484},{"$f":"+IrrigatedCotton!LTotRet","v":0},null,{"$f":"+IrrigatedCotton!TotExp","v":969.66918278418507},{"$f":"+IrrigatedCotton!TTotExp","v":969.66918278418507},{"$f":"+IrrigatedCotton!LTotExp","v":0},null,{"$f":"+IrrigatedCotton!Price","v":0.9},{"$f":"+IrrigatedCotton!Unit","v":"Pound"},{"$f":"+IF($J13=0,0,F13/$J13)","v":1077.4102030935389},1077.4102030935389,0,null,{"$f":"+IrrigatedCotton!VarRet","v":691.64388320529304},{"$f":"+IrrigatedCotton!TVarRet","v":691.64388320529304},{"$f":"+IrrigatedCotton!LVarRet","v":0},null,{"$f":"+IrrigatedCotton!VarExp","v":742.95611679470687},{"$f":"+IrrigatedCotton!TVarExp","v":742.95611679470687},{"$f":"+IrrigatedCotton!LVarExp","v":0},null,{"$f":"+IrrigatedCotton!Price","v":0.9},{"$f":"+IrrigatedCotton!Unit","v":"Pound"},{"$f":"+IF($J13=0,0,T13/$J13)","v":825.50679643856313},825.50679643856313,0]
[{"$f":"+IrrigatedSesame!A3","v":"Sesame - Conventional Till-12 Row, Irrigated, 1100 lb. Yield Goal"},{"$f":"+IrrigatedSesame!TotRet","v":-13.809239764304266},{"$f":"+IrrigatedSesame!TTotRet","v":-13.809239764304266},{"$f":"+IrrigatedSesame!LTotRet","v":0},null,{"$f":"+IrrigatedSesame!TotExp","v":365.80923976430427},{"$f":"+IrrigatedSesame!TTotExp","v":365.80923976430427},{"$f":"+IrrigatedSesame!LTotExp","v":0},null,{"$f":"+IrrigatedSesame!Price","v":0.32},{"$f":"+IrrigatedSesame!Unit","v":"Pound"},{"$f":"+IF($J14=0,0,F14/$J14)","v":1143.1538742634509},1143.1538742634509,0,null,{"$f":"+IrrigatedSesame!VarRet","v":174.12461876547943},{"$f":"+IrrigatedSesame!TVarRet","v":174.12461876547943},{"$f":"+IrrigatedSesame!LVarRet","v":0},null,{"$f":"+IrrigatedSesame!VarExp","v":177.87538123452057},{"$f":"+IrrigatedSesame!TVarExp","v":177.87538123452057},{"$f":"+IrrigatedSesame!LVarExp","v":0},null,{"$f":"+IrrigatedSesame!Price","v":0.32},{"$f":"+IrrigatedSesame!Unit","v":"Pound"},{"$f":"+IF($J14=0,0,T14/$J14)","v":555.86056635787679},555.86056635787679,0]
[{"$f":"+IrrigatedSorghumLCB!A3","v":"Sorghum - Conventional Till-24 Row, Irrigated, 100 bu. Yield Goal"},{"$f":"+IrrigatedSorghumLCB!TotRet","v":-52.159533692249681},{"$f":"+IrrigatedSorghumLCB!TTotRet","v":-52.159533692249681},{"$f":"+IrrigatedSorghumLCB!LTotRet","v":0},null,{"$f":"+IrrigatedSorghumLCB!TotExp","v":562.15953369224962},{"$f":"+IrrigatedSorghumLCB!TTotExp","v":562.15953369224962},{"$f":"+IrrigatedSorghumLCB!LTotExp","v":0},null,{"$f":"+IrrigatedSorghumLCB!Price","v":5.0999999999999996},{"$f":"+IrrigatedSorghumLCB!Unit","v":"Bushel"},110.22735954749993,110.22735954749993,0,null,{"$f":"+IrrigatedSorghumLCB!VarRet","v":148.59951393166392},{"$f":"+IrrigatedSorghumLCB!TVarRet","v":148.59951393166392},{"$f":"+IrrigatedSorghumLCB!LVarRet","v":0},null,{"$f":"+IrrigatedSorghumLCB!VarExp","v":361.40048606833602},{"$f":"+IrrigatedSorghumLCB!TVarExp","v":361.40048606833602},{"$f":"+IrrigatedSorghumLCB!LVarExp","v":0},null,{"$f":"+IrrigatedSorghumLCB!Price","v":5.0999999999999996},{"$f":"+IrrigatedSorghumLCB!Unit","v":"Bushel"},70.862840405556085,70.862840405556085,0]
[{"$f":"+IrrigatedWheatLCB!A3","v":"Hard Red Spring Wheat, Irrigated, 60 bu. Yield Goal"},{"$f":"+IrrigatedWheatLCB!TotRet","v":11.8693482908335},{"$f":"+IrrigatedWheatLCB!TTotRet","v":11.8693482908335},{"$f":"+IrrigatedWheatLCB!LTotRet","v":0},null,{"$f":"+IrrigatedWheatLCB!TotExp","v":483.1306517091665},{"$f":"+IrrigatedWheatLCB!TTotExp","v":483.1306517091665},{"$f":"+IrrigatedWheatLCB!LTotExp","v":0},null,{"$f":"+IrrigatedWheatLCB!Price","v":8.25},{"$f":"+IrrigatedWheatLCB!Unit","v":"Bushel"},58.561291116262609,58.561291116262609,0,null,{"$f":"+IrrigatedWheatLCB!VarRet","v":211.17057108508101},{"$f":"+IrrigatedWheatLCB!TVarRet","v":211.17057108508101},{"$f":"+IrrigatedWheatLCB!LVarRet","v":0},null,{"$f":"+IrrigatedWheatLCB!VarExp","v":283.82942891491899},{"$f":"+IrrigatedWheatLCB!TVarExp","v":283.82942891491899},{"$f":"+IrrigatedWheatLCB!LVarExp","v":0},null,{"$f":"+IrrigatedWheatLCB!Price","v":8.25},{"$f":"+IrrigatedWheatLCB!Unit","v":"Bushel"},34.403567141202302,34.403567141202302,0]
[]
["FIELD CROPS - DRYLAND"]
[]
[{"$f":"+CanolaLCB!A3","v":"Canola, Dryland, 1500 lb. Yield Goal - Lower Coast"},{"$f":"+CanolaLCB!TotRet","v":-74.782046983559781},{"$f":"+CanolaLCB!TTotRet","v":-74.782046983559781},{"$f":"+CanolaLCB!LTotRet","v":0},null,{"$f":"+CanolaLCB!TotExp","v":344.78204698355978},{"$f":"+CanolaLCB!TTotExp","v":344.78204698355978},{"$f":"+CanolaLCB!LTotExp","v":0},null,{"$f":"+CanolaLCB!Price","v":0.18},{"$f":"+CanolaLCB!Unit","v":"Pound"},{"$f":"+IF($J20=0,0,F20/$J20)","v":1915.4558165753322},1915.4558165753322,0,null,{"$f":"+CanolaLCB!VarRet","v":43.936246803067348},{"$f":"+CanolaLCB!TVarRet","v":43.936246803067348},{"$f":"+CanolaLCB!LVarRet","v":0},null,{"$f":"+CanolaLCB!VarExp","v":226.06375319693265},{"$f":"+CanolaLCB!TVarExp","v":226.06375319693265},{"$f":"+CanolaLCB!LVarExp","v":0},null,{"$f":"+CanolaLCB!Price","v":0.18},{"$f":"+CanolaLCB!Unit","v":"Pound"},{"$f":"+IF($J20=0,0,T20/$J20)","v":1255.9097399829593},1255.9097399829593,0]
[{"$f":"+CottonLCB!A3","v":"Cotton - Conventional Seed, Till-24 Row, Dryland, 800 lb. Yield Goal - Lower Coast"},{"$f":"+CottonLCB!TotRet","v":219.74342030035109},{"$f":"+CottonLCB!TTotRet","v":219.74342030035109},{"$f":"+CottonLCB!LTotRet","v":0},null,{"$f":"+CottonLCB!TotExp","v":709.05657969964886},{"$f":"+CottonLCB!TTotExp","v":709.05657969964886},{"$f":"+CottonLCB!LTotExp","v":0},null,{"$f":"+CottonLCB!Price","v":0.9},{"$f":"+CottonLCB!Unit","v":"Pound"},787.84064411072097,787.84064411072097,0,null,{"$f":"+CottonLCB!VarRet","v":370.43821979486461},{"$f":"+CottonLCB!TVarRet","v":370.43821979486461},{"$f":"+CottonLCB!LVarRet","v":0},null,{"$f":"+CottonLCB!VarExp","v":558.36178020513535},{"$f":"+CottonLCB!TVarExp","v":558.36178020513535},{"$f":"+CottonLCB!LVarExp","v":0},null,{"$f":"+CottonLCB!Price","v":0.9},{"$f":"+CottonLCB!Unit","v":"Pound"},620.40197800570593,620.40197800570593,0]
[{"$f":"+Cotton!A3","v":"Cotton - Genetically Modified Seed, Conv. Till-24 Row, Dryland, 800 lb. Yield Goal - Lower Coast"},{"$f":"+Cotton!TotRet","v":240.04644596597541},{"$f":"+Cotton!TTotRet","v":240.04644596597541},{"$f":"+Cotton!LTotRet","v":0},null,{"$f":"+Cotton!TotExp","v":688.75355403402455},{"$f":"+Cotton!TTotExp","v":688.75355403402455},{"$f":"+Cotton!LTotExp","v":0},null,{"$f":"+Cotton!Price","v":0.9},{"$f":"+Cotton!Unit","v":"Pound"},765.28172670447168,765.28172670447168,0,null,{"$f":"+Cotton!VarRet","v":389.79954495875393},{"$f":"+Cotton!TVarRet","v":389.79954495875393},{"$f":"+Cotton!LVarRet","v":0},null,{"$f":"+Cotton!VarExp","v":539.00045504124603},{"$f":"+Cotton!TVarExp","v":539.00045504124603},{"$f":"+Cotton!LVarExp","v":0},null,{"$f":"+Cotton!Price","v":0.9},{"$f":"+Cotton!Unit","v":"Pound"},598.88939449027339,598.88939449027339,0]
[{"$f":"+Sesame!A3","v":"Sesame - Conventional Till-12 Row, Dryland, 800 lb. Yield Goal - Lower Coast"},{"$f":"+Sesame!TotRet","v":-40.369140506791041},{"$f":"+Sesame!TTotRet","v":-40.369140506791041},{"$f":"+Sesame!LTotRet","v":0},null,{"$f":"+Sesame!TotExp","v":296.36914050679104},{"$f":"+Sesame!TTotExp","v":296.36914050679104},{"$f":"+Sesame!LTotExp","v":0},null,{"$f":"+Sesame!Price","v":0.32},{"$f":"+Sesame!Unit","v":"Pound"},926.15356408372202,926.15356408372202,0,null,{"$f":"+Sesame!VarRet","v":91.094751026293011},{"$f":"+Sesame!TVarRet","v":91.094751026293011},{"$f":"+Sesame!LVarRet","v":0},null,{"$f":"+Sesame!VarExp","v":164.90524897370699},{"$f":"+Sesame!TVarExp","v":164.90524897370699},{"$f":"+Sesame!LVarExp","v":0},null,{"$f":"+Sesame!Price","v":0.32},{"$f":"+Sesame!Unit","v":"Pound"},515.32890304283433,515.32890304283433,0]
[{"$f":"+SorghumLCB!A3","v":"Sorghum - Conventional Till-24 Row, Dryland, 72 bu. Yield Goal - Lower Coast"},{"$f":"+SorghumLCB!TotRet","v":-22.390270626879328},{"$f":"+SorghumLCB!TTotRet","v":-22.390270626879328},{"$f":"+SorghumLCB!LTotRet","v":0},null,{"$f":"+SorghumLCB!TotExp","v":389.59027062687932},{"$f":"+SorghumLCB!TTotExp","v":389.59027062687932},{"$f":"+SorghumLCB!LTotExp","v":0},null,{"$f":"+SorghumLCB!Price","v":5.0999999999999996},{"$f":"+SorghumLCB!Unit","v":"Bushel"},76.390249142525363,76.390249142525363,0,null,{"$f":"+SorghumLCB!VarRet","v":120.48689233411642},{"$f":"+SorghumLCB!TVarRet","v":120.48689233411642},{"$f":"+SorghumLCB!LVarRet","v":0},null,{"$f":"+SorghumLCB!VarExp","v":246.71310766588357},{"$f":"+SorghumLCB!TVarExp","v":246.71310766588357},{"$f":"+SorghumLCB!LVarExp","v":0},null,{"$f":"+SorghumLCB!Price","v":5.0999999999999996},{"$f":"+SorghumLCB!Unit","v":"Bushel"},48.375119150173255,48.375119150173255,0]
[{"$f":"+WheatLCB!A3","v":"Hard Red Spring Wheat, Dryland, 35 bu. Yield Goal - Lower Coast"},{"$f":"+WheatLCB!TotRet","v":-11.883590616222193},{"$f":"+WheatLCB!TTotRet","v":-11.883590616222193},{"$f":"+WheatLCB!LTotRet","v":0},null,{"$f":"+WheatLCB!TotExp","v":300.63359061622219},{"$f":"+WheatLCB!TTotExp","v":300.63359061622219},{"$f":"+WheatLCB!LTotExp","v":0},null,{"$f":"+WheatLCB!Price","v":8.25},{"$f":"+WheatLCB!Unit","v":"Bushel"},36.440435226208749,36.440435226208749,0,null,{"$f":"+WheatLCB!VarRet","v":106.83050266866999},{"$f":"+WheatLCB!TVarRet","v":106.83050266866999},{"$f":"+WheatLCB!LVarRet","v":0},null,{"$f":"+WheatLCB!VarExp","v":181.91949733133001},{"$f":"+WheatLCB!TVarExp","v":181.91949733133001},{"$f":"+WheatLCB!LVarExp","v":0},null,{"$f":"+WheatLCB!Price","v":8.25},{"$f":"+WheatLCB!Unit","v":"Bushel"},22.050848161373334,22.050848161373334,0]
[{"$f":"+WheatNW!A3","v":"Hard Red Spring Wheat, Dryland, 35 bu. Yield Goal, Northwest - Lower Coast"},{"$f":"+WheatNW!TotRet","v":-16.976625903226363},{"$f":"+WheatNW!TTotRet","v":-16.976625903226363},{"$f":"+WheatNW!LTotRet","v":0},null,{"$f":"+WheatNW!TotExp","v":305.72662590322636},{"$f":"+WheatNW!TTotExp","v":305.72662590322636},{"$f":"+WheatNW!LTotExp","v":0},null,{"$f":"+WheatNW!Price","v":8.25},{"$f":"+WheatNW!Unit","v":"Bushel"},37.057772836754708,37.057772836754708,0,null,{"$f":"+WheatNW!VarRet","v":101.73746738166585},{"$f":"+WheatNW!TVarRet","v":101.73746738166585},{"$f":"+WheatNW!LVarRet","v":0},null,{"$f":"+WheatNW!VarExp","v":187.01253261833415},{"$f":"+WheatNW!TVarExp","v":187.01253261833415},{"$f":"+WheatNW!LVarExp","v":0},null,{"$f":"+WheatNW!Price","v":8.25},{"$f":"+WheatNW!Unit","v":"Bushel"},22.668185771919291,22.668185771919291,0]
[]
["FIELD CROPS - DRYLAND, UPPER COAST"]
[]
[{"$f":"+Corn!A3","v":"Corn - GMO Seed, Conventional Till-12 Row, Dryland, 100 bu. Yield Goal - Upper Coast"},{"$f":"+Corn!TotRet","v":34.796715253483512},{"$f":"+Corn!TTotRet","v":34.796715253483512},{"$f":"+Corn!LTotRet","v":0},null,{"$f":"+Corn!TotExp","v":565.20328474651649},{"$f":"+Corn!TTotExp","v":565.20328474651649},{"$f":"+Corn!LTotExp","v":0},null,{"$f":"+Corn!Price","v":6},{"$f":"+Corn!Unit","v":"Bushel"},{"$f":"+IF($J30=0,0,F30/$J30)","v":94.200547457752748},94.200547457752748,0,null,{"$f":"+Corn!VarRet","v":187.18969751495791},{"$f":"+Corn!TVarRet","v":187.18969751495791},{"$f":"+Corn!LVarRet","v":0},null,{"$f":"+Corn!VarExp","v":412.81030248504209},{"$f":"+Corn!TVarExp","v":412.81030248504209},{"$f":"+Corn!LVarExp","v":0},null,{"$f":"+Corn!Price","v":6},{"$f":"+Corn!Unit","v":"Bushel"},{"$f":"+IF($J30=0,0,T30/$J30)","v":68.801717080840348},68.801717080840348,0]
[{"$f":"+CottonUCB!A3","v":"Cotton - GMO Seed, Conv. Till-12 Row, Dryland, 900 lb. Yield Goal - Upper Coast"},{"$f":"+CottonUCB!TotRet","v":306.20423634115491},{"$f":"+CottonUCB!TTotRet","v":306.20423634115491},{"$f":"+CottonUCB!LTotRet","v":0},null,{"$f":"+CottonUCB!TotExp","v":727.35576365884504},{"$f":"+CottonUCB!TTotExp","v":727.35576365884504},{"$f":"+CottonUCB!LTotExp","v":0},null,{"$f":"+CottonUCB!Price","v":0.9},{"$f":"+CottonUCB!Unit","v":"Pound"},808.17307073205006,808.17307073205006,0,null,{"$f":"+CottonUCB!VarRet","v":477.5024834384493},{"$f":"+CottonUCB!TVarRet","v":477.5024834384493},{"$f":"+CottonUCB!LVarRet","v":0},null,{"$f":"+CottonUCB!VarExp","v":556.05751656155064},{"$f":"+CottonUCB!TVarExp","v":556.05751656155064},{"$f":"+CottonUCB!LVarExp","v":0},null,{"$f":"+CottonUCB!Price","v":0.9},{"$f":"+CottonUCB!Unit","v":"Pound"},617.84168506838955,617.84168506838955,0]
[{"$f":"+SorghumUCB!A3","v":"Sorghum - Conventional Till-12 Row, Dryland, 90 bu. Yield Goal - Upper Coast"},{"$f":"+SorghumUCB!TotRet","v":45.026233383896795},{"$f":"+SorghumUCB!TTotRet","v":45.026233383896795},{"$f":"+SorghumUCB!LTotRet","v":0},null,{"$f":"+SorghumUCB!TotExp","v":413.97376661610315},{"$f":"+SorghumUCB!TTotExp","v":413.97376661610315},{"$f":"+SorghumUCB!LTotExp","v":0},null,{"$f":"+SorghumUCB!Price","v":5.0999999999999996},{"$f":"+SorghumUCB!Unit","v":"Bushel"},81.171326787471216,81.171326787471216,0,null,{"$f":"+SorghumUCB!VarRet","v":193.04665300062453},{"$f":"+SorghumUCB!TVarRet","v":193.04665300062453},{"$f":"+SorghumUCB!LVarRet","v":0},null,{"$f":"+SorghumUCB!VarExp","v":265.95334699937541},{"$f":"+SorghumUCB!TVarExp","v":265.95334699937541},{"$f":"+SorghumUCB!LVarExp","v":0},null,{"$f":"+SorghumUCB!Price","v":5.0999999999999996},{"$f":"+SorghumUCB!Unit","v":"Bushel"},52.147715097916752,52.147715097916752,0]
[{"$f":"+Soybeans!A3","v":"Soybeans - GMO Seed, Conventional Till-12 Row, Dryland, 30 bu. Yield Goal - Upper Coast"},{"$f":"+Soybeans!TotRet","v":10.390552235682208},{"$f":"+Soybeans!TTotRet","v":10.390552235682208},{"$f":"+Soybeans!LTotRet","v":0},null,{"$f":"+Soybeans!TotExp","v":373.60944776431779},{"$f":"+Soybeans!TTotExp","v":373.60944776431779},{"$f":"+Soybeans!LTotExp","v":0},null,{"$f":"+Soybeans!Price","v":12.8},{"$f":"+Soybeans!Unit","v":"Bushel"},29.188238106587328,29.188238106587328,0,null,{"$f":"+Soybeans!VarRet","v":151.32442622361449},{"$f":"+Soybeans!TVarRet","v":151.32442622361449},{"$f":"+Soybeans!LVarRet","v":0},null,{"$f":"+Soybeans!VarExp","v":232.67557377638551},{"$f":"+Soybeans!TVarExp","v":232.67557377638551},{"$f":"+Soybeans!LVarExp","v":0},null,{"$f":"+Soybeans!Price","v":12.8},{"$f":"+Soybeans!Unit","v":"Bushel"},18.177779201280117,18.177779201280117,0]
[{"$f":"+WheatUCB!A3","v":"Soft Red Winter Wheat, 45 bu. Yield Goal - Upper Coast"},{"$f":"+WheatUCB!TotRet","v":-16.409303884661313},{"$f":"+WheatUCB!TTotRet","v":-16.409303884661313},{"$f":"+WheatUCB!LTotRet","v":0},null,{"$f":"+WheatUCB!TotExp","v":358.40930388466131},{"$f":"+WheatUCB!TTotExp","v":358.40930388466131},{"$f":"+WheatUCB!LTotExp","v":0},null,{"$f":"+WheatUCB!Price","v":7.6},{"$f":"+WheatUCB!Unit","v":"Bushel"},47.159118932192278,47.159118932192278,0,null,{"$f":"+WheatUCB!VarRet","v":122.28682769907613},{"$f":"+WheatUCB!TVarRet","v":122.28682769907613},{"$f":"+WheatUCB!LVarRet","v":0},null,{"$f":"+WheatUCB!VarExp","v":219.71317230092387},{"$f":"+WheatUCB!TVarExp","v":219.71317230092387},{"$f":"+WheatUCB!LVarExp","v":0},null,{"$f":"+WheatUCB!Price","v":7.6},{"$f":"+WheatUCB!Unit","v":"Bushel"},28.909627934332089,28.909627934332089,0]
[]
["FIELD CROPS - RICE"]
[]
[{"$f":"+RiceFirstCrop!A3","v":"Rice West of Houston, 1st Crop, Surface Water"},{"$f":"+RiceFirstCrop!TotRet","v":-58.059349812589062},{"$f":"+RiceFirstCrop!TTotRet","v":-58.059349812589062},{"$f":"+RiceFirstCrop!LTotRet","v":0},null,{"$f":"+RiceFirstCrop!TotExp","v":1178.0593498125891},{"$f":"+RiceFirstCrop!TTotExp","v":1178.0593498125891},{"$f":"+RiceFirstCrop!LTotExp","v":0},null,{"$f":"+RiceFirstCrop!Price","v":7.26},{"$f":"+RiceFirstCrop!Unit","v":"CWT"},{"$f":"+IF($J38=0,0,F38/$J38)","v":162.26712807335937},162.26712807335937,0,null,{"$f":"+RiceFirstCrop!VarRet","v":200.68027762482279},{"$f":"+RiceFirstCrop!TVarRet","v":200.68027762482279},{"$f":"+RiceFirstCrop!LVarRet","v":0},null,{"$f":"+RiceFirstCrop!VarExp","v":919.31972237517721},{"$f":"+RiceFirstCrop!TVarExp","v":919.31972237517721},{"$f":"+RiceFirstCrop!LVarExp","v":0},null,{"$f":"+RiceFirstCrop!Price","v":7.26},{"$f":"+RiceFirstCrop!Unit","v":"CWT"},{"$f":"+IF($J38=0,0,T38/$J38)","v":126.62806093322},126.62806093322,0]
[{"$f":"+RiceSecondCrop!A3","v":"Rice West of Houston, 2nd Crop, Surface Water"},{"$f":"+RiceSecondCrop!TotRet","v":5.2940114659672304},{"$f":"+RiceSecondCrop!TTotRet","v":5.2940114659672304},{"$f":"+RiceSecondCrop!LTotRet","v":0},null,{"$f":"+RiceSecondCrop!TotExp","v":194.70598853403277},{"$f":"+RiceSecondCrop!TTotExp","v":194.70598853403277},{"$f":"+RiceSecondCrop!LTotExp","v":0},null,{"$f":"+RiceSecondCrop!Price","v":7},{"$f":"+RiceSecondCrop!Unit","v":"CWT"},27.815141219147538,27.815141219147538,0,null,{"$f":"+RiceSecondCrop!VarRet","v":29.486809341635819},{"$f":"+RiceSecondCrop!TVarRet","v":29.486809341635819},{"$f":"+RiceSecondCrop!LVarRet","v":0},null,{"$f":"+RiceSecondCrop!VarExp","v":170.51319065836418},{"$f":"+RiceSecondCrop!TVarExp","v":170.51319065836418},{"$f":"+RiceSecondCrop!LVarExp","v":0},null,{"$f":"+RiceSecondCrop!Price","v":7},{"$f":"+RiceSecondCrop!Unit","v":"CWT"},24.359027236909167,24.359027236909167,0]
[]
["LIVESTOCK"]
[]
[{"$f":"+CowCalf!A3","v":"Cow-Calf Improved Pasture"},{"$f":"+CowCalf!TotRet","v":162.92729056653354},null,null,null,{"$f":"+CowCalf!TotExp","v":691.50570943346645},null,null,null,{"$f":"+CowCalf!Price","v":183.12903225806454},{"$f":"+CowCalf!Unit","v":"CWT"},{"$f":"+IF($J43=0,0,F43/$J43)","v":3.7760572472146303},null,null,null,{"$f":"+CowCalf!VarRet","v":569.33524866177163},null,null,null,{"$f":"+CowCalf!VarExp","v":285.09775133822836},null,null,null,{"$f":"+CowCalf!Price","v":183.12903225806454},{"$f":"+CowCalf!Unit","v":"CWT"},{"$f":"+IF($J43=0,0,T43/$J43)","v":1.5568135091571389}]
[{"$f":"+StockersSummer!A3","v":"Summer Stocker Calf Budget (160 Days Grazing)"},{"$f":"+StockersSummer!TotRet","v":114.64986060273964},null,null,null,{"$f":"+StockersSummer!TotExp","v":1260.5501393972602},null,null,null,{"$f":"+StockersSummer!Price","v":191},{"$f":"+StockersSummer!Unit","v":"CWT"},{"$f":"+IF($J44=0,0,F44/$J44)","v":6.599738949723875},null,null,null,{"$f":"+StockersSummer!VarRet","v":114.64986060273964},null,null,null,{"$f":"+StockersSummer!VarExp","v":1260.5501393972602},null,null,null,{"$f":"+StockersSummer!Price","v":191},{"$f":"+StockersSummer!Unit","v":"CWT"},{"$f":"+IF($J44=0,0,T44/$J44)","v":6.599738949723875}]
[{"$f":"+StockerWinter!A3","v":"Winter Stocker Calf Budget (110 Says Grazing)"},{"$f":"+StockerWinter!TotRet","v":-96.706939627397333},null,null,null,{"$f":"+StockerWinter!TotExp","v":1168.3549396273972},null,null,null,{"$f":"+StockerWinter!Price","v":183},{"$f":"+StockerWinter!Unit","v":"CWT"},{"$f":"+IF($J45=0,0,F45/$J45)","v":6.3844532220076351},null,null,null,{"$f":"+StockerWinter!VarRet","v":-96.706939627397333},null,null,null,{"$f":"+StockerWinter!VarExp","v":1168.3549396273972},null,null,null,{"$f":"+StockerWinter!Price","v":183},{"$f":"+StockerWinter!Unit","v":"CWT"},{"$f":"+IF($J45=0,0,T45/$J45)","v":6.3844532220076351}]

{"sheet":"Your Returns - Cash Rent","index":30,"n_rows":50,"n_cols":12,"rows_kept":50,"cut":false,"hidden":false,"merged":[[2,2,2,3],[2,5,2,6],[2,8,2,11]]}
["Your Returns - Cash Rent"]
[]
[null,"Quantity ","Returns Above Total Specified Expenses",null,null,"Total Direct Expenses",null,null,"Breakeven Yield to Cover Total Costs at Price Entered"]
[null,"Acres, AUs,  or Head","Total Costs","Variable Costs",null,"Total Costs","Variable Costs",null,"Price","Units","Total Costs","Variable Costs"]
["FORAGE CROPS"]
[]
[{"$f":"+CoastalHay!A3","v":"Coastal Bermudagrass Hay and Grazing (3 Cuttings)"},{"$f":"+CoastalHay!E7","v":0},{"$f":"+CoastalHay!YTotRet","v":0},{"$f":"+CoastalHay!YVarRet","v":0},null,{"$f":"+CoastalHay!YTotExp","v":0},{"$f":"+CoastalHay!YVarExp","v":0},null,{"$f":"+CoastalHay!YPrice","v":0},{"$f":"+CoastalHay!Unit","v":"Roll"},{"$f":"+IF($I7=0,0,F7/$I7)","v":0},0]
[{"$f":"+CoastalPasture!A3","v":"Coastal Bermudagrass Pasture"},{"$f":"+CoastalPasture!E7","v":0},{"$f":"+CoastalPasture!YTotRet","v":0},{"$f":"+CoastalPasture!YVarRet","v":0},null,{"$f":"+CoastalPasture!YTotExp","v":0},{"$f":"+CoastalPasture!YVarExp","v":0},null,{"$f":"+CoastalPasture!YPrice","v":0},{"$f":"+CoastalPasture!Unit","v":""},0,0]
[{"$f":"+SorghumHay!A3","v":"Sorghum Hay (2 Cuttings)"},{"$f":"+SorghumHay!E7","v":0},{"$f":"+SorghumHay!YTotRet","v":0},{"$f":"+SorghumHay!YVarRet","v":0},null,{"$f":"+SorghumHay!YTotExp","v":0},{"$f":"+SorghumHay!YVarExp","v":0},null,{"$f":"+SorghumHay!YPrice","v":0},{"$f":"+SorghumHay!Unit","v":"Roll"},0,0]
[]
["FIELD CROPS - IRRIGATED"]
[]
[{"$f":"+IrrigatedCotton!A3","v":"Cotton - Genetically Modified Seed, Conv. Till-24 Row, Irrigated, 1250 lb. Yield Goal"},{"$f":"+IrrigatedCotton!E7","v":0},{"$f":"+IrrigatedCotton!YTotRet","v":0},{"$f":"+IrrigatedCotton!YVarRet","v":0},null,{"$f":"+IrrigatedCotton!YTotExp","v":0},{"$f":"+IrrigatedCotton!YVarExp","v":0},null,{"$f":"+IrrigatedCotton!YPrice","v":0},{"$f":"+IrrigatedCotton!Unit","v":"Pound"},{"$f":"+IF($I13=0,0,F13/$I13)","v":0},{"$f":"+IF($I13=0,0,G13/$I13)","v":0}]
[{"$f":"+IrrigatedSesame!A3","v":"Sesame - Conventional Till-12 Row, Irrigated, 1100 lb. Yield Goal"},{"$f":"+IrrigatedSesame!E7","v":0},{"$f":"+IrrigatedSesame!YTotRet","v":0},{"$f":"+IrrigatedSesame!YVarRet","v":0},null,{"$f":"+IrrigatedSesame!YTotExp","v":0},{"$f":"+IrrigatedSesame!YVarExp","v":0},null,{"$f":"+IrrigatedSesame!YPrice","v":0},{"$f":"+IrrigatedSesame!Unit","v":"Pound"},{"$f":"+IF($I14=0,0,F14/$I14)","v":0},0]
[{"$f":"+IrrigatedSorghumLCB!A3","v":"Sorghum - Conventional Till-24 Row, Irrigated, 100 bu. Yield Goal"},{"$f":"+IrrigatedSorghumLCB!E7","v":0},{"$f":"+IrrigatedSorghumLCB!YTotRet","v":0},{"$f":"+IrrigatedSorghumLCB!YVarRet","v":0},null,{"$f":"+IrrigatedSorghumLCB!YTotExp","v":0},{"$f":"+IrrigatedSorghumLCB!YVarExp","v":0},null,{"$f":"+IrrigatedSorghumLCB!YPrice","v":0},{"$f":"+IrrigatedSorghumLCB!Unit","v":"Bushel"},0,0]
[{"$f":"+IrrigatedWheatLCB!A3","v":"Hard Red Spring Wheat, Irrigated, 60 bu. Yield Goal"},{"$f":"+IrrigatedWheatLCB!E7","v":0},{"$f":"+IrrigatedWheatLCB!YTotRet","v":0},{"$f":"+IrrigatedWheatLCB!YVarRet","v":0},null,{"$f":"+IrrigatedWheatLCB!YTotExp","v":0},{"$f":"+IrrigatedWheatLCB!YVarExp","v":0},null,{"$f":"+IrrigatedWheatLCB!YPrice","v":0},{"$f":"+IrrigatedWheatLCB!Unit","v":"Bushel"},0,0]
[]
["FIELD CROPS - DRYLAND, LOWER COAST"]
[]
[{"$f":"+CanolaLCB!A3","v":"Canola, Dryland, 1500 lb. Yield Goal - Lower Coast"},{"$f":"+CanolaLCB!E7","v":0},{"$f":"+CanolaLCB!YTotRet","v":0},{"$f":"+CanolaLCB!YVarRet","v":0},null,{"$f":"+CanolaLCB!YTotExp","v":0},{"$f":"+CanolaLCB!YVarExp","v":0},null,{"$f":"+CanolaLCB!YPrice","v":0},{"$f":"+CanolaLCB!Unit","v":"Pound"},{"$f":"+IF($I20=0,0,F20/$I20)","v":0},0]
[{"$f":"+CottonLCB!A3","v":"Cotton - Conventional Seed, Till-24 Row, Dryland, 800 lb. Yield Goal - Lower Coast"},{"$f":"+CottonLCB!E7","v":0},{"$f":"+CottonLCB!YTotRet","v":0},{"$f":"+CottonLCB!YVarRet","v":0},null,{"$f":"+CottonLCB!YTotExp","v":0},{"$f":"+CottonLCB!YVarExp","v":0},null,{"$f":"+CottonLCB!YPrice","v":0},{"$f":"+CottonLCB!Unit","v":"Pound"},0,0]
[{"$f":"+Cotton!A3","v":"Cotton - Genetically Modified Seed, Conv. Till-24 Row, Dryland, 800 lb. Yield Goal - Lower Coast"},{"$f":"+Cotton!E7","v":0},{"$f":"+Cotton!YTotRet","v":0},{"$f":"+Cotton!YVarRet","v":0},null,{"$f":"+Cotton!YTotExp","v":0},{"$f":"+Cotton!YVarExp","v":0},null,{"$f":"+Cotton!YPrice","v":0},{"$f":"+Cotton!Unit","v":"Pound"},0,0]
[{"$f":"+Sesame!A3","v":"Sesame - Conventional Till-12 Row, Dryland, 800 lb. Yield Goal - Lower Coast"},{"$f":"+Sesame!E7","v":0},{"$f":"+Sesame!YTotRet","v":0},{"$f":"+Sesame!YVarRet","v":0},null,{"$f":"+Sesame!YTotExp","v":0},{"$f":"+Sesame!YVarExp","v":0},null,{"$f":"+Sesame!YPrice","v":0},{"$f":"+Sesame!Unit","v":"Pound"},0,0]
[{"$f":"+SorghumLCB!A3","v":"Sorghum - Conventional Till-24 Row, Dryland, 72 bu. Yield Goal - Lower Coast"},{"$f":"+SorghumLCB!E7","v":0},{"$f":"+SorghumLCB!YTotRet","v":0},{"$f":"+SorghumLCB!YVarRet","v":0},null,{"$f":"+SorghumLCB!YTotExp","v":0},{"$f":"+SorghumLCB!YVarExp","v":0},null,{"$f":"+SorghumLCB!YPrice","v":0},{"$f":"+SorghumLCB!Unit","v":"Bushel"},0,0]
[{"$f":"+WheatLCB!A3","v":"Hard Red Spring Wheat, Dryland, 35 bu. Yield Goal - Lower Coast"},{"$f":"+WheatLCB!E7","v":0},{"$f":"+WheatLCB!YTotRet","v":0},{"$f":"+WheatLCB!YVarRet","v":0},null,{"$f":"+WheatLCB!YTotExp","v":0},{"$f":"+WheatLCB!YVarExp","v":0},null,{"$f":"+WheatLCB!YPrice","v":0},{"$f":"+WheatLCB!Unit","v":"Bushel"},0,0]
[{"$f":"+WheatNW!A3","v":"Hard Red Spring Wheat, Dryland, 35 bu. Yield Goal, Northwest - Lower Coast"},{"$f":"+WheatNW!E7","v":0},{"$f":"+WheatNW!YTotRet","v":0},{"$f":"+WheatNW!YVarRet","v":0},null,{"$f":"+WheatNW!YTotExp","v":0},{"$f":"+WheatNW!YVarExp","v":0},null,{"$f":"+WheatNW!YPrice","v":0},{"$f":"+WheatNW!Unit","v":"Bushel"},0,0]
[]
["FIELD CROPS - DRYLAND, UPPER COAST"]
[]
[{"$f":"+Corn!A3","v":"Corn - GMO Seed, Conventional Till-12 Row, Dryland, 100 bu. Yield Goal - Upper Coast"},{"$f":"+Corn!E7","v":0},{"$f":"+Corn!YTotRet","v":0},{"$f":"+Corn!YVarRet","v":0},null,{"$f":"+Corn!YTotExp","v":0},{"$f":"+Corn!YVarExp","v":0},null,{"$f":"+Corn!YPrice","v":0},{"$f":"+Corn!Unit","v":"Bushel"},{"$f":"+IF($I30=0,0,F30/$I30)","v":0},0]
[{"$f":"+CottonUCB!A3","v":"Cotton - GMO Seed, Conv. Till-12 Row, Dryland, 900 lb. Yield Goal - Upper Coast"},{"$f":"+CottonUCB!E7","v":0},{"$f":"+CottonUCB!YTotRet","v":0},{"$f":"+CottonUCB!YVarRet","v":0},null,{"$f":"+CottonUCB!YTotExp","v":0},{"$f":"+CottonUCB!YVarExp","v":0},null,{"$f":"+CottonUCB!YPrice","v":0},{"$f":"+CottonUCB!Unit","v":"Pound"},0,0]
[{"$f":"+SorghumUCB!A3","v":"Sorghum - Conventional Till-12 Row, Dryland, 90 bu. Yield Goal - Upper Coast"},{"$f":"+SorghumUCB!E7","v":0},{"$f":"+SorghumUCB!YTotRet","v":0},{"$f":"+SorghumUCB!YVarRet","v":0},null,{"$f":"+SorghumUCB!YTotExp","v":0},{"$f":"+SorghumUCB!YVarExp","v":0},null,{"$f":"+SorghumUCB!YPrice","v":0},{"$f":"+SorghumUCB!Unit","v":"Bushel"},0,0]
[{"$f":"+Soybeans!A3","v":"Soybeans - GMO Seed, Conventional Till-12 Row, Dryland, 30 bu. Yield Goal - Upper Coast"},{"$f":"+Soybeans!E7","v":0},{"$f":"+Soybeans!YTotRet","v":0},{"$f":"+Soybeans!YVarRet","v":0},null,{"$f":"+Soybeans!YTotExp","v":0},{"$f":"+Soybeans!YVarExp","v":0},null,{"$f":"+Soybeans!YPrice","v":0},{"$f":"+Soybeans!Unit","v":"Bushel"},0,0]
[{"$f":"+WheatUCB!A3","v":"Soft Red Winter Wheat, 45 bu. Yield Goal - Upper Coast"},{"$f":"+WheatUCB!E7","v":0},{"$f":"+WheatUCB!YTotRet","v":0},{"$f":"+WheatUCB!YVarRet","v":0},null,{"$f":"+WheatUCB!YTotExp","v":0},{"$f":"+WheatUCB!YVarExp","v":0},null,{"$f":"+WheatUCB!YPrice","v":0},{"$f":"+WheatUCB!Unit","v":"Bushel"},0,0]
[]
["FIELD CROPS - RICE"]
[]
[{"$f":"+RiceFirstCrop!A3","v":"Rice West of Houston, 1st Crop, Surface Water"},{"$f":"+RiceFirstCrop!E7","v":0},{"$f":"+RiceFirstCrop!YTotRet","v":0},{"$f":"+RiceFirstCrop!YVarRet","v":0},null,{"$f":"+RiceFirstCrop!YTotExp","v":0},{"$f":"+RiceFirstCrop!YVarExp","v":0},null,{"$f":"+RiceFirstCrop!YPrice","v":0},{"$f":"+RiceFirstCrop!Unit","v":"CWT"},{"$f":"+IF($I38=0,0,F38/$I38)","v":0},{"$f":"+IF($I38=0,0,G38/$I38)","v":0}]
[{"$f":"+RiceSecondCrop!A3","v":"Rice West of Houston, 2nd Crop, Surface Water"},{"$f":"+RiceSecondCrop!E7","v":0},{"$f":"+RiceSecondCrop!YTotRet","v":0},{"$f":"+RiceSecondCrop!YVarRet","v":0},null,{"$f":"+RiceSecondCrop!YTotExp","v":0},{"$f":"+RiceSecondCrop!YVarExp","v":0},null,{"$f":"+RiceSecondCrop!YPrice","v":0},{"$f":"+RiceSecondCrop!Unit","v":"CWT"},{"$f":"+IF($I39=0,0,F39/$I39)","v":0},{"$f":"+IF($I39=0,0,G39/$I39)","v":0}]
[]
["LIVESTOCK"]
[]
[{"$f":"+CowCalf!A3","v":"Cow-Calf Improved Pasture"},{"$f":"+CowCalf!E7","v":0},{"$f":"+CowCalf!YTotRet","v":0},{"$f":"+CowCalf!YVarRet","v":0},null,{"$f":"+CowCalf!YTotExp","v":0},{"$f":"+CowCalf!YVarExp","v":0},null,{"$f":"+CowCalf!YPrice","v":{"$error":"#NAME?"}},{"$f":"+CowCalf!Unit","v":"CWT"},{"$f":"+IF($I43=0,0,F43/$I43)","v":{"$error":"#NAME?"}},{"$error":"#NAME?"}]
[{"$f":"+StockersSummer!A3","v":"Summer Stocker Calf Budget (160 Days Grazing)"},{"$f":"+StockersSummer!E7","v":0},{"$f":"+StockersSummer!YTotRet","v":0},{"$f":"+StockersSummer!YVarRet","v":0},null,{"$f":"+StockersSummer!YTotExp","v":0},{"$f":"+StockersSummer!YVarExp","v":0},null,{"$f":"+StockersSummer!YPrice","v":0},{"$f":"+StockersSummer!Unit","v":"CWT"},0,0]
[{"$f":"+StockerWinter!A3","v":"Winter Stocker Calf Budget (110 Says Grazing)"},{"$f":"+StockerWinter!E7","v":0},{"$f":"+StockerWinter!YTotRet","v":0},{"$f":"+StockerWinter!YVarRet","v":0},null,{"$f":"+StockerWinter!YTotExp","v":0},{"$f":"+StockerWinter!YVarExp","v":0},null,{"$f":"+StockerWinter!YPrice","v":0},{"$f":"+StockerWinter!Unit","v":"CWT"},{"$f":"+IF($I45=0,0,F45/$I45)","v":0},{"$f":"+IF($I45=0,0,G45/$I45)","v":0}]
[]
["OTHER BUDGETS"]
[]
[{"$f":"+'Livestock Budget'!A3","v":"Livestock Budget"},{"$f":"+'Livestock Budget'!D5","v":0},{"$f":"+'Livestock Budget'!YTotRet","v":0},{"$f":"+'Livestock Budget'!YVarRet","v":0},null,{"$f":"+'Livestock Budget'!YTotExp","v":0},{"$f":"+'Livestock Budget'!YVarExp","v":0},null,{"$f":"+'Livestock Budget'!YPrice","v":0},{"$f":"+'Livestock Budget'!Unit","v":"CWT"},{"$f":"+IF($I49=0,0,F49/$I49)","v":0},{"$f":"+IF($I49=0,0,G49/$I49)","v":0}]
[{"$f":"+'Crop Budget'!A3","v":"Crop Enterprise"},{"$f":"+'Crop Budget'!D5","v":0},{"$f":"+'Crop Budget'!YTotRet","v":0},{"$f":"+'Crop Budget'!YVarRet","v":0},null,{"$f":"+'Crop Budget'!YTotExp","v":0},{"$f":"+'Crop Budget'!YVarExp","v":0},null,{"$f":"+'Crop Budget'!YPrice","v":0},{"$f":"+'Crop Budget'!Unit","v":"Cwt,lb,etc"},{"$f":"+IF($I50=0,0,F50/$I50)","v":0},{"$f":"+IF($I50=0,0,G50/$I50)","v":0}]

{"sheet":"Your Returns-Share Rent","index":31,"n_rows":62,"n_cols":29,"rows_kept":62,"cut":false,"hidden":false,"merged":[[2,24,2,28],[2,2,2,4],[2,6,2,8],[2,10,2,14],[2,16,2,18],[2,20,2,22]]}
["Your Returns - Share Rent"]
[]
["Variable Costs to the right of Total Costs","Quantity ","Returns Above Total Specified Expenses",null,null,null,"Total Direct Expenses",null,null,null,"Breakeven Yield to Cover Total Costs at Price Entered",null,null,null,null,null,"Returns Above Variable Specified Expenses",null,null,null,"Variable Direct Expenses",null,null,null,"Breakeven Yield to Cover Variavle Costs at Price Entered"]
[null,"Acres, AUs,  or Head","Total","Tenant","Landlord",null,"Total","Tenant","Landlord",null,"Price","Units","Total","Tenant","Landlord",null,"Total","Tenant","Landlord",null,"Total","Tenant","Landlord",null,"Price","Units","Total","Tenant","Landlord"]
["FORAGE CROPS"]
[]
[{"$f":"+CoastalHay!A3","v":"Coastal Bermudagrass Hay and Grazing (3 Cuttings)"},{"$f":"+CoastalHay!E7","v":0},{"$f":"+CoastalHay!YTotRet","v":0},{"$f":"+CoastalHay!YTTotRet","v":0},{"$f":"+CoastalHay!YLTotRet","v":0},null,{"$f":"+CoastalHay!YTotExp","v":0},{"$f":"+CoastalHay!YTTotExp","v":0},{"$f":"+CoastalHay!YLTotExp","v":0},null,{"$f":"+CoastalHay!YPrice","v":0},{"$f":"+CoastalHay!Unit","v":"Roll"},{"$f":"+IF($K7=0,0,G7/$K7)","v":0},0,0,null,{"$f":"+CoastalHay!YVarRet","v":0},{"$f":"+CoastalHay!YTVarRet","v":0},{"$f":"+CoastalHay!YLVarRet","v":0},null,{"$f":"+CoastalHay!YVarExp","v":0},{"$f":"+CoastalHay!YTVarExp","v":0},{"$f":"+CoastalHay!YLVarExp","v":0},null,{"$f":"+CoastalHay!YPrice","v":0},{"$f":"+CoastalHay!Unit","v":"Roll"},{"$f":"+IF($K7=0,0,U7/$K7)","v":0},0,0]
[{"$f":"+CoastalPasture!A3","v":"Coastal Bermudagrass Pasture"},{"$f":"+CoastalPasture!E7","v":0},{"$f":"+CoastalPasture!YTotRet","v":0},{"$f":"+CoastalPasture!YTTotRet","v":0},{"$f":"+CoastalPasture!YLTotRet","v":0},null,{"$f":"+CoastalPasture!YTotExp","v":0},{"$f":"+CoastalPasture!YTTotExp","v":0},{"$f":"+CoastalPasture!YLTotExp","v":0},null,{"$f":"+CoastalPasture!YPrice","v":0},{"$f":"+CoastalPasture!Unit","v":""},0,0,0,null,{"$f":"+CoastalPasture!YVarRet","v":0},{"$f":"+CoastalPasture!YTVarRet","v":0},{"$f":"+CoastalPasture!YLVarRet","v":0},null,{"$f":"+CoastalPasture!YVarExp","v":0},{"$f":"+CoastalPasture!YTVarExp","v":0},{"$f":"+CoastalPasture!YLVarExp","v":0},null,{"$f":"+CoastalPasture!YPrice","v":0},{"$f":"+CoastalPasture!Unit","v":""},0,0,0]
[{"$f":"+SorghumHay!A3","v":"Sorghum Hay (2 Cuttings)"},{"$f":"+SorghumHay!E7","v":0},{"$f":"+SorghumHay!YTotRet","v":0},{"$f":"+SorghumHay!YTTotRet","v":0},{"$f":"+SorghumHay!YLTotRet","v":0},null,{"$f":"+SorghumHay!YTotExp","v":0},{"$f":"+SorghumHay!YTTotExp","v":0},{"$f":"+SorghumHay!YLTotExp","v":0},null,{"$f":"+SorghumHay!YPrice","v":0},{"$f":"+SorghumHay!Unit","v":"Roll"},0,0,0,null,{"$f":"+SorghumHay!YVarRet","v":0},{"$f":"+SorghumHay!YTVarRet","v":0},{"$f":"+SorghumHay!YLVarRet","v":0},null,{"$f":"+SorghumHay!YVarExp","v":0},{"$f":"+SorghumHay!YTVarExp","v":0},{"$f":"+SorghumHay!YLVarExp","v":0},null,{"$f":"+SorghumHay!YPrice","v":0},{"$f":"+SorghumHay!Unit","v":"Roll"},0,0,0]
[]
["FIELD CROPS - IRRIGATED"]
[]
[{"$f":"+IrrigatedCotton!A3","v":"Cotton - Genetically Modified Seed, Conv. Till-24 Row, Irrigated, 1250 lb. Yield Goal"},{"$f":"+IrrigatedCotton!E7","v":0},{"$f":"+IrrigatedCotton!YTotRet","v":0},{"$f":"+IrrigatedCotton!YTTotRet","v":0},{"$f":"+IrrigatedCotton!YLTotRet","v":0},null,{"$f":"+IrrigatedCotton!YTotExp","v":0},{"$f":"+IrrigatedCotton!YTTotExp","v":0},{"$f":"+IrrigatedCotton!YLTotExp","v":0},null,{"$f":"+IrrigatedCotton!YPrice","v":0},{"$f":"+IrrigatedCotton!Unit","v":"Pound"},{"$f":"+IF($K13=0,0,G13/$K13)","v":0},{"$f":"+IF($K13=0,0,H13/$K13)","v":0},{"$f":"+IF($K13=0,0,I13/$K13)","v":0},null,{"$f":"+IrrigatedCotton!YVarRet","v":0},{"$f":"+IrrigatedCotton!YTVarRet","v":0},{"$f":"+IrrigatedCotton!YLVarRet","v":0},null,{"$f":"+IrrigatedCotton!YVarExp","v":0},{"$f":"+IrrigatedCotton!YTVarExp","v":0},{"$f":"+IrrigatedCotton!YLVarExp","v":0},null,{"$f":"+IrrigatedCotton!YPrice","v":0},{"$f":"+IrrigatedCotton!Unit","v":"Pound"},{"$f":"+IF($K13=0,0,U13/$K13)","v":0},{"$f":"+IF($K13=0,0,V13/$K13)","v":0},{"$f":"+IF($K13=0,0,W13/$K13)","v":0}]
[{"$f":"+IrrigatedSesame!A3","v":"Sesame - Conventional Till-12 Row, Irrigated, 1100 lb. Yield Goal"},{"$f":"+IrrigatedSesame!E7","v":0},{"$f":"+IrrigatedSesame!YTotRet","v":0},{"$f":"+IrrigatedSesame!YTTotRet","v":0},{"$f":"+IrrigatedSesame!YLTotRet","v":0},null,{"$f":"+IrrigatedSesame!YTotExp","v":0},{"$f":"+IrrigatedSesame!YTTotExp","v":0},{"$f":"+IrrigatedSesame!YLTotExp","v":0},null,{"$f":"+IrrigatedSesame!YPrice","v":0},{"$f":"+IrrigatedSesame!Unit","v":"Pound"},{"$f":"+IF($K14=0,0,G14/$K14)","v":0},0,0,null,{"$f":"+IrrigatedSesame!YVarRet","v":0},{"$f":"+IrrigatedSesame!YTVarRet","v":0},{"$f":"+IrrigatedSesame!YLVarRet","v":0},null,{"$f":"+IrrigatedSesame!YVarExp","v":0},{"$f":"+IrrigatedSesame!YTVarExp","v":0},{"$f":"+IrrigatedSesame!YLVarExp","v":0},null,{"$f":"+IrrigatedSesame!YPrice","v":0},{"$f":"+IrrigatedSesame!Unit","v":"Pound"},{"$f":"+IF($K14=0,0,U14/$K14)","v":0},0,0]
[{"$f":"+IrrigatedSorghumLCB!A3","v":"Sorghum - Conventional Till-24 Row, Irrigated, 100 bu. Yield Goal"},{"$f":"+IrrigatedSorghumLCB!E7","v":0},{"$f":"+IrrigatedSorghumLCB!YTotRet","v":0},{"$f":"+IrrigatedSorghumLCB!YTTotRet","v":0},{"$f":"+IrrigatedSorghumLCB!YLTotRet","v":0},null,{"$f":"+IrrigatedSorghumLCB!YTotExp","v":0},{"$f":"+IrrigatedSorghumLCB!YTTotExp","v":0},{"$f":"+IrrigatedSorghumLCB!YLTotExp","v":0},null,{"$f":"+IrrigatedSorghumLCB!YPrice","v":0},{"$f":"+IrrigatedSorghumLCB!Unit","v":"Bushel"},0,0,0,null,{"$f":"+IrrigatedSorghumLCB!YVarRet","v":0},{"$f":"+IrrigatedSorghumLCB!YTVarRet","v":0},{"$f":"+IrrigatedSorghumLCB!YLVarRet","v":0},null,{"$f":"+IrrigatedSorghumLCB!YVarExp","v":0},{"$f":"+IrrigatedSorghumLCB!YTVarExp","v":0},{"$f":"+IrrigatedSorghumLCB!YLVarExp","v":0},null,{"$f":"+IrrigatedSorghumLCB!YPrice","v":0},{"$f":"+IrrigatedSorghumLCB!Unit","v":"Bushel"},0,0,0]
[{"$f":"+IrrigatedWheatLCB!A3","v":"Hard Red Spring Wheat, Irrigated, 60 bu. Yield Goal"},{"$f":"+IrrigatedWheatLCB!E7","v":0},{"$f":"+IrrigatedWheatLCB!YTotRet","v":0},{"$f":"+IrrigatedWheatLCB!YTTotRet","v":0},{"$f":"+IrrigatedWheatLCB!YLTotRet","v":0},null,{"$f":"+IrrigatedWheatLCB!YTotExp","v":0},{"$f":"+IrrigatedWheatLCB!YTTotExp","v":0},{"$f":"+IrrigatedWheatLCB!YLTotExp","v":0},null,{"$f":"+IrrigatedWheatLCB!YPrice","v":0},{"$f":"+IrrigatedWheatLCB!Unit","v":"Bushel"},0,0,0,null,{"$f":"+IrrigatedWheatLCB!YVarRet","v":0},{"$f":"+IrrigatedWheatLCB!YTVarRet","v":0},{"$f":"+IrrigatedWheatLCB!YLVarRet","v":0},null,{"$f":"+IrrigatedWheatLCB!YVarExp","v":0},{"$f":"+IrrigatedWheatLCB!YTVarExp","v":0},{"$f":"+IrrigatedWheatLCB!YLVarExp","v":0},null,{"$f":"+IrrigatedWheatLCB!YPrice","v":0},{"$f":"+IrrigatedWheatLCB!Unit","v":"Bushel"},0,0,0]
[]
["FIELD CROPS - DRYLAND, LOWER COAST"]
[]
[{"$f":"+CanolaLCB!A3","v":"Canola, Dryland, 1500 lb. Yield Goal - Lower Coast"},{"$f":"+CanolaLCB!E7","v":0},{"$f":"+CanolaLCB!YTotRet","v":0},{"$f":"+CanolaLCB!YTTotRet","v":0},{"$f":"+CanolaLCB!YLTotRet","v":0},null,{"$f":"+CanolaLCB!YTotExp","v":0},{"$f":"+CanolaLCB!YTTotExp","v":0},{"$f":"+CanolaLCB!YLTotExp","v":0},null,{"$f":"+CanolaLCB!YPrice","v":0},{"$f":"+CanolaLCB!Unit","v":"Pound"},{"$f":"+IF($K20=0,0,G20/$K20)","v":0},0,0,null,{"$f":"+CanolaLCB!YVarRet","v":0},{"$f":"+CanolaLCB!YTVarRet","v":0},{"$f":"+CanolaLCB!YLVarRet","v":0},null,{"$f":"+CanolaLCB!YVarExp","v":0},{"$f":"+CanolaLCB!YTVarExp","v":0},{"$f":"+CanolaLCB!YLVarExp","v":0},null,{"$f":"+CanolaLCB!YPrice","v":0},{"$f":"+CanolaLCB!Unit","v":"Pound"},{"$f":"+IF($K20=0,0,U20/$K20)","v":0},0,0]
[{"$f":"+CottonLCB!A3","v":"Cotton - Conventional Seed, Till-24 Row, Dryland, 800 lb. Yield Goal - Lower Coast"},{"$f":"+CottonLCB!E7","v":0},{"$f":"+CottonLCB!YTotRet","v":0},{"$f":"+CottonLCB!YTTotRet","v":0},{"$f":"+CottonLCB!YLTotRet","v":0},null,{"$f":"+CottonLCB!YTotExp","v":0},{"$f":"+CottonLCB!YTTotExp","v":0},{"$f":"+CottonLCB!YLTotExp","v":0},null,{"$f":"+CottonLCB!YPrice","v":0},{"$f":"+CottonLCB!Unit","v":"Pound"},0,0,0,null,{"$f":"+CottonLCB!YVarRet","v":0},{"$f":"+CottonLCB!YTVarRet","v":0},{"$f":"+CottonLCB!YLVarRet","v":0},null,{"$f":"+CottonLCB!YVarExp","v":0},{"$f":"+CottonLCB!YTVarExp","v":0},{"$f":"+CottonLCB!YLVarExp","v":0},null,{"$f":"+CottonLCB!YPrice","v":0},{"$f":"+CottonLCB!Unit","v":"Pound"},0,0,0]
[{"$f":"+Cotton!A3","v":"Cotton - Genetically Modified Seed, Conv. Till-24 Row, Dryland, 800 lb. Yield Goal - Lower Coast"},{"$f":"+Cotton!E7","v":0},{"$f":"+Cotton!YTotRet","v":0},{"$f":"+Cotton!YTTotRet","v":0},{"$f":"+Cotton!YLTotRet","v":0},null,{"$f":"+Cotton!YTotExp","v":0},{"$f":"+Cotton!YTTotExp","v":0},{"$f":"+Cotton!YLTotExp","v":0},null,{"$f":"+Cotton!YPrice","v":0},{"$f":"+Cotton!Unit","v":"Pound"},0,0,0,null,{"$f":"+Cotton!YVarRet","v":0},{"$f":"+Cotton!YTVarRet","v":0},{"$f":"+Cotton!YLVarRet","v":0},null,{"$f":"+Cotton!YVarExp","v":0},{"$f":"+Cotton!YTVarExp","v":0},{"$f":"+Cotton!YLVarExp","v":0},null,{"$f":"+Cotton!YPrice","v":0},{"$f":"+Cotton!Unit","v":"Pound"},0,0,0]
[{"$f":"+Sesame!A3","v":"Sesame - Conventional Till-12 Row, Dryland, 800 lb. Yield Goal - Lower Coast"},{"$f":"+Sesame!E7","v":0},{"$f":"+Sesame!YTotRet","v":0},{"$f":"+Sesame!YTTotRet","v":0},{"$f":"+Sesame!YLTotRet","v":0},null,{"$f":"+Sesame!YTotExp","v":0},{"$f":"+Sesame!YTTotExp","v":0},{"$f":"+Sesame!YLTotExp","v":0},null,{"$f":"+Sesame!YPrice","v":0},{"$f":"+Sesame!Unit","v":"Pound"},0,0,0,null,{"$f":"+Sesame!YVarRet","v":0},{"$f":"+Sesame!YTVarRet","v":0},{"$f":"+Sesame!YLVarRet","v":0},null,{"$f":"+Sesame!YVarExp","v":0},{"$f":"+Sesame!YTVarExp","v":0},{"$f":"+Sesame!YLVarExp","v":0},null,{"$f":"+Sesame!YPrice","v":0},{"$f":"+Sesame!Unit","v":"Pound"},0,0,0]
[{"$f":"+SorghumLCB!A3","v":"Sorghum - Conventional Till-24 Row, Dryland, 72 bu. Yield Goal - Lower Coast"},{"$f":"+SorghumLCB!E7","v":0},{"$f":"+SorghumLCB!YTotRet","v":0},{"$f":"+SorghumLCB!YTTotRet","v":0},{"$f":"+SorghumLCB!YLTotRet","v":0},null,{"$f":"+SorghumLCB!YTotExp","v":0},{"$f":"+SorghumLCB!YTTotExp","v":0},{"$f":"+SorghumLCB!YLTotExp","v":0},null,{"$f":"+SorghumLCB!YPrice","v":0},{"$f":"+SorghumLCB!Unit","v":"Bushel"},0,0,0,null,{"$f":"+SorghumLCB!YVarRet","v":0},{"$f":"+SorghumLCB!YTVarRet","v":0},{"$f":"+SorghumLCB!YLVarRet","v":0},null,{"$f":"+SorghumLCB!YVarExp","v":0},{"$f":"+SorghumLCB!YTVarExp","v":0},{"$f":"+SorghumLCB!YLVarExp","v":0},null,{"$f":"+SorghumLCB!YPrice","v":0},{"$f":"+SorghumLCB!Unit","v":"Bushel"},0,0,0]
[{"$f":"+WheatLCB!A3","v":"Hard Red Spring Wheat, Dryland, 35 bu. Yield Goal - Lower Coast"},{"$f":"+WheatLCB!E7","v":0},{"$f":"+WheatLCB!YTotRet","v":0},{"$f":"+WheatLCB!YTTotRet","v":0},{"$f":"+WheatLCB!YLTotRet","v":0},null,{"$f":"+WheatLCB!YTotExp","v":0},{"$f":"+WheatLCB!YTTotExp","v":0},{"$f":"+WheatLCB!YLTotExp","v":0},null,{"$f":"+WheatLCB!YPrice","v":0},{"$f":"+WheatLCB!Unit","v":"Bushel"},0,0,0,null,{"$f":"+WheatLCB!YVarRet","v":0},{"$f":"+WheatLCB!YTVarRet","v":0},{"$f":"+WheatLCB!YLVarRet","v":0},null,{"$f":"+WheatLCB!YVarExp","v":0},{"$f":"+WheatLCB!YTVarExp","v":0},{"$f":"+WheatLCB!YLVarExp","v":0},null,{"$f":"+WheatLCB!YPrice","v":0},{"$f":"+WheatLCB!Unit","v":"Bushel"},0,0,0]
[{"$f":"+WheatNW!A3","v":"Hard Red Spring Wheat, Dryland, 35 bu. Yield Goal, Northwest - Lower Coast"},{"$f":"+WheatNW!E7","v":0},{"$f":"+WheatNW!YTotRet","v":0},{"$f":"+WheatNW!YTTotRet","v":0},{"$f":"+WheatNW!YLTotRet","v":0},null,{"$f":"+WheatNW!YTotExp","v":0},{"$f":"+WheatNW!YTTotExp","v":0},{"$f":"+WheatNW!YLTotExp","v":0},null,{"$f":"+WheatNW!YPrice","v":0},{"$f":"+WheatNW!Unit","v":"Bushel"},0,0,0,null,{"$f":"+WheatNW!YVarRet","v":0},{"$f":"+WheatNW!YTVarRet","v":0},{"$f":"+WheatNW!YLVarRet","v":0},null,{"$f":"+WheatNW!YVarExp","v":0},{"$f":"+WheatNW!YTVarExp","v":0},{"$f":"+WheatNW!YLVarExp","v":0},null,{"$f":"+WheatNW!YPrice","v":0},{"$f":"+WheatNW!Unit","v":"Bushel"},0,0,0]
[]
["FIELD CROPS - DRYLAND, UPPER COAST"]
[]
[{"$f":"+Corn!A3","v":"Corn - GMO Seed, Conventional Till-12 Row, Dryland, 100 bu. Yield Goal - Upper Coast"},{"$f":"+Corn!E7","v":0},{"$f":"+Corn!YTotRet","v":0},{"$f":"+Corn!YTTotRet","v":0},{"$f":"+Corn!YLTotRet","v":0},null,{"$f":"+Corn!YTotExp","v":0},{"$f":"+Corn!YTTotExp","v":0},{"$f":"+Corn!YLTotExp","v":0},null,{"$f":"+Corn!YPrice","v":0},{"$f":"+Corn!Unit","v":"Bushel"},{"$f":"+IF($K30=0,0,G30/$K30)","v":0},0,0,null,{"$f":"+Corn!YVarRet","v":0},{"$f":"+Corn!YTVarRet","v":0},{"$f":"+Corn!YLVarRet","v":0},null,{"$f":"+Corn!YVarExp","v":0},{"$f":"+Corn!YTVarExp","v":0},{"$f":"+Corn!YLVarExp","v":0},null,{"$f":"+Corn!YPrice","v":0},{"$f":"+Corn!Unit","v":"Bushel"},{"$f":"+IF($K30=0,0,U30/$K30)","v":0},0,0]
[{"$f":"+CottonUCB!A3","v":"Cotton - GMO Seed, Conv. Till-12 Row, Dryland, 900 lb. Yield Goal - Upper Coast"},{"$f":"+CottonUCB!E7","v":0},{"$f":"+CottonUCB!YTotRet","v":0},{"$f":"+CottonUCB!YTTotRet","v":0},{"$f":"+CottonUCB!YLTotRet","v":0},null,{"$f":"+CottonUCB!YTotExp","v":0},{"$f":"+CottonUCB!YTTotExp","v":0},{"$f":"+CottonUCB!YLTotExp","v":0},null,{"$f":"+CottonUCB!YPrice","v":0},{"$f":"+CottonUCB!Unit","v":"Pound"},0,0,0,null,{"$f":"+CottonUCB!YVarRet","v":0},{"$f":"+CottonUCB!YTVarRet","v":0},{"$f":"+CottonUCB!YLVarRet","v":0},null,{"$f":"+CottonUCB!YVarExp","v":0},{"$f":"+CottonUCB!YTVarExp","v":0},{"$f":"+CottonUCB!YLVarExp","v":0},null,{"$f":"+CottonUCB!YPrice","v":0},{"$f":"+CottonUCB!Unit","v":"Pound"},0,0,0]
[{"$f":"+SorghumUCB!A3","v":"Sorghum - Conventional Till-12 Row, Dryland, 90 bu. Yield Goal - Upper Coast"},{"$f":"+SorghumUCB!E7","v":0},{"$f":"+SorghumUCB!YTotRet","v":0},{"$f":"+SorghumUCB!YTTotRet","v":0},{"$f":"+SorghumUCB!YLTotRet","v":0},null,{"$f":"+SorghumUCB!YTotExp","v":0},{"$f":"+SorghumUCB!YTTotExp","v":0},{"$f":"+SorghumUCB!YLTotExp","v":0},null,{"$f":"+SorghumUCB!YPrice","v":0},{"$f":"+SorghumUCB!Unit","v":"Bushel"},0,0,0,null,{"$f":"+SorghumUCB!YVarRet","v":0},{"$f":"+SorghumUCB!YTVarRet","v":0},{"$f":"+SorghumUCB!YLVarRet","v":0},null,{"$f":"+SorghumUCB!YVarExp","v":0},{"$f":"+SorghumUCB!YTVarExp","v":0},{"$f":"+SorghumUCB!YLVarExp","v":0},null,{"$f":"+SorghumUCB!YPrice","v":0},{"$f":"+SorghumUCB!Unit","v":"Bushel"},0,0,0]
[{"$f":"+Soybeans!A3","v":"Soybeans - GMO Seed, Conventional Till-12 Row, Dryland, 30 bu. Yield Goal - Upper Coast"},{"$f":"+Soybeans!E7","v":0},{"$f":"+Soybeans!YTotRet","v":0},{"$f":"+Soybeans!YTTotRet","v":0},{"$f":"+Soybeans!YLTotRet","v":0},null,{"$f":"+Soybeans!YTotExp","v":0},{"$f":"+Soybeans!YTTotExp","v":0},{"$f":"+Soybeans!YLTotExp","v":0},null,{"$f":"+Soybeans!YPrice","v":0},{"$f":"+Soybeans!Unit","v":"Bushel"},0,0,0,null,{"$f":"+Soybeans!YVarRet","v":0},{"$f":"+Soybeans!YTVarRet","v":0},{"$f":"+Soybeans!YLVarRet","v":0},null,{"$f":"+Soybeans!YVarExp","v":0},{"$f":"+Soybeans!YTVarExp","v":0},{"$f":"+Soybeans!YLVarExp","v":0},null,{"$f":"+Soybeans!YPrice","v":0},{"$f":"+Soybeans!Unit","v":"Bushel"},0,0,0]
[{"$f":"+WheatUCB!A3","v":"Soft Red Winter Wheat, 45 bu. Yield Goal - Upper Coast"},{"$f":"+WheatUCB!E7","v":0},{"$f":"+WheatUCB!YTotRet","v":0},{"$f":"+WheatUCB!YTTotRet","v":0},{"$f":"+WheatUCB!YLTotRet","v":0},null,{"$f":"+WheatUCB!YTotExp","v":0},{"$f":"+WheatUCB!YTTotExp","v":0},{"$f":"+WheatUCB!YLTotExp","v":0},null,{"$f":"+WheatUCB!YPrice","v":0},{"$f":"+WheatUCB!Unit","v":"Bushel"},0,0,0,null,{"$f":"+WheatUCB!YVarRet","v":0},{"$f":"+WheatUCB!YTVarRet","v":0},{"$f":"+WheatUCB!YLVarRet","v":0},null,{"$f":"+WheatUCB!YVarExp","v":0},{"$f":"+WheatUCB!YTVarExp","v":0},{"$f":"+WheatUCB!YLVarExp","v":0},null,{"$f":"+WheatUCB!YPrice","v":0},{"$f":"+WheatUCB!Unit","v":"Bushel"},0,0,0]
[]
["FIELD CROPS - RICE"]
[]
[{"$f":"+RiceFirstCrop!A3","v":"Rice West of Houston, 1st Crop, Surface Water"},{"$f":"+RiceFirstCrop!E7","v":0},{"$f":"+RiceFirstCrop!YTotRet","v":0},{"$f":"+RiceFirstCrop!YTTotRet","v":0},{"$f":"+RiceFirstCrop!YLTotRet","v":0},null,{"$f":"+RiceFirstCrop!YTotExp","v":0},{"$f":"+RiceFirstCrop!YTTotExp","v":0},{"$f":"+RiceFirstCrop!YLTotExp","v":0},null,{"$f":"+RiceFirstCrop!YPrice","v":0},{"$f":"+RiceFirstCrop!Unit","v":"CWT"},{"$f":"+IF($K38=0,0,G38/$K38)","v":0},0,0,null,{"$f":"+RiceFirstCrop!YVarRet","v":0},{"$f":"+RiceFirstCrop!YTVarRet","v":0},{"$f":"+RiceFirstCrop!YLVarRet","v":0},null,{"$f":"+RiceFirstCrop!YVarExp","v":0},{"$f":"+RiceFirstCrop!YTVarExp","v":0},{"$f":"+RiceFirstCrop!YLVarExp","v":0},null,{"$f":"+RiceFirstCrop!YPrice","v":0},{"$f":"+RiceFirstCrop!Unit","v":"CWT"},{"$f":"+IF($K38=0,0,U38/$K38)","v":0},0,0]
[{"$f":"+RiceSecondCrop!A3","v":"Rice West of Houston, 2nd Crop, Surface Water"},{"$f":"+RiceSecondCrop!E7","v":0},{"$f":"+RiceSecondCrop!YTotRet","v":0},{"$f":"+RiceSecondCrop!YTTotRet","v":0},{"$f":"+RiceSecondCrop!YLTotRet","v":0},null,{"$f":"+RiceSecondCrop!YTotExp","v":0},{"$f":"+RiceSecondCrop!YTTotExp","v":0},{"$f":"+RiceSecondCrop!YLTotExp","v":0},null,{"$f":"+RiceSecondCrop!YPrice","v":0},{"$f":"+RiceSecondCrop!Unit","v":"CWT"},0,0,0,null,{"$f":"+RiceSecondCrop!YVarRet","v":0},{"$f":"+RiceSecondCrop!YTVarRet","v":0},{"$f":"+RiceSecondCrop!YLVarRet","v":0},null,{"$f":"+RiceSecondCrop!YVarExp","v":0},{"$f":"+RiceSecondCrop!YTVarExp","v":0},{"$f":"+RiceSecondCrop!YLVarExp","v":0},null,{"$f":"+RiceSecondCrop!YPrice","v":0},{"$f":"+RiceSecondCrop!Unit","v":"CWT"},0,0,0]
[]
["LIVESTOCK"]
[]
[{"$f":"+CowCalf!A3","v":"Cow-Calf Improved Pasture"},{"$f":"+CowCalf!E7","v":0},{"$f":"+CowCalf!YTotRet","v":0},null,null,null,{"$f":"+CowCalf!YTotExp","v":0},null,null,null,{"$f":"+CowCalf!YPrice","v":{"$error":"#NAME?"}},{"$f":"+CowCalf!Unit","v":"CWT"},{"$f":"+IF($K43=0,0,G43/$K43)","v":{"$error":"#NAME?"}},null,null,null,{"$f":"+CowCalf!YVarRet","v":0},null,null,null,{"$f":"+CowCalf!YVarExp","v":0},null,null,null,{"$f":"+CowCalf!YPrice","v":{"$error":"#NAME?"}},{"$f":"+CowCalf!Unit","v":"CWT"},{"$f":"+IF($K43=0,0,U43/$K43)","v":{"$error":"#NAME?"}}]
[{"$f":"+StockersSummer!A3","v":"Summer Stocker Calf Budget (160 Days Grazing)"},{"$f":"+StockersSummer!E7","v":0},{"$f":"+StockersSummer!YTotRet","v":0},null,null,null,{"$f":"+StockersSummer!YTotExp","v":0},null,null,null,{"$f":"+StockersSummer!YPrice","v":0},{"$f":"+StockersSummer!Unit","v":"CWT"},{"$f":"+IF($K44=0,0,G44/$K44)","v":0},null,null,null,{"$f":"+StockersSummer!YVarRet","v":0},null,null,null,{"$f":"+StockersSummer!YVarExp","v":0},null,null,null,{"$f":"+StockersSummer!YPrice","v":0},{"$f":"+StockersSummer!Unit","v":"CWT"},0]
[{"$f":"+StockerWinter!A3","v":"Winter Stocker Calf Budget (110 Says Grazing)"},{"$f":"+StockerWinter!E7","v":0},{"$f":"+StockerWinter!YTotRet","v":0},null,null,null,{"$f":"+StockerWinter!YTotExp","v":0},null,null,null,{"$f":"+StockerWinter!YPrice","v":0},{"$f":"+StockerWinter!Unit","v":"CWT"},{"$f":"+IF($K45=0,0,G45/$K45)","v":0},null,null,null,{"$f":"+StockerWinter!YVarRet","v":0},null,null,null,{"$f":"+StockerWinter!YVarExp","v":0},null,null,null,{"$f":"+StockerWinter!YPrice","v":0},{"$f":"+StockerWinter!Unit","v":"CWT"},0]
[]
[]
[]
[]
[]
[]
[]
[]
[]
[]
[null,null,null,null,null,null,null,null,null,null,null,null,null,null,{"$f":"+IF($K16=0,0,I16/$K16)","v":0}]
[]
[]
[]
[null,null,null,null,null,null,null,null,null,null,null,null,null,null,{"$f":"+IF($K43=0,0,I43/$K43)","v":{"$error":"#NAME?"}}]
[null,null,null,null,null,null,null,null,null,null,null,null,null,null,{"$f":"+IF($K44=0,0,I44/$K44)","v":0}]
[null,null,null,null,null,null,null,null,null,null,null,null,null,null,{"$f":"+IF($K45=0,0,I45/$K45)","v":0}]